mesos-builds mailing list archives

Site index · List index
Message view « Date » · « Thread »
Top « Date » · « Thread »
From Apache Jenkins Server <jenk...@builds.apache.org>
Subject Build failed in Jenkins: Mesos-Buildbot » autotools,gcc,--verbose --enable-libevent --enable-ssl,GLOG_v=1 MESOS_VERBOSE=1,centos:7,(ubuntu)&&(!ubuntu-us1)&&(!ubuntu-eu2) #3850
Date Thu, 29 Jun 2017 10:42:15 GMT
See <https://builds.apache.org/job/Mesos-Buildbot/BUILDTOOL=autotools,COMPILER=gcc,CONFIGURATION=--verbose%20--enable-libevent%20--enable-ssl,ENVIRONMENT=GLOG_v=1%20MESOS_VERBOSE=1,OS=centos%3A7,label_exp=(ubuntu)&&(!ubuntu-us1)&&(!ubuntu-eu2)/3850/display/redirect?page=changes>

Changes:

[vinodkone] Fixed parameters in JNI call for disconnected event.

[vinodkone] Logged operator API subscribed removal.

[bmahler] Fixed a regression in support/apply-reviews.py.

------------------------------------------
[...truncated 30.55 MB...]
I0629 10:42:03.122364 26312 http.cpp:1114] HTTP GET for /slave(773)/containers from 172.17.0.3:58649
I0629 10:42:03.122469 26312 http.cpp:935] Authorizing principal 'test-principal' to GET the
'/containers' endpoint
I0629 10:42:03.125682 26319 slave.cpp:818] Agent terminating
[       OK ] Endpoint/SlaveEndpointTest.AuthorizedRequest/2 (36 ms)
[ RUN      ] Endpoint/SlaveEndpointTest.UnauthorizedRequest/0
I0629 10:42:03.139896  8000 containerizer.cpp:230] Using isolation: posix/cpu,posix/mem,filesystem/posix,network/cni,environment_secret
W0629 10:42:03.140504  8000 backend.cpp:76] Failed to create 'aufs' backend: AufsBackend requires
root privileges
W0629 10:42:03.140641  8000 backend.cpp:76] Failed to create 'bind' backend: BindBackend requires
root privileges
I0629 10:42:03.140687  8000 provisioner.cpp:255] Using default backend 'copy'
I0629 10:42:03.144539 26304 slave.cpp:249] Mesos agent started on (774)@172.17.0.3:57554
I0629 10:42:03.144599 26304 slave.cpp:250] Flags at startup: --acls="" --appc_simple_discovery_uri_prefix="http://"
--appc_store_dir="/tmp/Endpoint_SlaveEndpointTest_UnauthorizedRequest_0_ogp7tN/store/appc"
--authenticate_http_executors="true" --authenticate_http_readonly="true" --authenticate_http_readwrite="true"
--authenticatee="crammd5" --authentication_backoff_factor="1secs" --authorizer="local" --cgroups_cpu_enable_pids_and_tids_count="false"
--cgroups_enable_cfs="false" --cgroups_hierarchy="/sys/fs/cgroup" --cgroups_limit_swap="false"
--cgroups_root="mesos" --container_disk_watch_interval="15secs" --containerizers="mesos" --credential="/tmp/Endpoint_SlaveEndpointTest_UnauthorizedRequest_0_ogp7tN/credential"
--default_role="*" --disk_watch_interval="1mins" --docker="docker" --docker_kill_orphans="true"
--docker_registry="https://registry-1.docker.io" --docker_remove_delay="6hrs" --docker_socket="/var/run/docker.sock"
--docker_stop_timeout="0ns" --docker_store_dir="/tmp/Endpoint_SlaveEndpointTest_UnauthorizedRequest_0_ogp7tN/store/docker"
--docker_volume_checkpoint_dir="/var/run/mesos/isolators/docker/volume" --enforce_container_disk_quota="false"
--executor_registration_timeout="1mins" --executor_reregistration_timeout="2secs" --executor_secret_key="/tmp/Endpoint_SlaveEndpointTest_UnauthorizedRequest_0_ogp7tN/executor_secret_key"
--executor_shutdown_grace_period="5secs" --fetcher_cache_dir="/tmp/Endpoint_SlaveEndpointTest_UnauthorizedRequest_0_ogp7tN/fetch"
--fetcher_cache_size="2GB" --frameworks_home="" --gc_delay="1weeks" --gc_disk_headroom="0.1"
--hadoop_home="" --help="false" --hostname_lookup="true" --http_command_executor="false" --http_credentials="/tmp/Endpoint_SlaveEndpointTest_UnauthorizedRequest_0_ogp7tN/http_credentials"
--http_heartbeat_interval="30secs" --initialize_driver_logging="true" --isolation="posix/cpu,posix/mem"
--launcher="posix" --launcher_dir="/mesos/mesos-1.4.0/_build/src" --logbufsecs="0" --logging_level="INFO"
--max_completed_executors_per_framework="150" --oversubscribed_resources_interval="15secs"
--perf_duration="10secs" --perf_interval="1mins" --port="5051" --qos_correction_interval_min="0ns"
--quiet="false" --recover="reconnect" --recovery_timeout="15mins" --registration_backoff_factor="10ms"
--resources="cpus:2;gpus:0;mem:1024;disk:1024;ports:[31000-32000]" --revocable_cpu_low_priority="true"
--runtime_dir="/tmp/Endpoint_SlaveEndpointTest_UnauthorizedRequest_0_ogp7tN" --sandbox_directory="/mnt/mesos/sandbox"
--strict="true" --switch_user="true" --systemd_enable_support="true" --systemd_runtime_directory="/run/systemd/system"
--version="false" --work_dir="/tmp/Endpoint_SlaveEndpointTest_UnauthorizedRequest_0_Wg3tkM"
I0629 10:42:03.145007 26304 credentials.hpp:86] Loading credential for authentication from
'/tmp/Endpoint_SlaveEndpointTest_UnauthorizedRequest_0_ogp7tN/credential'
I0629 10:42:03.145150 26304 slave.cpp:282] Agent using credential for: test-principal
I0629 10:42:03.145170 26304 credentials.hpp:37] Loading credentials for authentication from
'/tmp/Endpoint_SlaveEndpointTest_UnauthorizedRequest_0_ogp7tN/http_credentials'
I0629 10:42:03.145431 26304 http.cpp:974] Creating default 'basic' HTTP authenticator for
realm 'mesos-agent-executor'
I0629 10:42:03.145575 26304 http.cpp:995] Creating default 'jwt' HTTP authenticator for realm
'mesos-agent-executor'
I0629 10:42:03.146178 26304 http.cpp:974] Creating default 'basic' HTTP authenticator for
realm 'mesos-agent-readonly'
I0629 10:42:03.146324 26304 http.cpp:995] Creating default 'jwt' HTTP authenticator for realm
'mesos-agent-readonly'
I0629 10:42:03.146760 26304 http.cpp:974] Creating default 'basic' HTTP authenticator for
realm 'mesos-agent-readwrite'
I0629 10:42:03.146898 26304 http.cpp:995] Creating default 'jwt' HTTP authenticator for realm
'mesos-agent-readwrite'
I0629 10:42:03.148558 26304 slave.cpp:553] Agent resources: [{"name":"cpus","scalar":{"value":2.0},"type":"SCALAR"},{"name":"mem","scalar":{"value":1024.0},"type":"SCALAR"},{"name":"disk","scalar":{"value":1024.0},"type":"SCALAR"},{"name":"ports","ranges":{"range":[{"begin":31000,"end":32000}]},"type":"RANGES"}]
I0629 10:42:03.148862 26304 slave.cpp:561] Agent attributes: [  ]
I0629 10:42:03.148880 26304 slave.cpp:566] Agent hostname: abe23e26953c
I0629 10:42:03.149034 26310 status_update_manager.cpp:177] Pausing sending status updates
I0629 10:42:03.151018 26317 state.cpp:64] Recovering state from '/tmp/Endpoint_SlaveEndpointTest_UnauthorizedRequest_0_Wg3tkM/meta'
I0629 10:42:03.151387 26305 status_update_manager.cpp:203] Recovering status update manager
I0629 10:42:03.151773 26316 containerizer.cpp:582] Recovering containerizer
I0629 10:42:03.153735 26319 provisioner.cpp:416] Provisioner recovery complete
I0629 10:42:03.154222 26316 slave.cpp:6168] Finished recovery
I0629 10:42:03.154935 26316 slave.cpp:6350] Querying resource estimator for oversubscribable
resources
I0629 10:42:03.155256 26306 slave.cpp:6364] Received oversubscribable resources {} from the
resource estimator
I0629 10:42:03.158444 26307 process.cpp:3779] Handling HTTP event for process 'slave(774)'
with path: '/slave(774)/monitor/statistics'
I0629 10:42:03.160183 26316 http.cpp:1114] HTTP GET for /slave(774)/monitor/statistics from
172.17.0.3:58650
I0629 10:42:03.160257 26316 http.cpp:935] Authorizing principal 'test-principal' to GET the
'/monitor/statistics' endpoint
I0629 10:42:03.163388 26314 slave.cpp:818] Agent terminating
[       OK ] Endpoint/SlaveEndpointTest.UnauthorizedRequest/0 (37 ms)
[ RUN      ] Endpoint/SlaveEndpointTest.UnauthorizedRequest/1
I0629 10:42:03.177783  8000 containerizer.cpp:230] Using isolation: posix/cpu,posix/mem,filesystem/posix,network/cni,environment_secret
W0629 10:42:03.178496  8000 backend.cpp:76] Failed to create 'aufs' backend: AufsBackend requires
root privileges
W0629 10:42:03.178640  8000 backend.cpp:76] Failed to create 'bind' backend: BindBackend requires
root privileges
I0629 10:42:03.178690  8000 provisioner.cpp:255] Using default backend 'copy'
I0629 10:42:03.182976 26318 slave.cpp:249] Mesos agent started on (775)@172.17.0.3:57554
I0629 10:42:03.183009 26318 slave.cpp:250] Flags at startup: --acls="" --appc_simple_discovery_uri_prefix="http://"
--appc_store_dir="/tmp/Endpoint_SlaveEndpointTest_UnauthorizedRequest_1_sH5BrS/store/appc"
--authenticate_http_executors="true" --authenticate_http_readonly="true" --authenticate_http_readwrite="true"
--authenticatee="crammd5" --authentication_backoff_factor="1secs" --authorizer="local" --cgroups_cpu_enable_pids_and_tids_count="false"
--cgroups_enable_cfs="false" --cgroups_hierarchy="/sys/fs/cgroup" --cgroups_limit_swap="false"
--cgroups_root="mesos" --container_disk_watch_interval="15secs" --containerizers="mesos" --credential="/tmp/Endpoint_SlaveEndpointTest_UnauthorizedRequest_1_sH5BrS/credential"
--default_role="*" --disk_watch_interval="1mins" --docker="docker" --docker_kill_orphans="true"
--docker_registry="https://registry-1.docker.io" --docker_remove_delay="6hrs" --docker_socket="/var/run/docker.sock"
--docker_stop_timeout="0ns" --docker_store_dir="/tmp/Endpoint_SlaveEndpointTest_UnauthorizedRequest_1_sH5BrS/store/docker"
--docker_volume_checkpoint_dir="/var/run/mesos/isolators/docker/volume" --enforce_container_disk_quota="false"
--executor_registration_timeout="1mins" --executor_reregistration_timeout="2secs" --executor_secret_key="/tmp/Endpoint_SlaveEndpointTest_UnauthorizedRequest_1_sH5BrS/executor_secret_key"
--executor_shutdown_grace_period="5secs" --fetcher_cache_dir="/tmp/Endpoint_SlaveEndpointTest_UnauthorizedRequest_1_sH5BrS/fetch"
--fetcher_cache_size="2GB" --frameworks_home="" --gc_delay="1weeks" --gc_disk_headroom="0.1"
--hadoop_home="" --help="false" --hostname_lookup="true" --http_command_executor="false" --http_credentials="/tmp/Endpoint_SlaveEndpointTest_UnauthorizedRequest_1_sH5BrS/http_credentials"
--http_heartbeat_interval="30secs" --initialize_driver_logging="true" --isolation="posix/cpu,posix/mem"
--launcher="posix" --launcher_dir="/mesos/mesos-1.4.0/_build/src" --logbufsecs="0" --logging_level="INFO"
--max_completed_executors_per_framework="150" --oversubscribed_resources_interval="15secs"
--perf_duration="10secs" --perf_interval="1mins" --port="5051" --qos_correction_interval_min="0ns"
--quiet="false" --recover="reconnect" --recovery_timeout="15mins" --registration_backoff_factor="10ms"
--resources="cpus:2;gpus:0;mem:1024;disk:1024;ports:[31000-32000]" --revocable_cpu_low_priority="true"
--runtime_dir="/tmp/Endpoint_SlaveEndpointTest_UnauthorizedRequest_1_sH5BrS" --sandbox_directory="/mnt/mesos/sandbox"
--strict="true" --switch_user="true" --systemd_enable_support="true" --systemd_runtime_directory="/run/systemd/system"
--version="false" --work_dir="/tmp/Endpoint_SlaveEndpointTest_UnauthorizedRequest_1_il6ObR"
I0629 10:42:03.183652 26318 credentials.hpp:86] Loading credential for authentication from
'/tmp/Endpoint_SlaveEndpointTest_UnauthorizedRequest_1_sH5BrS/credential'
I0629 10:42:03.183876 26318 slave.cpp:282] Agent using credential for: test-principal
I0629 10:42:03.183909 26318 credentials.hpp:37] Loading credentials for authentication from
'/tmp/Endpoint_SlaveEndpointTest_UnauthorizedRequest_1_sH5BrS/http_credentials'
I0629 10:42:03.184326 26318 http.cpp:974] Creating default 'basic' HTTP authenticator for
realm 'mesos-agent-executor'
I0629 10:42:03.184492 26318 http.cpp:995] Creating default 'jwt' HTTP authenticator for realm
'mesos-agent-executor'
I0629 10:42:03.184789 26318 http.cpp:974] Creating default 'basic' HTTP authenticator for
realm 'mesos-agent-readonly'
I0629 10:42:03.184940 26318 http.cpp:995] Creating default 'jwt' HTTP authenticator for realm
'mesos-agent-readonly'
I0629 10:42:03.185251 26318 http.cpp:974] Creating default 'basic' HTTP authenticator for
realm 'mesos-agent-readwrite'
I0629 10:42:03.185395 26318 http.cpp:995] Creating default 'jwt' HTTP authenticator for realm
'mesos-agent-readwrite'
I0629 10:42:03.186816 26318 slave.cpp:553] Agent resources: [{"name":"cpus","scalar":{"value":2.0},"type":"SCALAR"},{"name":"mem","scalar":{"value":1024.0},"type":"SCALAR"},{"name":"disk","scalar":{"value":1024.0},"type":"SCALAR"},{"name":"ports","ranges":{"range":[{"begin":31000,"end":32000}]},"type":"RANGES"}]
I0629 10:42:03.187042 26318 slave.cpp:561] Agent attributes: [  ]
I0629 10:42:03.187063 26318 slave.cpp:566] Agent hostname: abe23e26953c
I0629 10:42:03.187211 26317 status_update_manager.cpp:177] Pausing sending status updates
I0629 10:42:03.188971 26306 state.cpp:64] Recovering state from '/tmp/Endpoint_SlaveEndpointTest_UnauthorizedRequest_1_il6ObR/meta'
I0629 10:42:03.189271 26312 status_update_manager.cpp:203] Recovering status update manager
I0629 10:42:03.189604 26308 containerizer.cpp:582] Recovering containerizer
I0629 10:42:03.191026 26315 provisioner.cpp:416] Provisioner recovery complete
I0629 10:42:03.191433 26307 slave.cpp:6168] Finished recovery
I0629 10:42:03.191908 26307 slave.cpp:6350] Querying resource estimator for oversubscribable
resources
I0629 10:42:03.192178 26309 slave.cpp:6364] Received oversubscribable resources {} from the
resource estimator
I0629 10:42:03.194794 26315 process.cpp:3779] Handling HTTP event for process 'slave(775)'
with path: '/slave(775)/monitor/statistics.json'
I0629 10:42:03.197021 26314 http.cpp:1114] HTTP GET for /slave(775)/monitor/statistics.json
from 172.17.0.3:58652
I0629 10:42:03.197089 26314 http.cpp:935] Authorizing principal 'test-principal' to GET the
'/monitor/statistics.json' endpoint
I0629 10:42:03.200372 26312 slave.cpp:818] Agent terminating
[       OK ] Endpoint/SlaveEndpointTest.UnauthorizedRequest/1 (35 ms)
[ RUN      ] Endpoint/SlaveEndpointTest.UnauthorizedRequest/2
I0629 10:42:03.214046  8000 containerizer.cpp:230] Using isolation: posix/cpu,posix/mem,filesystem/posix,network/cni,environment_secret
W0629 10:42:03.214678  8000 backend.cpp:76] Failed to create 'aufs' backend: AufsBackend requires
root privileges
W0629 10:42:03.214800  8000 backend.cpp:76] Failed to create 'bind' backend: BindBackend requires
root privileges
I0629 10:42:03.214850  8000 provisioner.cpp:255] Using default backend 'copy'
I0629 10:42:03.218786 26317 slave.cpp:249] Mesos agent started on (776)@172.17.0.3:57554
I0629 10:42:03.218806 26317 slave.cpp:250] Flags at startup: --acls="" --appc_simple_discovery_uri_prefix="http://"
--appc_store_dir="/tmp/Endpoint_SlaveEndpointTest_UnauthorizedRequest_2_YXJPMX/store/appc"
--authenticate_http_executors="true" --authenticate_http_readonly="true" --authenticate_http_readwrite="true"
--authenticatee="crammd5" --authentication_backoff_factor="1secs" --authorizer="local" --cgroups_cpu_enable_pids_and_tids_count="false"
--cgroups_enable_cfs="false" --cgroups_hierarchy="/sys/fs/cgroup" --cgroups_limit_swap="false"
--cgroups_root="mesos" --container_disk_watch_interval="15secs" --containerizers="mesos" --credential="/tmp/Endpoint_SlaveEndpointTest_UnauthorizedRequest_2_YXJPMX/credential"
--default_role="*" --disk_watch_interval="1mins" --docker="docker" --docker_kill_orphans="true"
--docker_registry="https://registry-1.docker.io" --docker_remove_delay="6hrs" --docker_socket="/var/run/docker.sock"
--docker_stop_timeout="0ns" --docker_store_dir="/tmp/Endpoint_SlaveEndpointTest_UnauthorizedRequest_2_YXJPMX/store/docker"
--docker_volume_checkpoint_dir="/var/run/mesos/isolators/docker/volume" --enforce_container_disk_quota="false"
--executor_registration_timeout="1mins" --executor_reregistration_timeout="2secs" --executor_secret_key="/tmp/Endpoint_SlaveEndpointTest_UnauthorizedRequest_2_YXJPMX/executor_secret_key"
--executor_shutdown_grace_period="5secs" --fetcher_cache_dir="/tmp/Endpoint_SlaveEndpointTest_UnauthorizedRequest_2_YXJPMX/fetch"
--fetcher_cache_size="2GB" --frameworks_home="" --gc_delay="1weeks" --gc_disk_headroom="0.1"
--hadoop_home="" --help="false" --hostname_lookup="true" --http_command_executor="false" --http_credentials="/tmp/Endpoint_SlaveEndpointTest_UnauthorizedRequest_2_YXJPMX/http_credentials"
--http_heartbeat_interval="30secs" --initialize_driver_logging="true" --isolation="posix/cpu,posix/mem"
--launcher="posix" --launcher_dir="/mesos/mesos-1.4.0/_build/src" --logbufsecs="0" --logging_level="INFO"
--max_completed_executors_per_framework="150" --oversubscribed_resources_interval="15secs"
--perf_duration="10secs" --perf_interval="1mins" --port="5051" --qos_correction_interval_min="0ns"
--quiet="false" --recover="reconnect" --recovery_timeout="15mins" --registration_backoff_factor="10ms"
--resources="cpus:2;gpus:0;mem:1024;disk:1024;ports:[31000-32000]" --revocable_cpu_low_priority="true"
--runtime_dir="/tmp/Endpoint_SlaveEndpointTest_UnauthorizedRequest_2_YXJPMX" --sandbox_directory="/mnt/mesos/sandbox"
--strict="true" --switch_user="true" --systemd_enable_support="true" --systemd_runtime_directory="/run/systemd/system"
--version="false" --work_dir="/tmp/Endpoint_SlaveEndpointTest_UnauthorizedRequest_2_ebj9qW"
I0629 10:42:03.219183 26317 credentials.hpp:86] Loading credential for authentication from
'/tmp/Endpoint_SlaveEndpointTest_UnauthorizedRequest_2_YXJPMX/credential'
I0629 10:42:03.219372 26317 slave.cpp:282] Agent using credential for: test-principal
I0629 10:42:03.219398 26317 credentials.hpp:37] Loading credentials for authentication from
'/tmp/Endpoint_SlaveEndpointTest_UnauthorizedRequest_2_YXJPMX/http_credentials'
I0629 10:42:03.219758 26317 http.cpp:974] Creating default 'basic' HTTP authenticator for
realm 'mesos-agent-executor'
I0629 10:42:03.219894 26317 http.cpp:995] Creating default 'jwt' HTTP authenticator for realm
'mesos-agent-executor'
I0629 10:42:03.220152 26317 http.cpp:974] Creating default 'basic' HTTP authenticator for
realm 'mesos-agent-readonly'
I0629 10:42:03.220265 26317 http.cpp:995] Creating default 'jwt' HTTP authenticator for realm
'mesos-agent-readonly'
I0629 10:42:03.220572 26317 http.cpp:974] Creating default 'basic' HTTP authenticator for
realm 'mesos-agent-readwrite'
I0629 10:42:03.220670 26317 http.cpp:995] Creating default 'jwt' HTTP authenticator for realm
'mesos-agent-readwrite'
I0629 10:42:03.222101 26317 slave.cpp:553] Agent resources: [{"name":"cpus","scalar":{"value":2.0},"type":"SCALAR"},{"name":"mem","scalar":{"value":1024.0},"type":"SCALAR"},{"name":"disk","scalar":{"value":1024.0},"type":"SCALAR"},{"name":"ports","ranges":{"range":[{"begin":31000,"end":32000}]},"type":"RANGES"}]
I0629 10:42:03.222322 26317 slave.cpp:561] Agent attributes: [  ]
I0629 10:42:03.222335 26317 slave.cpp:566] Agent hostname: abe23e26953c
I0629 10:42:03.222465 26306 status_update_manager.cpp:177] Pausing sending status updates
I0629 10:42:03.224616 26316 state.cpp:64] Recovering state from '/tmp/Endpoint_SlaveEndpointTest_UnauthorizedRequest_2_ebj9qW/meta'
I0629 10:42:03.225294 26310 status_update_manager.cpp:203] Recovering status update manager
I0629 10:42:03.225620 26305 containerizer.cpp:582] Recovering containerizer
I0629 10:42:03.227504 26311 provisioner.cpp:416] Provisioner recovery complete
I0629 10:42:03.228016 26307 slave.cpp:6168] Finished recovery
I0629 10:42:03.228503 26307 slave.cpp:6350] Querying resource estimator for oversubscribable
resources
I0629 10:42:03.228801 26316 slave.cpp:6364] Received oversubscribable resources {} from the
resource estimator
I0629 10:42:03.231428 26310 process.cpp:3779] Handling HTTP event for process 'slave(776)'
with path: '/slave(776)/containers'
I0629 10:42:03.233906 26318 http.cpp:1114] HTTP GET for /slave(776)/containers from 172.17.0.3:58653
I0629 10:42:03.233994 26318 http.cpp:935] Authorizing principal 'test-principal' to GET the
'/containers' endpoint
I0629 10:42:03.236820 26307 slave.cpp:818] Agent terminating
[       OK ] Endpoint/SlaveEndpointTest.UnauthorizedRequest/2 (37 ms)
[ RUN      ] Endpoint/SlaveEndpointTest.NoAuthorizer/0
I0629 10:42:03.252411  8000 containerizer.cpp:230] Using isolation: posix/cpu,posix/mem,filesystem/posix,network/cni,environment_secret
W0629 10:42:03.253032  8000 backend.cpp:76] Failed to create 'aufs' backend: AufsBackend requires
root privileges
W0629 10:42:03.253155  8000 backend.cpp:76] Failed to create 'bind' backend: BindBackend requires
root privileges
I0629 10:42:03.253196  8000 provisioner.cpp:255] Using default backend 'copy'
I0629 10:42:03.255198  8000 cluster.cpp:448] Creating default 'local' authorizer
I0629 10:42:03.256927 26307 slave.cpp:249] Mesos agent started on (777)@172.17.0.3:57554
I0629 10:42:03.256959 26307 slave.cpp:250] Flags at startup: --acls="" --appc_simple_discovery_uri_prefix="http://"
--appc_store_dir="/tmp/Endpoint_SlaveEndpointTest_NoAuthorizer_0_cE9ww3/store/appc" --authenticate_http_executors="true"
--authenticate_http_readonly="true" --authenticate_http_readwrite="true" --authenticatee="crammd5"
--authentication_backoff_factor="1secs" --authorizer="local" --cgroups_cpu_enable_pids_and_tids_count="false"
--cgroups_enable_cfs="false" --cgroups_hierarchy="/sys/fs/cgroup" --cgroups_limit_swap="false"
--cgroups_root="mesos" --container_disk_watch_interval="15secs" --containerizers="mesos" --credential="/tmp/Endpoint_SlaveEndpointTest_NoAuthorizer_0_cE9ww3/credential"
--default_role="*" --disk_watch_interval="1mins" --docker="docker" --docker_kill_orphans="true"
--docker_registry="https://registry-1.docker.io" --docker_remove_delay="6hrs" --docker_socket="/var/run/docker.sock"
--docker_stop_timeout="0ns" --docker_store_dir="/tmp/Endpoint_SlaveEndpointTest_NoAuthorizer_0_cE9ww3/store/docker"
--docker_volume_checkpoint_dir="/var/run/mesos/isolators/docker/volume" --enforce_container_disk_quota="false"
--executor_registration_timeout="1mins" --executor_reregistration_timeout="2secs" --executor_secret_key="/tmp/Endpoint_SlaveEndpointTest_NoAuthorizer_0_cE9ww3/executor_secret_key"
--executor_shutdown_grace_period="5secs" --fetcher_cache_dir="/tmp/Endpoint_SlaveEndpointTest_NoAuthorizer_0_cE9ww3/fetch"
--fetcher_cache_size="2GB" --frameworks_home="" --gc_delay="1weeks" --gc_disk_headroom="0.1"
--hadoop_home="" --help="false" --hostname_lookup="true" --http_command_executor="false" --http_credentials="/tmp/Endpoint_SlaveEndpointTest_NoAuthorizer_0_cE9ww3/http_credentials"
--http_heartbeat_interval="30secs" --initialize_driver_logging="true" --isolation="posix/cpu,posix/mem"
--launcher="posix" --launcher_dir="/mesos/mesos-1.4.0/_build/src" --logbufsecs="0" --logging_level="INFO"
--max_completed_executors_per_framework="150" --oversubscribed_resources_interval="15secs"
--perf_duration="10secs" --perf_interval="1mins" --port="5051" --qos_correction_interval_min="0ns"
--quiet="false" --recover="reconnect" --recovery_timeout="15mins" --registration_backoff_factor="10ms"
--resources="cpus:2;gpus:0;mem:1024;disk:1024;ports:[31000-32000]" --revocable_cpu_low_priority="true"
--runtime_dir="/tmp/Endpoint_SlaveEndpointTest_NoAuthorizer_0_cE9ww3" --sandbox_directory="/mnt/mesos/sandbox"
--strict="true" --switch_user="true" --systemd_enable_support="true" --systemd_runtime_directory="/run/systemd/system"
--version="false" --work_dir="/tmp/Endpoint_SlaveEndpointTest_NoAuthorizer_0_cP7F41"
I0629 10:42:03.257838 26307 credentials.hpp:86] Loading credential for authentication from
'/tmp/Endpoint_SlaveEndpointTest_NoAuthorizer_0_cE9ww3/credential'
I0629 10:42:03.258116 26307 slave.cpp:282] Agent using credential for: test-principal
I0629 10:42:03.258152 26307 credentials.hpp:37] Loading credentials for authentication from
'/tmp/Endpoint_SlaveEndpointTest_NoAuthorizer_0_cE9ww3/http_credentials'
I0629 10:42:03.258544 26307 http.cpp:974] Creating default 'basic' HTTP authenticator for
realm 'mesos-agent-executor'
I0629 10:42:03.258677 26307 http.cpp:995] Creating default 'jwt' HTTP authenticator for realm
'mesos-agent-executor'
I0629 10:42:03.258934 26307 http.cpp:974] Creating default 'basic' HTTP authenticator for
realm 'mesos-agent-readonly'
I0629 10:42:03.259055 26307 http.cpp:995] Creating default 'jwt' HTTP authenticator for realm
'mesos-agent-readonly'
I0629 10:42:03.259281 26307 http.cpp:974] Creating default 'basic' HTTP authenticator for
realm 'mesos-agent-readwrite'
I0629 10:42:03.259371 26307 http.cpp:995] Creating default 'jwt' HTTP authenticator for realm
'mesos-agent-readwrite'
I0629 10:42:03.260646 26307 slave.cpp:553] Agent resources: [{"name":"cpus","scalar":{"value":2.0},"type":"SCALAR"},{"name":"mem","scalar":{"value":1024.0},"type":"SCALAR"},{"name":"disk","scalar":{"value":1024.0},"type":"SCALAR"},{"name":"ports","ranges":{"range":[{"begin":31000,"end":32000}]},"type":"RANGES"}]
I0629 10:42:03.260874 26307 slave.cpp:561] Agent attributes: [  ]
I0629 10:42:03.260888 26307 slave.cpp:566] Agent hostname: abe23e26953c
I0629 10:42:03.261008 26319 status_update_manager.cpp:177] Pausing sending status updates
I0629 10:42:03.262912 26311 state.cpp:64] Recovering state from '/tmp/Endpoint_SlaveEndpointTest_NoAuthorizer_0_cP7F41/meta'
I0629 10:42:03.263396 26304 status_update_manager.cpp:203] Recovering status update manager
I0629 10:42:03.263659 26315 containerizer.cpp:582] Recovering containerizer
I0629 10:42:03.265205 26317 provisioner.cpp:416] Provisioner recovery complete
I0629 10:42:03.265677 26307 slave.cpp:6168] Finished recovery
I0629 10:42:03.266337 26307 slave.cpp:6350] Querying resource estimator for oversubscribable
resources
I0629 10:42:03.266664 26305 slave.cpp:6364] Received oversubscribable resources {} from the
resource estimator
I0629 10:42:03.269062 26311 process.cpp:3779] Handling HTTP event for process 'slave(777)'
with path: '/slave(777)/monitor/statistics'
I0629 10:42:03.271140 26310 http.cpp:1114] HTTP GET for /slave(777)/monitor/statistics from
172.17.0.3:58654
I0629 10:42:03.271219 26310 http.cpp:935] Authorizing principal 'test-principal' to GET the
'/monitor/statistics' endpoint
I0629 10:42:03.274289 26318 slave.cpp:818] Agent terminating
[       OK ] Endpoint/SlaveEndpointTest.NoAuthorizer/0 (35 ms)
[ RUN      ] Endpoint/SlaveEndpointTest.NoAuthorizer/1
I0629 10:42:03.285727  8000 containerizer.cpp:230] Using isolation: posix/cpu,posix/mem,filesystem/posix,network/cni,environment_secret
W0629 10:42:03.286360  8000 backend.cpp:76] Failed to create 'aufs' backend: AufsBackend requires
root privileges
W0629 10:42:03.286473  8000 backend.cpp:76] Failed to create 'bind' backend: BindBackend requires
root privileges
I0629 10:42:03.286512  8000 provisioner.cpp:255] Using default backend 'copy'
I0629 10:42:03.288403  8000 cluster.cpp:448] Creating default 'local' authorizer
I0629 10:42:03.289943 26305 slave.cpp:249] Mesos agent started on (778)@172.17.0.3:57554
I0629 10:42:03.289968 26305 slave.cpp:250] Flags at startup: --acls="" --appc_simple_discovery_uri_prefix="http://"
--appc_store_dir="/tmp/Endpoint_SlaveEndpointTest_NoAuthorizer_1_4fx7C9/store/appc" --authenticate_http_executors="true"
--authenticate_http_readonly="true" --authenticate_http_readwrite="true" --authenticatee="crammd5"
--authentication_backoff_factor="1secs" --authorizer="local" --cgroups_cpu_enable_pids_and_tids_count="false"
--cgroups_enable_cfs="false" --cgroups_hierarchy="/sys/fs/cgroup" --cgroups_limit_swap="false"
--cgroups_root="mesos" --container_disk_watch_interval="15secs" --containerizers="mesos" --credential="/tmp/Endpoint_SlaveEndpointTest_NoAuthorizer_1_4fx7C9/credential"
--default_role="*" --disk_watch_interval="1mins" --docker="docker" --docker_kill_orphans="true"
--docker_registry="https://registry-1.docker.io" --docker_remove_delay="6hrs" --docker_socket="/var/run/docker.sock"
--docker_stop_timeout="0ns" --docker_store_dir="/tmp/Endpoint_SlaveEndpointTest_NoAuthorizer_1_4fx7C9/store/docker"
--docker_volume_checkpoint_dir="/var/run/mesos/isolators/docker/volume" --enforce_container_disk_quota="false"
--executor_registration_timeout="1mins" --executor_reregistration_timeout="2secs" --executor_secret_key="/tmp/Endpoint_SlaveEndpointTest_NoAuthorizer_1_4fx7C9/executor_secret_key"
--executor_shutdown_grace_period="5secs" --fetcher_cache_dir="/tmp/Endpoint_SlaveEndpointTest_NoAuthorizer_1_4fx7C9/fetch"
--fetcher_cache_size="2GB" --frameworks_home="" --gc_delay="1weeks" --gc_disk_headroom="0.1"
--hadoop_home="" --help="false" --hostname_lookup="true" --http_command_executor="false" --http_credentials="/tmp/Endpoint_SlaveEndpointTest_NoAuthorizer_1_4fx7C9/http_credentials"
--http_heartbeat_interval="30secs" --initialize_driver_logging="true" --isolation="posix/cpu,posix/mem"
--launcher="posix" --launcher_dir="/mesos/mesos-1.4.0/_build/src" --logbufsecs="0" --logging_level="INFO"
--max_completed_executors_per_framework="150" --oversubscribed_resources_interval="15secs"
--perf_duration="10secs" --perf_interval="1mins" --port="5051" --qos_correction_interval_min="0ns"
--quiet="false" --recover="reconnect" --recovery_timeout="15mins" --registration_backoff_factor="10ms"
--resources="cpus:2;gpus:0;mem:1024;disk:1024;ports:[31000-32000]" --revocable_cpu_low_priority="true"
--runtime_dir="/tmp/Endpoint_SlaveEndpointTest_NoAuthorizer_1_4fx7C9" --sandbox_directory="/mnt/mesos/sandbox"
--strict="true" --switch_user="true" --systemd_enable_support="true" --systemd_runtime_directory="/run/systemd/system"
--version="false" --work_dir="/tmp/Endpoint_SlaveEndpointTest_NoAuthorizer_1_eoxI57"
I0629 10:42:03.290403 26305 credentials.hpp:86] Loading credential for authentication from
'/tmp/Endpoint_SlaveEndpointTest_NoAuthorizer_1_4fx7C9/credential'
I0629 10:42:03.290551 26305 slave.cpp:282] Agent using credential for: test-principal
I0629 10:42:03.290571 26305 credentials.hpp:37] Loading credentials for authentication from
'/tmp/Endpoint_SlaveEndpointTest_NoAuthorizer_1_4fx7C9/http_credentials'
I0629 10:42:03.290844 26305 http.cpp:974] Creating default 'basic' HTTP authenticator for
realm 'mesos-agent-executor'
I0629 10:42:03.290953 26305 http.cpp:995] Creating default 'jwt' HTTP authenticator for realm
'mesos-agent-executor'
I0629 10:42:03.291337 26305 http.cpp:974] Creating default 'basic' HTTP authenticator for
realm 'mesos-agent-readonly'
I0629 10:42:03.291509 26305 http.cpp:995] Creating default 'jwt' HTTP authenticator for realm
'mesos-agent-readonly'
I0629 10:42:03.291800 26305 http.cpp:974] Creating default 'basic' HTTP authenticator for
realm 'mesos-agent-readwrite'
I0629 10:42:03.291945 26305 http.cpp:995] Creating default 'jwt' HTTP authenticator for realm
'mesos-agent-readwrite'
I0629 10:42:03.293725 26305 slave.cpp:553] Agent resources: [{"name":"cpus","scalar":{"value":2.0},"type":"SCALAR"},{"name":"mem","scalar":{"value":1024.0},"type":"SCALAR"},{"name":"disk","scalar":{"value":1024.0},"type":"SCALAR"},{"name":"ports","ranges":{"range":[{"begin":31000,"end":32000}]},"type":"RANGES"}]
I0629 10:42:03.294034 26305 slave.cpp:561] Agent attributes: [  ]
I0629 10:42:03.294052 26305 slave.cpp:566] Agent hostname: abe23e26953c
I0629 10:42:03.294240 26317 status_update_manager.cpp:177] Pausing sending status updates
I0629 10:42:03.296084 26309 state.cpp:64] Recovering state from '/tmp/Endpoint_SlaveEndpointTest_NoAuthorizer_1_eoxI57/meta'
I0629 10:42:03.296430 26308 status_update_manager.cpp:203] Recovering status update manager
I0629 10:42:03.296681 26304 containerizer.cpp:582] Recovering containerizer
I0629 10:42:03.298610 26308 provisioner.cpp:416] Provisioner recovery complete
I0629 10:42:03.299118 26318 slave.cpp:6168] Finished recovery
I0629 10:42:03.299671 26318 slave.cpp:6350] Querying resource estimator for oversubscribable
resources
I0629 10:42:03.299970 26311 slave.cpp:6364] Received oversubscribable resources {} from the
resource estimator
I0629 10:42:03.301784 26314 process.cpp:3779] Handling HTTP event for process 'slave(778)'
with path: '/slave(778)/monitor/statistics.json'
I0629 10:42:03.303382 26316 http.cpp:1114] HTTP GET for /slave(778)/monitor/statistics.json
from 172.17.0.3:58655
I0629 10:42:03.303470 26316 http.cpp:935] Authorizing principal 'test-principal' to GET the
'/monitor/statistics.json' endpoint
I0629 10:42:03.306663 26312 slave.cpp:818] Agent terminating
[       OK ] Endpoint/SlaveEndpointTest.NoAuthorizer/1 (31 ms)
[ RUN      ] Endpoint/SlaveEndpointTest.NoAuthorizer/2
I0629 10:42:03.317423  8000 containerizer.cpp:230] Using isolation: posix/cpu,posix/mem,filesystem/posix,network/cni,environment_secret
W0629 10:42:03.318025  8000 backend.cpp:76] Failed to create 'aufs' backend: AufsBackend requires
root privileges
W0629 10:42:03.318140  8000 backend.cpp:76] Failed to create 'bind' backend: BindBackend requires
root privileges
I0629 10:42:03.318178  8000 provisioner.cpp:255] Using default backend 'copy'
I0629 10:42:03.320197  8000 cluster.cpp:448] Creating default 'local' authorizer
I0629 10:42:03.322095 26308 slave.cpp:249] Mesos agent started on (779)@172.17.0.3:57554
I0629 10:42:03.322118 26308 slave.cpp:250] Flags at startup: --acls="" --appc_simple_discovery_uri_prefix="http://"
--appc_store_dir="/tmp/Endpoint_SlaveEndpointTest_NoAuthorizer_2_MB8B4f/store/appc" --authenticate_http_executors="true"
--authenticate_http_readonly="true" --authenticate_http_readwrite="true" --authenticatee="crammd5"
--authentication_backoff_factor="1secs" --authorizer="local" --cgroups_cpu_enable_pids_and_tids_count="false"
--cgroups_enable_cfs="false" --cgroups_hierarchy="/sys/fs/cgroup" --cgroups_limit_swap="false"
--cgroups_root="mesos" --container_disk_watch_interval="15secs" --containerizers="mesos" --credential="/tmp/Endpoint_SlaveEndpointTest_NoAuthorizer_2_MB8B4f/credential"
--default_role="*" --disk_watch_interval="1mins" --docker="docker" --docker_kill_orphans="true"
--docker_registry="https://registry-1.docker.io" --docker_remove_delay="6hrs" --docker_socket="/var/run/docker.sock"
--docker_stop_timeout="0ns" --docker_store_dir="/tmp/Endpoint_SlaveEndpointTest_NoAuthorizer_2_MB8B4f/store/docker"
--docker_volume_checkpoint_dir="/var/run/mesos/isolators/docker/volume" --enforce_container_disk_quota="false"
--executor_registration_timeout="1mins" --executor_reregistration_timeout="2secs" --executor_secret_key="/tmp/Endpoint_SlaveEndpointTest_NoAuthorizer_2_MB8B4f/executor_secret_key"
--executor_shutdown_grace_period="5secs" --fetcher_cache_dir="/tmp/Endpoint_SlaveEndpointTest_NoAuthorizer_2_MB8B4f/fetch"
--fetcher_cache_size="2GB" --frameworks_home="" --gc_delay="1weeks" --gc_disk_headroom="0.1"
--hadoop_home="" --help="false" --hostname_lookup="true" --http_command_executor="false" --http_credentials="/tmp/Endpoint_SlaveEndpointTest_NoAuthorizer_2_MB8B4f/http_credentials"
--http_heartbeat_interval="30secs" --initialize_driver_logging="true" --isolation="posix/cpu,posix/mem"
--launcher="posix" --launcher_dir="/mesos/mesos-1.4.0/_build/src" --logbufsecs="0" --logging_level="INFO"
--max_completed_executors_per_framework="150" --oversubscribed_resources_interval="15secs"
--perf_duration="10secs" --perf_interval="1mins" --port="5051" --qos_correction_interval_min="0ns"
--quiet="false" --recover="reconnect" --recovery_timeout="15mins" --registration_backoff_factor="10ms"
--resources="cpus:2;gpus:0;mem:1024;disk:1024;ports:[31000-32000]" --revocable_cpu_low_priority="true"
--runtime_dir="/tmp/Endpoint_SlaveEndpointTest_NoAuthorizer_2_MB8B4f" --sandbox_directory="/mnt/mesos/sandbox"
--strict="true" --switch_user="true" --systemd_enable_support="true" --systemd_runtime_directory="/run/systemd/system"
--version="false" --work_dir="/tmp/Endpoint_SlaveEndpointTest_NoAuthorizer_2_uop3re"
I0629 10:42:03.322598 26308 credentials.hpp:86] Loading credential for authentication from
'/tmp/Endpoint_SlaveEndpointTest_NoAuthorizer_2_MB8B4f/credential'
I0629 10:42:03.322790 26308 slave.cpp:282] Agent using credential for: test-principal
I0629 10:42:03.322816 26308 credentials.hpp:37] Loading credentials for authentication from
'/tmp/Endpoint_SlaveEndpointTest_NoAuthorizer_2_MB8B4f/http_credentials'
I0629 10:42:03.323159 26308 http.cpp:974] Creating default 'basic' HTTP authenticator for
realm 'mesos-agent-executor'
I0629 10:42:03.323279 26308 http.cpp:995] Creating default 'jwt' HTTP authenticator for realm
'mesos-agent-executor'
I0629 10:42:03.323547 26308 http.cpp:974] Creating default 'basic' HTTP authenticator for
realm 'mesos-agent-readonly'
I0629 10:42:03.323667 26308 http.cpp:995] Creating default 'jwt' HTTP authenticator for realm
'mesos-agent-readonly'
I0629 10:42:03.323866 26308 http.cpp:974] Creating default 'basic' HTTP authenticator for
realm 'mesos-agent-readwrite'
I0629 10:42:03.323971 26308 http.cpp:995] Creating default 'jwt' HTTP authenticator for realm
'mesos-agent-readwrite'
I0629 10:42:03.325574 26308 slave.cpp:553] Agent resources: [{"name":"cpus","scalar":{"value":2.0},"type":"SCALAR"},{"name":"mem","scalar":{"value":1024.0},"type":"SCALAR"},{"name":"disk","scalar":{"value":1024.0},"type":"SCALAR"},{"name":"ports","ranges":{"range":[{"begin":31000,"end":32000}]},"type":"RANGES"}]
I0629 10:42:03.325803 26308 slave.cpp:561] Agent attributes: [  ]
I0629 10:42:03.325815 26308 slave.cpp:566] Agent hostname: abe23e26953c
I0629 10:42:03.325928 26316 status_update_manager.cpp:177] Pausing sending status updates
I0629 10:42:03.327173 26317 state.cpp:64] Recovering state from '/tmp/Endpoint_SlaveEndpointTest_NoAuthorizer_2_uop3re/meta'
I0629 10:42:03.327440 26319 status_update_manager.cpp:203] Recovering status update manager
I0629 10:42:03.327797 26317 containerizer.cpp:582] Recovering containerizer
I0629 10:42:03.329691 26315 provisioner.cpp:416] Provisioner recovery complete
I0629 10:42:03.330219 26318 slave.cpp:6168] Finished recovery
I0629 10:42:03.330754 26318 slave.cpp:6350] Querying resource estimator for oversubscribable
resources
I0629 10:42:03.331094 26317 slave.cpp:6364] Received oversubscribable resources {} from the
resource estimator
I0629 10:42:03.333184 26315 process.cpp:3779] Handling HTTP event for process 'slave(779)'
with path: '/slave(779)/containers'
I0629 10:42:03.335397 26318 http.cpp:1114] HTTP GET for /slave(779)/containers from 172.17.0.3:58656
I0629 10:42:03.335494 26318 http.cpp:935] Authorizing principal 'test-principal' to GET the
'/containers' endpoint
I0629 10:42:03.339866 26310 slave.cpp:818] Agent terminating
[       OK ] Endpoint/SlaveEndpointTest.NoAuthorizer/2 (34 ms)
[----------] 9 tests from Endpoint/SlaveEndpointTest (325 ms total)

[----------] Global test environment tear-down
[==========] 1619 tests from 179 test cases ran. (600420 ms total)
[  PASSED  ] 1618 tests.
[  FAILED  ] 1 test, listed below:
[  FAILED  ] PersistentVolumeEndpointsTest.ReserveAndSlaveRemoval

 1 FAILED TEST
  YOU HAVE 20 DISABLED TESTS

I0629 10:42:03.406672 26320 process.cpp:968] Failed to accept socket: future discarded
make[4]: *** [check-local] Error 1
make[4]: Leaving directory `/mesos/mesos-1.4.0/_build/src'
make[3]: *** [check-am] Error 2
make[3]: Leaving directory `/mesos/mesos-1.4.0/_build/src'
make[2]: *** [check] Error 2
make[2]: Leaving directory `/mesos/mesos-1.4.0/_build/src'
make[1]: *** [check-recursive] Error 1
make[1]: Leaving directory `/mesos/mesos-1.4.0/_build'
make: *** [distcheck] Error 1
+ docker rmi mesos-1498730094-29101
Untagged: mesos-1498730094-29101:latest
Deleted: sha256:19d88e8d56dfba53860e22e10dc08ba71cb329ffb26375582b8fa8bbb3576d24
Deleted: sha256:f0d48aec555b1edeaf64cc509df52452e8dcea99c83daba406f6d875d59b33f5
Deleted: sha256:408b2e86adb13f49e856de23cc4cca75176569d730bc21ae648099eeb615117f
Deleted: sha256:65d7336e5e3982411d06a02d74621b7426f5ee9b5a89eac277cd33ab7ea7d665
Deleted: sha256:0cfdcd5022c31df1b08443924bdf2a16a97a6a65bad0ea171e80abc4b1e9f4cb
Deleted: sha256:1df9ff391c351b10b677e2b51c7256af239799e74cde91fbc2c22f583d82e054
Deleted: sha256:07a84d3890d35ab05d46acc946f8c4514bb61404654089f7599ebc174ff082a4
Deleted: sha256:2116e742c0b9121d9786e49775d70064fd86dde4f9c7318b1bc225990f4775e0
Deleted: sha256:73e6a441e3da5faca667d0b1b0969883b8a75d1ef407c0fea373d61e14321b87
Deleted: sha256:80a526ccdcf0e6ef84bc6884f20903449ca213c56ede9094e32841a8ee7ee534
Deleted: sha256:f4ca500f8378634111b07ed77968d180a7af8e516b6aa793d2a0b4657ad97d84
Deleted: sha256:81c3f8d3c2a5ac3a71b5913b9bf8e2d2f0aa2bcd69657f83e4171d9a42a23bc4
Deleted: sha256:29387ed5d92e708c2d817b203c9e8b7f4206e992012ab4ce3c6770a88103c0ae
Deleted: sha256:16d926cad970d32dd84dc86dadb2c37a5504060f99d988a3339f63dcc92f443e
Deleted: sha256:2d3a4c4af4918490bb20f4ef9e932561d414ca9060a09291456425914af14a2d
Deleted: sha256:0195721c25d632793a60bd87e30f95ddb32adfd78e868cf04ed79bbbc11299b8
Deleted: sha256:c4018768a484d7432dada342097cefae673eca57aa81d5f8c3908dba414bd8bc
Deleted: sha256:09dd178d2a9952f39cf009c6b0825517dd5f2b773c96cd8a8bc510ece26462f6
Deleted: sha256:8b7526fb1ff9d7a738439ed8ac52664d04dff6faa3969a9c9f5b9feb6744ee67
Deleted: sha256:a62fe9da147436a96e73c317d06fc1982b92f5b5f36aa44ae77b4a1cea53db38
Deleted: sha256:409cf817fda4ed5fb0366e56e196aa44801415b05474547f93c9dffe9023f42d
Deleted: sha256:0e0c951518c8da69549bb0bdef9b49c86fa3193a6e3cd42bd02de7ad81ec02d0
Deleted: sha256:99230e2a96e41947ce3c76d196267161b41068ccfea1a91f408938db2e6b44a7
Deleted: sha256:975d0f3057eaba55b13f52f1eb8ae0b5f7d1584e344c9775078e3a4224c73c88
Deleted: sha256:93eeb7eadc7b52d78b3b6cd215091f7dd712bd3722cf0313f7703a69da34523f
Build step 'Execute shell' marked build as failure
Not sending mail to unregistered user neil.conway@gmail.com

Mime
View raw message