mesos-builds mailing list archives

Site index · List index
Message view « Date » · « Thread »
Top « Date » · « Thread »
From Apache Jenkins Server <jenk...@builds.apache.org>
Subject Build failed in Jenkins: Mesos-Buildbot » autotools,gcc,--verbose,GLOG_v=1 MESOS_VERBOSE=1,centos:7,(ubuntu)&&(!ubuntu-us1)&&(!ubuntu-eu2) #3833
Date Fri, 23 Jun 2017 03:46:05 GMT
See <https://builds.apache.org/job/Mesos-Buildbot/BUILDTOOL=autotools,COMPILER=gcc,CONFIGURATION=--verbose,ENVIRONMENT=GLOG_v=1%20MESOS_VERBOSE=1,OS=centos%3A7,label_exp=(ubuntu)&&(!ubuntu-us1)&&(!ubuntu-eu2)/3833/display/redirect?page=changes>

Changes:

[mpark] Introduced `validateAndUpgradeResources`.

[mpark] Updated the `operator<<` for repeated resources to use `JSON::protobuf`.

[mpark] Relaxed the resource format restriction for frameworks.

[mpark] Fixed `convertResourceFormat` uses with `validateAndUpgradeResources`.

[mpark] Prevented reserve/create with refined reservation on non-capable agents.

[mpark] Removed unused `convertResourceFormat` for `Operation`.

[mpark] Required that resources are always downgraded for a non-capable agent.

[neil.conway] Added test for reservation refinements and old agents.

------------------------------------------
[...truncated 29.24 MB...]
I0623 03:45:54.005168  5938 slave.cpp:249] Mesos agent started on (767)@172.17.0.4:43291
I0623 03:45:54.005193  5938 slave.cpp:250] Flags at startup: --acls="" --appc_simple_discovery_uri_prefix="http://"
--appc_store_dir="/tmp/Endpoint_SlaveEndpointTest_AuthorizedRequest_2_qxKCnJ/store/appc" --authenticate_http_readonly="true"
--authenticate_http_readwrite="true" --authenticatee="crammd5" --authentication_backoff_factor="1secs"
--authorizer="local" --cgroups_cpu_enable_pids_and_tids_count="false" --cgroups_enable_cfs="false"
--cgroups_hierarchy="/sys/fs/cgroup" --cgroups_limit_swap="false" --cgroups_root="mesos" --container_disk_watch_interval="15secs"
--containerizers="mesos" --credential="/tmp/Endpoint_SlaveEndpointTest_AuthorizedRequest_2_qxKCnJ/credential"
--default_role="*" --disk_watch_interval="1mins" --docker="docker" --docker_kill_orphans="true"
--docker_registry="https://registry-1.docker.io" --docker_remove_delay="6hrs" --docker_socket="/var/run/docker.sock"
--docker_stop_timeout="0ns" --docker_store_dir="/tmp/Endpoint_SlaveEndpointTest_AuthorizedRequest_2_qxKCnJ/store/docker"
--docker_volume_checkpoint_dir="/var/run/mesos/isolators/docker/volume" --enforce_container_disk_quota="false"
--executor_registration_timeout="1mins" --executor_reregistration_timeout="2secs" --executor_shutdown_grace_period="5secs"
--fetcher_cache_dir="/tmp/Endpoint_SlaveEndpointTest_AuthorizedRequest_2_qxKCnJ/fetch" --fetcher_cache_size="2GB"
--frameworks_home="" --gc_delay="1weeks" --gc_disk_headroom="0.1" --hadoop_home="" --help="false"
--hostname_lookup="true" --http_command_executor="false" --http_credentials="/tmp/Endpoint_SlaveEndpointTest_AuthorizedRequest_2_qxKCnJ/http_credentials"
--http_heartbeat_interval="30secs" --initialize_driver_logging="true" --isolation="posix/cpu,posix/mem"
--launcher="posix" --launcher_dir="/mesos/mesos-1.4.0/_build/src" --logbufsecs="0" --logging_level="INFO"
--max_completed_executors_per_framework="150" --oversubscribed_resources_interval="15secs"
--perf_duration="10secs" --perf_interval="1mins" --port="5051" --qos_correction_interval_min="0ns"
--quiet="false" --recover="reconnect" --recovery_timeout="15mins" --registration_backoff_factor="10ms"
--resources="cpus:2;gpus:0;mem:1024;disk:1024;ports:[31000-32000]" --revocable_cpu_low_priority="true"
--runtime_dir="/tmp/Endpoint_SlaveEndpointTest_AuthorizedRequest_2_qxKCnJ" --sandbox_directory="/mnt/mesos/sandbox"
--strict="true" --switch_user="true" --systemd_enable_support="true" --systemd_runtime_directory="/run/systemd/system"
--version="false" --work_dir="/tmp/Endpoint_SlaveEndpointTest_AuthorizedRequest_2_ZhRrrB"
I0623 03:45:54.005626  5938 credentials.hpp:86] Loading credential for authentication from
'/tmp/Endpoint_SlaveEndpointTest_AuthorizedRequest_2_qxKCnJ/credential'
I0623 03:45:54.005816  5938 slave.cpp:282] Agent using credential for: test-principal
I0623 03:45:54.005836  5938 credentials.hpp:37] Loading credentials for authentication from
'/tmp/Endpoint_SlaveEndpointTest_AuthorizedRequest_2_qxKCnJ/http_credentials'
I0623 03:45:54.006086  5938 http.cpp:974] Creating default 'basic' HTTP authenticator for
realm 'mesos-agent-readonly'
I0623 03:45:54.006245  5938 http.cpp:974] Creating default 'basic' HTTP authenticator for
realm 'mesos-agent-readwrite'
I0623 03:45:54.007604  5938 slave.cpp:553] Agent resources: [{"name":"cpus","scalar":{"value":2.0},"type":"SCALAR"},{"name":"mem","scalar":{"value":1024.0},"type":"SCALAR"},{"name":"disk","scalar":{"value":1024.0},"type":"SCALAR"},{"name":"ports","ranges":{"range":[{"begin":31000,"end":32000}]},"type":"RANGES"}]
I0623 03:45:54.007798  5938 slave.cpp:561] Agent attributes: [  ]
I0623 03:45:54.007810  5938 slave.cpp:566] Agent hostname: 9ac8a3fc550e
I0623 03:45:54.007971  5932 status_update_manager.cpp:177] Pausing sending status updates
I0623 03:45:54.009033  5955 state.cpp:64] Recovering state from '/tmp/Endpoint_SlaveEndpointTest_AuthorizedRequest_2_ZhRrrB/meta'
I0623 03:45:54.009289  5951 status_update_manager.cpp:203] Recovering status update manager
I0623 03:45:54.009500  5946 containerizer.cpp:582] Recovering containerizer
I0623 03:45:54.010840  5943 provisioner.cpp:416] Provisioner recovery complete
I0623 03:45:54.011270  5936 slave.cpp:6162] Finished recovery
I0623 03:45:54.011787  5936 slave.cpp:6344] Querying resource estimator for oversubscribable
resources
I0623 03:45:54.012040  5940 slave.cpp:6358] Received oversubscribable resources {} from the
resource estimator
I0623 03:45:54.014219  5934 process.cpp:3779] Handling HTTP event for process 'slave(767)'
with path: '/slave(767)/containers'
I0623 03:45:54.015702  5954 http.cpp:1114] HTTP GET for /slave(767)/containers from 172.17.0.4:37356
I0623 03:45:54.015763  5954 http.cpp:935] Authorizing principal 'test-principal' to GET the
'/containers' endpoint
I0623 03:45:54.019812  5940 slave.cpp:818] Agent terminating
[       OK ] Endpoint/SlaveEndpointTest.AuthorizedRequest/2 (29 ms)
[ RUN      ] Endpoint/SlaveEndpointTest.UnauthorizedRequest/0
I0623 03:45:54.029989  5913 containerizer.cpp:230] Using isolation: posix/cpu,posix/mem,filesystem/posix,network/cni,environment_secret
W0623 03:45:54.030673  5913 backend.cpp:76] Failed to create 'aufs' backend: AufsBackend requires
root privileges
W0623 03:45:54.030828  5913 backend.cpp:76] Failed to create 'bind' backend: BindBackend requires
root privileges
I0623 03:45:54.030879  5913 provisioner.cpp:255] Using default backend 'copy'
I0623 03:45:54.034224  5954 slave.cpp:249] Mesos agent started on (768)@172.17.0.4:43291
I0623 03:45:54.034247  5954 slave.cpp:250] Flags at startup: --acls="" --appc_simple_discovery_uri_prefix="http://"
--appc_store_dir="/tmp/Endpoint_SlaveEndpointTest_UnauthorizedRequest_0_2UD7mf/store/appc"
--authenticate_http_readonly="true" --authenticate_http_readwrite="true" --authenticatee="crammd5"
--authentication_backoff_factor="1secs" --authorizer="local" --cgroups_cpu_enable_pids_and_tids_count="false"
--cgroups_enable_cfs="false" --cgroups_hierarchy="/sys/fs/cgroup" --cgroups_limit_swap="false"
--cgroups_root="mesos" --container_disk_watch_interval="15secs" --containerizers="mesos" --credential="/tmp/Endpoint_SlaveEndpointTest_UnauthorizedRequest_0_2UD7mf/credential"
--default_role="*" --disk_watch_interval="1mins" --docker="docker" --docker_kill_orphans="true"
--docker_registry="https://registry-1.docker.io" --docker_remove_delay="6hrs" --docker_socket="/var/run/docker.sock"
--docker_stop_timeout="0ns" --docker_store_dir="/tmp/Endpoint_SlaveEndpointTest_UnauthorizedRequest_0_2UD7mf/store/docker"
--docker_volume_checkpoint_dir="/var/run/mesos/isolators/docker/volume" --enforce_container_disk_quota="false"
--executor_registration_timeout="1mins" --executor_reregistration_timeout="2secs" --executor_shutdown_grace_period="5secs"
--fetcher_cache_dir="/tmp/Endpoint_SlaveEndpointTest_UnauthorizedRequest_0_2UD7mf/fetch" --fetcher_cache_size="2GB"
--frameworks_home="" --gc_delay="1weeks" --gc_disk_headroom="0.1" --hadoop_home="" --help="false"
--hostname_lookup="true" --http_command_executor="false" --http_credentials="/tmp/Endpoint_SlaveEndpointTest_UnauthorizedRequest_0_2UD7mf/http_credentials"
--http_heartbeat_interval="30secs" --initialize_driver_logging="true" --isolation="posix/cpu,posix/mem"
--launcher="posix" --launcher_dir="/mesos/mesos-1.4.0/_build/src" --logbufsecs="0" --logging_level="INFO"
--max_completed_executors_per_framework="150" --oversubscribed_resources_interval="15secs"
--perf_duration="10secs" --perf_interval="1mins" --port="5051" --qos_correction_interval_min="0ns"
--quiet="false" --recover="reconnect" --recovery_timeout="15mins" --registration_backoff_factor="10ms"
--resources="cpus:2;gpus:0;mem:1024;disk:1024;ports:[31000-32000]" --revocable_cpu_low_priority="true"
--runtime_dir="/tmp/Endpoint_SlaveEndpointTest_UnauthorizedRequest_0_2UD7mf" --sandbox_directory="/mnt/mesos/sandbox"
--strict="true" --switch_user="true" --systemd_enable_support="true" --systemd_runtime_directory="/run/systemd/system"
--version="false" --work_dir="/tmp/Endpoint_SlaveEndpointTest_UnauthorizedRequest_0_IPIAm7"
I0623 03:45:54.034577  5954 credentials.hpp:86] Loading credential for authentication from
'/tmp/Endpoint_SlaveEndpointTest_UnauthorizedRequest_0_2UD7mf/credential'
I0623 03:45:54.034714  5954 slave.cpp:282] Agent using credential for: test-principal
I0623 03:45:54.034734  5954 credentials.hpp:37] Loading credentials for authentication from
'/tmp/Endpoint_SlaveEndpointTest_UnauthorizedRequest_0_2UD7mf/http_credentials'
I0623 03:45:54.034934  5954 http.cpp:974] Creating default 'basic' HTTP authenticator for
realm 'mesos-agent-readonly'
I0623 03:45:54.035068  5954 http.cpp:974] Creating default 'basic' HTTP authenticator for
realm 'mesos-agent-readwrite'
I0623 03:45:54.036159  5954 slave.cpp:553] Agent resources: [{"name":"cpus","scalar":{"value":2.0},"type":"SCALAR"},{"name":"mem","scalar":{"value":1024.0},"type":"SCALAR"},{"name":"disk","scalar":{"value":1024.0},"type":"SCALAR"},{"name":"ports","ranges":{"range":[{"begin":31000,"end":32000}]},"type":"RANGES"}]
I0623 03:45:54.036355  5954 slave.cpp:561] Agent attributes: [  ]
I0623 03:45:54.036367  5954 slave.cpp:566] Agent hostname: 9ac8a3fc550e
I0623 03:45:54.036511  5936 status_update_manager.cpp:177] Pausing sending status updates
I0623 03:45:54.037581  5948 state.cpp:64] Recovering state from '/tmp/Endpoint_SlaveEndpointTest_UnauthorizedRequest_0_IPIAm7/meta'
I0623 03:45:54.037811  5949 status_update_manager.cpp:203] Recovering status update manager
I0623 03:45:54.038306  5934 containerizer.cpp:582] Recovering containerizer
I0623 03:45:54.039849  5949 provisioner.cpp:416] Provisioner recovery complete
I0623 03:45:54.040416  5952 slave.cpp:6162] Finished recovery
I0623 03:45:54.040877  5952 slave.cpp:6344] Querying resource estimator for oversubscribable
resources
I0623 03:45:54.041316  5939 slave.cpp:6358] Received oversubscribable resources {} from the
resource estimator
I0623 03:45:54.043428  5935 process.cpp:3779] Handling HTTP event for process 'slave(768)'
with path: '/slave(768)/monitor/statistics'
I0623 03:45:54.044685  5955 http.cpp:1114] HTTP GET for /slave(768)/monitor/statistics from
172.17.0.4:37358
I0623 03:45:54.044739  5955 http.cpp:935] Authorizing principal 'test-principal' to GET the
'/monitor/statistics' endpoint
I0623 03:45:54.046775  5933 slave.cpp:818] Agent terminating
[       OK ] Endpoint/SlaveEndpointTest.UnauthorizedRequest/0 (26 ms)
[ RUN      ] Endpoint/SlaveEndpointTest.UnauthorizedRequest/1
I0623 03:45:54.055483  5913 containerizer.cpp:230] Using isolation: posix/cpu,posix/mem,filesystem/posix,network/cni,environment_secret
W0623 03:45:54.055918  5913 backend.cpp:76] Failed to create 'aufs' backend: AufsBackend requires
root privileges
W0623 03:45:54.056007  5913 backend.cpp:76] Failed to create 'bind' backend: BindBackend requires
root privileges
I0623 03:45:54.056033  5913 provisioner.cpp:255] Using default backend 'copy'
I0623 03:45:54.058929  5947 slave.cpp:249] Mesos agent started on (769)@172.17.0.4:43291
I0623 03:45:54.058953  5947 slave.cpp:250] Flags at startup: --acls="" --appc_simple_discovery_uri_prefix="http://"
--appc_store_dir="/tmp/Endpoint_SlaveEndpointTest_UnauthorizedRequest_1_BzSrCL/store/appc"
--authenticate_http_readonly="true" --authenticate_http_readwrite="true" --authenticatee="crammd5"
--authentication_backoff_factor="1secs" --authorizer="local" --cgroups_cpu_enable_pids_and_tids_count="false"
--cgroups_enable_cfs="false" --cgroups_hierarchy="/sys/fs/cgroup" --cgroups_limit_swap="false"
--cgroups_root="mesos" --container_disk_watch_interval="15secs" --containerizers="mesos" --credential="/tmp/Endpoint_SlaveEndpointTest_UnauthorizedRequest_1_BzSrCL/credential"
--default_role="*" --disk_watch_interval="1mins" --docker="docker" --docker_kill_orphans="true"
--docker_registry="https://registry-1.docker.io" --docker_remove_delay="6hrs" --docker_socket="/var/run/docker.sock"
--docker_stop_timeout="0ns" --docker_store_dir="/tmp/Endpoint_SlaveEndpointTest_UnauthorizedRequest_1_BzSrCL/store/docker"
--docker_volume_checkpoint_dir="/var/run/mesos/isolators/docker/volume" --enforce_container_disk_quota="false"
--executor_registration_timeout="1mins" --executor_reregistration_timeout="2secs" --executor_shutdown_grace_period="5secs"
--fetcher_cache_dir="/tmp/Endpoint_SlaveEndpointTest_UnauthorizedRequest_1_BzSrCL/fetch" --fetcher_cache_size="2GB"
--frameworks_home="" --gc_delay="1weeks" --gc_disk_headroom="0.1" --hadoop_home="" --help="false"
--hostname_lookup="true" --http_command_executor="false" --http_credentials="/tmp/Endpoint_SlaveEndpointTest_UnauthorizedRequest_1_BzSrCL/http_credentials"
--http_heartbeat_interval="30secs" --initialize_driver_logging="true" --isolation="posix/cpu,posix/mem"
--launcher="posix" --launcher_dir="/mesos/mesos-1.4.0/_build/src" --logbufsecs="0" --logging_level="INFO"
--max_completed_executors_per_framework="150" --oversubscribed_resources_interval="15secs"
--perf_duration="10secs" --perf_interval="1mins" --port="5051" --qos_correction_interval_min="0ns"
--quiet="false" --recover="reconnect" --recovery_timeout="15mins" --registration_backoff_factor="10ms"
--resources="cpus:2;gpus:0;mem:1024;disk:1024;ports:[31000-32000]" --revocable_cpu_low_priority="true"
--runtime_dir="/tmp/Endpoint_SlaveEndpointTest_UnauthorizedRequest_1_BzSrCL" --sandbox_directory="/mnt/mesos/sandbox"
--strict="true" --switch_user="true" --systemd_enable_support="true" --systemd_runtime_directory="/run/systemd/system"
--version="false" --work_dir="/tmp/Endpoint_SlaveEndpointTest_UnauthorizedRequest_1_cbr5xD"
I0623 03:45:54.059283  5947 credentials.hpp:86] Loading credential for authentication from
'/tmp/Endpoint_SlaveEndpointTest_UnauthorizedRequest_1_BzSrCL/credential'
I0623 03:45:54.059409  5947 slave.cpp:282] Agent using credential for: test-principal
I0623 03:45:54.059427  5947 credentials.hpp:37] Loading credentials for authentication from
'/tmp/Endpoint_SlaveEndpointTest_UnauthorizedRequest_1_BzSrCL/http_credentials'
I0623 03:45:54.059623  5947 http.cpp:974] Creating default 'basic' HTTP authenticator for
realm 'mesos-agent-readonly'
I0623 03:45:54.059751  5947 http.cpp:974] Creating default 'basic' HTTP authenticator for
realm 'mesos-agent-readwrite'
I0623 03:45:54.060839  5947 slave.cpp:553] Agent resources: [{"name":"cpus","scalar":{"value":2.0},"type":"SCALAR"},{"name":"mem","scalar":{"value":1024.0},"type":"SCALAR"},{"name":"disk","scalar":{"value":1024.0},"type":"SCALAR"},{"name":"ports","ranges":{"range":[{"begin":31000,"end":32000}]},"type":"RANGES"}]
I0623 03:45:54.061036  5947 slave.cpp:561] Agent attributes: [  ]
I0623 03:45:54.061049  5947 slave.cpp:566] Agent hostname: 9ac8a3fc550e
I0623 03:45:54.061174  5942 status_update_manager.cpp:177] Pausing sending status updates
I0623 03:45:54.062330  5952 state.cpp:64] Recovering state from '/tmp/Endpoint_SlaveEndpointTest_UnauthorizedRequest_1_cbr5xD/meta'
I0623 03:45:54.062539  5944 status_update_manager.cpp:203] Recovering status update manager
I0623 03:45:54.062748  5938 containerizer.cpp:582] Recovering containerizer
I0623 03:45:54.064193  5938 provisioner.cpp:416] Provisioner recovery complete
I0623 03:45:54.064607  5952 slave.cpp:6162] Finished recovery
I0623 03:45:54.064923  5952 slave.cpp:6344] Querying resource estimator for oversubscribable
resources
I0623 03:45:54.065271  5943 slave.cpp:6358] Received oversubscribable resources {} from the
resource estimator
I0623 03:45:54.067499  5932 process.cpp:3779] Handling HTTP event for process 'slave(769)'
with path: '/slave(769)/monitor/statistics.json'
I0623 03:45:54.068466  5947 http.cpp:1114] HTTP GET for /slave(769)/monitor/statistics.json
from 172.17.0.4:37360
I0623 03:45:54.068532  5947 http.cpp:935] Authorizing principal 'test-principal' to GET the
'/monitor/statistics.json' endpoint
I0623 03:45:54.070940  5939 slave.cpp:818] Agent terminating
[       OK ] Endpoint/SlaveEndpointTest.UnauthorizedRequest/1 (25 ms)
[ RUN      ] Endpoint/SlaveEndpointTest.UnauthorizedRequest/2
I0623 03:45:54.080564  5913 containerizer.cpp:230] Using isolation: posix/cpu,posix/mem,filesystem/posix,network/cni,environment_secret
W0623 03:45:54.081010  5913 backend.cpp:76] Failed to create 'aufs' backend: AufsBackend requires
root privileges
W0623 03:45:54.081096  5913 backend.cpp:76] Failed to create 'bind' backend: BindBackend requires
root privileges
I0623 03:45:54.081136  5913 provisioner.cpp:255] Using default backend 'copy'
I0623 03:45:54.084028  5941 slave.cpp:249] Mesos agent started on (770)@172.17.0.4:43291
I0623 03:45:54.084074  5941 slave.cpp:250] Flags at startup: --acls="" --appc_simple_discovery_uri_prefix="http://"
--appc_store_dir="/tmp/Endpoint_SlaveEndpointTest_UnauthorizedRequest_2_VABz6h/store/appc"
--authenticate_http_readonly="true" --authenticate_http_readwrite="true" --authenticatee="crammd5"
--authentication_backoff_factor="1secs" --authorizer="local" --cgroups_cpu_enable_pids_and_tids_count="false"
--cgroups_enable_cfs="false" --cgroups_hierarchy="/sys/fs/cgroup" --cgroups_limit_swap="false"
--cgroups_root="mesos" --container_disk_watch_interval="15secs" --containerizers="mesos" --credential="/tmp/Endpoint_SlaveEndpointTest_UnauthorizedRequest_2_VABz6h/credential"
--default_role="*" --disk_watch_interval="1mins" --docker="docker" --docker_kill_orphans="true"
--docker_registry="https://registry-1.docker.io" --docker_remove_delay="6hrs" --docker_socket="/var/run/docker.sock"
--docker_stop_timeout="0ns" --docker_store_dir="/tmp/Endpoint_SlaveEndpointTest_UnauthorizedRequest_2_VABz6h/store/docker"
--docker_volume_checkpoint_dir="/var/run/mesos/isolators/docker/volume" --enforce_container_disk_quota="false"
--executor_registration_timeout="1mins" --executor_reregistration_timeout="2secs" --executor_shutdown_grace_period="5secs"
--fetcher_cache_dir="/tmp/Endpoint_SlaveEndpointTest_UnauthorizedRequest_2_VABz6h/fetch" --fetcher_cache_size="2GB"
--frameworks_home="" --gc_delay="1weeks" --gc_disk_headroom="0.1" --hadoop_home="" --help="false"
--hostname_lookup="true" --http_command_executor="false" --http_credentials="/tmp/Endpoint_SlaveEndpointTest_UnauthorizedRequest_2_VABz6h/http_credentials"
--http_heartbeat_interval="30secs" --initialize_driver_logging="true" --isolation="posix/cpu,posix/mem"
--launcher="posix" --launcher_dir="/mesos/mesos-1.4.0/_build/src" --logbufsecs="0" --logging_level="INFO"
--max_completed_executors_per_framework="150" --oversubscribed_resources_interval="15secs"
--perf_duration="10secs" --perf_interval="1mins" --port="5051" --qos_correction_interval_min="0ns"
--quiet="false" --recover="reconnect" --recovery_timeout="15mins" --registration_backoff_factor="10ms"
--resources="cpus:2;gpus:0;mem:1024;disk:1024;ports:[31000-32000]" --revocable_cpu_low_priority="true"
--runtime_dir="/tmp/Endpoint_SlaveEndpointTest_UnauthorizedRequest_2_VABz6h" --sandbox_directory="/mnt/mesos/sandbox"
--strict="true" --switch_user="true" --systemd_enable_support="true" --systemd_runtime_directory="/run/systemd/system"
--version="false" --work_dir="/tmp/Endpoint_SlaveEndpointTest_UnauthorizedRequest_2_WvGtY9"
I0623 03:45:54.084588  5941 credentials.hpp:86] Loading credential for authentication from
'/tmp/Endpoint_SlaveEndpointTest_UnauthorizedRequest_2_VABz6h/credential'
I0623 03:45:54.084857  5941 slave.cpp:282] Agent using credential for: test-principal
I0623 03:45:54.084878  5941 credentials.hpp:37] Loading credentials for authentication from
'/tmp/Endpoint_SlaveEndpointTest_UnauthorizedRequest_2_VABz6h/http_credentials'
I0623 03:45:54.085186  5941 http.cpp:974] Creating default 'basic' HTTP authenticator for
realm 'mesos-agent-readonly'
I0623 03:45:54.085448  5941 http.cpp:974] Creating default 'basic' HTTP authenticator for
realm 'mesos-agent-readwrite'
I0623 03:45:54.086844  5941 slave.cpp:553] Agent resources: [{"name":"cpus","scalar":{"value":2.0},"type":"SCALAR"},{"name":"mem","scalar":{"value":1024.0},"type":"SCALAR"},{"name":"disk","scalar":{"value":1024.0},"type":"SCALAR"},{"name":"ports","ranges":{"range":[{"begin":31000,"end":32000}]},"type":"RANGES"}]
I0623 03:45:54.087072  5941 slave.cpp:561] Agent attributes: [  ]
I0623 03:45:54.087086  5941 slave.cpp:566] Agent hostname: 9ac8a3fc550e
I0623 03:45:54.087231  5948 status_update_manager.cpp:177] Pausing sending status updates
I0623 03:45:54.088870  5942 state.cpp:64] Recovering state from '/tmp/Endpoint_SlaveEndpointTest_UnauthorizedRequest_2_WvGtY9/meta'
I0623 03:45:54.089539  5942 status_update_manager.cpp:203] Recovering status update manager
I0623 03:45:54.089807  5933 containerizer.cpp:582] Recovering containerizer
I0623 03:45:54.091140  5947 provisioner.cpp:416] Provisioner recovery complete
I0623 03:45:54.091644  5953 slave.cpp:6162] Finished recovery
I0623 03:45:54.092283  5953 slave.cpp:6344] Querying resource estimator for oversubscribable
resources
I0623 03:45:54.092618  5950 slave.cpp:6358] Received oversubscribable resources {} from the
resource estimator
I0623 03:45:54.095077  5941 process.cpp:3779] Handling HTTP event for process 'slave(770)'
with path: '/slave(770)/containers'
I0623 03:45:54.096187  5945 http.cpp:1114] HTTP GET for /slave(770)/containers from 172.17.0.4:37362
I0623 03:45:54.096251  5945 http.cpp:935] Authorizing principal 'test-principal' to GET the
'/containers' endpoint
I0623 03:45:54.098691  5952 slave.cpp:818] Agent terminating
[       OK ] Endpoint/SlaveEndpointTest.UnauthorizedRequest/2 (27 ms)
[ RUN      ] Endpoint/SlaveEndpointTest.NoAuthorizer/0
I0623 03:45:54.108844  5913 containerizer.cpp:230] Using isolation: posix/cpu,posix/mem,filesystem/posix,network/cni,environment_secret
W0623 03:45:54.109724  5913 backend.cpp:76] Failed to create 'aufs' backend: AufsBackend requires
root privileges
W0623 03:45:54.109896  5913 backend.cpp:76] Failed to create 'bind' backend: BindBackend requires
root privileges
I0623 03:45:54.109922  5913 provisioner.cpp:255] Using default backend 'copy'
I0623 03:45:54.112226  5913 cluster.cpp:448] Creating default 'local' authorizer
I0623 03:45:54.114042  5948 slave.cpp:249] Mesos agent started on (771)@172.17.0.4:43291
I0623 03:45:54.114065  5948 slave.cpp:250] Flags at startup: --acls="" --appc_simple_discovery_uri_prefix="http://"
--appc_store_dir="/tmp/Endpoint_SlaveEndpointTest_NoAuthorizer_0_dov6QO/store/appc" --authenticate_http_readonly="true"
--authenticate_http_readwrite="true" --authenticatee="crammd5" --authentication_backoff_factor="1secs"
--authorizer="local" --cgroups_cpu_enable_pids_and_tids_count="false" --cgroups_enable_cfs="false"
--cgroups_hierarchy="/sys/fs/cgroup" --cgroups_limit_swap="false" --cgroups_root="mesos" --container_disk_watch_interval="15secs"
--containerizers="mesos" --credential="/tmp/Endpoint_SlaveEndpointTest_NoAuthorizer_0_dov6QO/credential"
--default_role="*" --disk_watch_interval="1mins" --docker="docker" --docker_kill_orphans="true"
--docker_registry="https://registry-1.docker.io" --docker_remove_delay="6hrs" --docker_socket="/var/run/docker.sock"
--docker_stop_timeout="0ns" --docker_store_dir="/tmp/Endpoint_SlaveEndpointTest_NoAuthorizer_0_dov6QO/store/docker"
--docker_volume_checkpoint_dir="/var/run/mesos/isolators/docker/volume" --enforce_container_disk_quota="false"
--executor_registration_timeout="1mins" --executor_reregistration_timeout="2secs" --executor_shutdown_grace_period="5secs"
--fetcher_cache_dir="/tmp/Endpoint_SlaveEndpointTest_NoAuthorizer_0_dov6QO/fetch" --fetcher_cache_size="2GB"
--frameworks_home="" --gc_delay="1weeks" --gc_disk_headroom="0.1" --hadoop_home="" --help="false"
--hostname_lookup="true" --http_command_executor="false" --http_credentials="/tmp/Endpoint_SlaveEndpointTest_NoAuthorizer_0_dov6QO/http_credentials"
--http_heartbeat_interval="30secs" --initialize_driver_logging="true" --isolation="posix/cpu,posix/mem"
--launcher="posix" --launcher_dir="/mesos/mesos-1.4.0/_build/src" --logbufsecs="0" --logging_level="INFO"
--max_completed_executors_per_framework="150" --oversubscribed_resources_interval="15secs"
--perf_duration="10secs" --perf_interval="1mins" --port="5051" --qos_correction_interval_min="0ns"
--quiet="false" --recover="reconnect" --recovery_timeout="15mins" --registration_backoff_factor="10ms"
--resources="cpus:2;gpus:0;mem:1024;disk:1024;ports:[31000-32000]" --revocable_cpu_low_priority="true"
--runtime_dir="/tmp/Endpoint_SlaveEndpointTest_NoAuthorizer_0_dov6QO" --sandbox_directory="/mnt/mesos/sandbox"
--strict="true" --switch_user="true" --systemd_enable_support="true" --systemd_runtime_directory="/run/systemd/system"
--version="false" --work_dir="/tmp/Endpoint_SlaveEndpointTest_NoAuthorizer_0_bUfTEG"
I0623 03:45:54.114542  5948 credentials.hpp:86] Loading credential for authentication from
'/tmp/Endpoint_SlaveEndpointTest_NoAuthorizer_0_dov6QO/credential'
I0623 03:45:54.114831  5948 slave.cpp:282] Agent using credential for: test-principal
I0623 03:45:54.114852  5948 credentials.hpp:37] Loading credentials for authentication from
'/tmp/Endpoint_SlaveEndpointTest_NoAuthorizer_0_dov6QO/http_credentials'
I0623 03:45:54.115119  5948 http.cpp:974] Creating default 'basic' HTTP authenticator for
realm 'mesos-agent-readonly'
I0623 03:45:54.115309  5948 http.cpp:974] Creating default 'basic' HTTP authenticator for
realm 'mesos-agent-readwrite'
I0623 03:45:54.116454  5948 slave.cpp:553] Agent resources: [{"name":"cpus","scalar":{"value":2.0},"type":"SCALAR"},{"name":"mem","scalar":{"value":1024.0},"type":"SCALAR"},{"name":"disk","scalar":{"value":1024.0},"type":"SCALAR"},{"name":"ports","ranges":{"range":[{"begin":31000,"end":32000}]},"type":"RANGES"}]
I0623 03:45:54.116658  5948 slave.cpp:561] Agent attributes: [  ]
I0623 03:45:54.116670  5948 slave.cpp:566] Agent hostname: 9ac8a3fc550e
I0623 03:45:54.116786  5938 status_update_manager.cpp:177] Pausing sending status updates
I0623 03:45:54.117933  5933 state.cpp:64] Recovering state from '/tmp/Endpoint_SlaveEndpointTest_NoAuthorizer_0_bUfTEG/meta'
I0623 03:45:54.118233  5933 status_update_manager.cpp:203] Recovering status update manager
I0623 03:45:54.118398  5954 containerizer.cpp:582] Recovering containerizer
I0623 03:45:54.119946  5937 provisioner.cpp:416] Provisioner recovery complete
I0623 03:45:54.120375  5953 slave.cpp:6162] Finished recovery
I0623 03:45:54.120811  5953 slave.cpp:6344] Querying resource estimator for oversubscribable
resources
I0623 03:45:54.121080  5937 slave.cpp:6358] Received oversubscribable resources {} from the
resource estimator
I0623 03:45:54.123159  5937 process.cpp:3779] Handling HTTP event for process 'slave(771)'
with path: '/slave(771)/monitor/statistics'
I0623 03:45:54.124804  5948 http.cpp:1114] HTTP GET for /slave(771)/monitor/statistics from
172.17.0.4:37366
I0623 03:45:54.124912  5948 http.cpp:935] Authorizing principal 'test-principal' to GET the
'/monitor/statistics' endpoint
I0623 03:45:54.128926  5934 slave.cpp:818] Agent terminating
[       OK ] Endpoint/SlaveEndpointTest.NoAuthorizer/0 (30 ms)
[ RUN      ] Endpoint/SlaveEndpointTest.NoAuthorizer/1
I0623 03:45:54.139514  5913 containerizer.cpp:230] Using isolation: posix/cpu,posix/mem,filesystem/posix,network/cni,environment_secret
W0623 03:45:54.139974  5913 backend.cpp:76] Failed to create 'aufs' backend: AufsBackend requires
root privileges
W0623 03:45:54.140056  5913 backend.cpp:76] Failed to create 'bind' backend: BindBackend requires
root privileges
I0623 03:45:54.140082  5913 provisioner.cpp:255] Using default backend 'copy'
I0623 03:45:54.141588  5913 cluster.cpp:448] Creating default 'local' authorizer
I0623 03:45:54.142957  5935 slave.cpp:249] Mesos agent started on (772)@172.17.0.4:43291
I0623 03:45:54.142974  5935 slave.cpp:250] Flags at startup: --acls="" --appc_simple_discovery_uri_prefix="http://"
--appc_store_dir="/tmp/Endpoint_SlaveEndpointTest_NoAuthorizer_1_XetGTl/store/appc" --authenticate_http_readonly="true"
--authenticate_http_readwrite="true" --authenticatee="crammd5" --authentication_backoff_factor="1secs"
--authorizer="local" --cgroups_cpu_enable_pids_and_tids_count="false" --cgroups_enable_cfs="false"
--cgroups_hierarchy="/sys/fs/cgroup" --cgroups_limit_swap="false" --cgroups_root="mesos" --container_disk_watch_interval="15secs"
--containerizers="mesos" --credential="/tmp/Endpoint_SlaveEndpointTest_NoAuthorizer_1_XetGTl/credential"
--default_role="*" --disk_watch_interval="1mins" --docker="docker" --docker_kill_orphans="true"
--docker_registry="https://registry-1.docker.io" --docker_remove_delay="6hrs" --docker_socket="/var/run/docker.sock"
--docker_stop_timeout="0ns" --docker_store_dir="/tmp/Endpoint_SlaveEndpointTest_NoAuthorizer_1_XetGTl/store/docker"
--docker_volume_checkpoint_dir="/var/run/mesos/isolators/docker/volume" --enforce_container_disk_quota="false"
--executor_registration_timeout="1mins" --executor_reregistration_timeout="2secs" --executor_shutdown_grace_period="5secs"
--fetcher_cache_dir="/tmp/Endpoint_SlaveEndpointTest_NoAuthorizer_1_XetGTl/fetch" --fetcher_cache_size="2GB"
--frameworks_home="" --gc_delay="1weeks" --gc_disk_headroom="0.1" --hadoop_home="" --help="false"
--hostname_lookup="true" --http_command_executor="false" --http_credentials="/tmp/Endpoint_SlaveEndpointTest_NoAuthorizer_1_XetGTl/http_credentials"
--http_heartbeat_interval="30secs" --initialize_driver_logging="true" --isolation="posix/cpu,posix/mem"
--launcher="posix" --launcher_dir="/mesos/mesos-1.4.0/_build/src" --logbufsecs="0" --logging_level="INFO"
--max_completed_executors_per_framework="150" --oversubscribed_resources_interval="15secs"
--perf_duration="10secs" --perf_interval="1mins" --port="5051" --qos_correction_interval_min="0ns"
--quiet="false" --recover="reconnect" --recovery_timeout="15mins" --registration_backoff_factor="10ms"
--resources="cpus:2;gpus:0;mem:1024;disk:1024;ports:[31000-32000]" --revocable_cpu_low_priority="true"
--runtime_dir="/tmp/Endpoint_SlaveEndpointTest_NoAuthorizer_1_XetGTl" --sandbox_directory="/mnt/mesos/sandbox"
--strict="true" --switch_user="true" --systemd_enable_support="true" --systemd_runtime_directory="/run/systemd/system"
--version="false" --work_dir="/tmp/Endpoint_SlaveEndpointTest_NoAuthorizer_1_PydSCd"
I0623 03:45:54.143290  5935 credentials.hpp:86] Loading credential for authentication from
'/tmp/Endpoint_SlaveEndpointTest_NoAuthorizer_1_XetGTl/credential'
I0623 03:45:54.143426  5935 slave.cpp:282] Agent using credential for: test-principal
I0623 03:45:54.143446  5935 credentials.hpp:37] Loading credentials for authentication from
'/tmp/Endpoint_SlaveEndpointTest_NoAuthorizer_1_XetGTl/http_credentials'
I0623 03:45:54.143656  5935 http.cpp:974] Creating default 'basic' HTTP authenticator for
realm 'mesos-agent-readonly'
I0623 03:45:54.143900  5935 http.cpp:974] Creating default 'basic' HTTP authenticator for
realm 'mesos-agent-readwrite'
I0623 03:45:54.145273  5935 slave.cpp:553] Agent resources: [{"name":"cpus","scalar":{"value":2.0},"type":"SCALAR"},{"name":"mem","scalar":{"value":1024.0},"type":"SCALAR"},{"name":"disk","scalar":{"value":1024.0},"type":"SCALAR"},{"name":"ports","ranges":{"range":[{"begin":31000,"end":32000}]},"type":"RANGES"}]
I0623 03:45:54.145474  5935 slave.cpp:561] Agent attributes: [  ]
I0623 03:45:54.145488  5935 slave.cpp:566] Agent hostname: 9ac8a3fc550e
I0623 03:45:54.145586  5939 status_update_manager.cpp:177] Pausing sending status updates
I0623 03:45:54.146698  5932 state.cpp:64] Recovering state from '/tmp/Endpoint_SlaveEndpointTest_NoAuthorizer_1_PydSCd/meta'
I0623 03:45:54.147083  5953 status_update_manager.cpp:203] Recovering status update manager
I0623 03:45:54.147415  5954 containerizer.cpp:582] Recovering containerizer
I0623 03:45:54.149046  5955 provisioner.cpp:416] Provisioner recovery complete
I0623 03:45:54.149461  5938 slave.cpp:6162] Finished recovery
I0623 03:45:54.150106  5938 slave.cpp:6344] Querying resource estimator for oversubscribable
resources
I0623 03:45:54.150429  5932 slave.cpp:6358] Received oversubscribable resources {} from the
resource estimator
I0623 03:45:54.152566  5952 process.cpp:3779] Handling HTTP event for process 'slave(772)'
with path: '/slave(772)/monitor/statistics.json'
I0623 03:45:54.153873  5955 http.cpp:1114] HTTP GET for /slave(772)/monitor/statistics.json
from 172.17.0.4:37368
I0623 03:45:54.153933  5955 http.cpp:935] Authorizing principal 'test-principal' to GET the
'/monitor/statistics.json' endpoint
I0623 03:45:54.157017  5953 slave.cpp:818] Agent terminating
[       OK ] Endpoint/SlaveEndpointTest.NoAuthorizer/1 (27 ms)
[ RUN      ] Endpoint/SlaveEndpointTest.NoAuthorizer/2
I0623 03:45:54.169191  5913 containerizer.cpp:230] Using isolation: posix/cpu,posix/mem,filesystem/posix,network/cni,environment_secret
W0623 03:45:54.169884  5913 backend.cpp:76] Failed to create 'aufs' backend: AufsBackend requires
root privileges
W0623 03:45:54.170038  5913 backend.cpp:76] Failed to create 'bind' backend: BindBackend requires
root privileges
I0623 03:45:54.170083  5913 provisioner.cpp:255] Using default backend 'copy'
I0623 03:45:54.172134  5913 cluster.cpp:448] Creating default 'local' authorizer
I0623 03:45:54.174017  5946 slave.cpp:249] Mesos agent started on (773)@172.17.0.4:43291
I0623 03:45:54.174067  5946 slave.cpp:250] Flags at startup: --acls="" --appc_simple_discovery_uri_prefix="http://"
--appc_store_dir="/tmp/Endpoint_SlaveEndpointTest_NoAuthorizer_2_ZOVkdT/store/appc" --authenticate_http_readonly="true"
--authenticate_http_readwrite="true" --authenticatee="crammd5" --authentication_backoff_factor="1secs"
--authorizer="local" --cgroups_cpu_enable_pids_and_tids_count="false" --cgroups_enable_cfs="false"
--cgroups_hierarchy="/sys/fs/cgroup" --cgroups_limit_swap="false" --cgroups_root="mesos" --container_disk_watch_interval="15secs"
--containerizers="mesos" --credential="/tmp/Endpoint_SlaveEndpointTest_NoAuthorizer_2_ZOVkdT/credential"
--default_role="*" --disk_watch_interval="1mins" --docker="docker" --docker_kill_orphans="true"
--docker_registry="https://registry-1.docker.io" --docker_remove_delay="6hrs" --docker_socket="/var/run/docker.sock"
--docker_stop_timeout="0ns" --docker_store_dir="/tmp/Endpoint_SlaveEndpointTest_NoAuthorizer_2_ZOVkdT/store/docker"
--docker_volume_checkpoint_dir="/var/run/mesos/isolators/docker/volume" --enforce_container_disk_quota="false"
--executor_registration_timeout="1mins" --executor_reregistration_timeout="2secs" --executor_shutdown_grace_period="5secs"
--fetcher_cache_dir="/tmp/Endpoint_SlaveEndpointTest_NoAuthorizer_2_ZOVkdT/fetch" --fetcher_cache_size="2GB"
--frameworks_home="" --gc_delay="1weeks" --gc_disk_headroom="0.1" --hadoop_home="" --help="false"
--hostname_lookup="true" --http_command_executor="false" --http_credentials="/tmp/Endpoint_SlaveEndpointTest_NoAuthorizer_2_ZOVkdT/http_credentials"
--http_heartbeat_interval="30secs" --initialize_driver_logging="true" --isolation="posix/cpu,posix/mem"
--launcher="posix" --launcher_dir="/mesos/mesos-1.4.0/_build/src" --logbufsecs="0" --logging_level="INFO"
--max_completed_executors_per_framework="150" --oversubscribed_resources_interval="15secs"
--perf_duration="10secs" --perf_interval="1mins" --port="5051" --qos_correction_interval_min="0ns"
--quiet="false" --recover="reconnect" --recovery_timeout="15mins" --registration_backoff_factor="10ms"
--resources="cpus:2;gpus:0;mem:1024;disk:1024;ports:[31000-32000]" --revocable_cpu_low_priority="true"
--runtime_dir="/tmp/Endpoint_SlaveEndpointTest_NoAuthorizer_2_ZOVkdT" --sandbox_directory="/mnt/mesos/sandbox"
--strict="true" --switch_user="true" --systemd_enable_support="true" --systemd_runtime_directory="/run/systemd/system"
--version="false" --work_dir="/tmp/Endpoint_SlaveEndpointTest_NoAuthorizer_2_K12eSK"
I0623 03:45:54.174556  5946 credentials.hpp:86] Loading credential for authentication from
'/tmp/Endpoint_SlaveEndpointTest_NoAuthorizer_2_ZOVkdT/credential'
I0623 03:45:54.174823  5946 slave.cpp:282] Agent using credential for: test-principal
I0623 03:45:54.174842  5946 credentials.hpp:37] Loading credentials for authentication from
'/tmp/Endpoint_SlaveEndpointTest_NoAuthorizer_2_ZOVkdT/http_credentials'
I0623 03:45:54.175112  5946 http.cpp:974] Creating default 'basic' HTTP authenticator for
realm 'mesos-agent-readonly'
I0623 03:45:54.175308  5946 http.cpp:974] Creating default 'basic' HTTP authenticator for
realm 'mesos-agent-readwrite'
I0623 03:45:54.176604  5946 slave.cpp:553] Agent resources: [{"name":"cpus","scalar":{"value":2.0},"type":"SCALAR"},{"name":"mem","scalar":{"value":1024.0},"type":"SCALAR"},{"name":"disk","scalar":{"value":1024.0},"type":"SCALAR"},{"name":"ports","ranges":{"range":[{"begin":31000,"end":32000}]},"type":"RANGES"}]
I0623 03:45:54.176802  5946 slave.cpp:561] Agent attributes: [  ]
I0623 03:45:54.176815  5946 slave.cpp:566] Agent hostname: 9ac8a3fc550e
I0623 03:45:54.176920  5940 status_update_manager.cpp:177] Pausing sending status updates
I0623 03:45:54.177968  5934 state.cpp:64] Recovering state from '/tmp/Endpoint_SlaveEndpointTest_NoAuthorizer_2_K12eSK/meta'
I0623 03:45:54.178171  5941 status_update_manager.cpp:203] Recovering status update manager
I0623 03:45:54.178390  5946 containerizer.cpp:582] Recovering containerizer
I0623 03:45:54.179519  5955 provisioner.cpp:416] Provisioner recovery complete
I0623 03:45:54.179888  5936 slave.cpp:6162] Finished recovery
I0623 03:45:54.180454  5936 slave.cpp:6344] Querying resource estimator for oversubscribable
resources
I0623 03:45:54.180771  5943 slave.cpp:6358] Received oversubscribable resources {} from the
resource estimator
I0623 03:45:54.182834  5936 process.cpp:3779] Handling HTTP event for process 'slave(773)'
with path: '/slave(773)/containers'
I0623 03:45:54.183898  5941 http.cpp:1114] HTTP GET for /slave(773)/containers from 172.17.0.4:37370
I0623 03:45:54.183991  5941 http.cpp:935] Authorizing principal 'test-principal' to GET the
'/containers' endpoint
I0623 03:45:54.187849  5938 slave.cpp:818] Agent terminating
[       OK ] Endpoint/SlaveEndpointTest.NoAuthorizer/2 (31 ms)
[----------] 9 tests from Endpoint/SlaveEndpointTest (255 ms total)

[----------] Global test environment tear-down
[==========] 1615 tests from 178 test cases ran. (581666 ms total)
[  PASSED  ] 1612 tests.
[  FAILED  ] 3 tests, listed below:
[  FAILED  ] DefaultExecutorCheckTest.CommandCheckDeliveredAndReconciled
[  FAILED  ] DefaultExecutorCheckTest.CommandCheckStatusChange
[  FAILED  ] ExamplesTest.TestHTTPFramework

 3 FAILED TESTS
  YOU HAVE 20 DISABLED TESTS

I0623 03:45:54.261267  5956 process.cpp:968] Failed to accept socket: future discarded
make[4]: *** [check-local] Error 1
make[4]: Leaving directory `/mesos/mesos-1.4.0/_build/src'
make[3]: *** [check-am] Error 2
make[3]: Leaving directory `/mesos/mesos-1.4.0/_build/src'
make[2]: *** [check] Error 2
make[2]: Leaving directory `/mesos/mesos-1.4.0/_build/src'
make[1]: *** [check-recursive] Error 1
make[1]: Leaving directory `/mesos/mesos-1.4.0/_build'
make: *** [distcheck] Error 1
+ docker rmi mesos-1498186530-13050
Untagged: mesos-1498186530-13050:latest
Deleted: sha256:fc98b8a770cb1837b3769d727d973afbcfd5f323b2a0b04984088cf9e1c8c31a
Deleted: sha256:9e51a72cdd4c61f45c5780a1b5375ea4610f1c940150e1fc24187c6c0512c79f
Deleted: sha256:ea960d326146636f21585c77eaef7263559cee4cbe977d78ecce11fb4e41c595
Deleted: sha256:1daa4906711234e302e42eed3cc02b390d4ad26fcdfcd280bce9730c60956c47
Deleted: sha256:77c4ddb1de7553046e15ac38eea7c711bf889ac093485dc01778d77a0bdd354f
Deleted: sha256:fca3926d1db3cad446b1a5cb65d30b485d0f61ff92bbca2a375020f3edbccf64
Deleted: sha256:42c0d37186172354140bda44fef247df779d58970f1dda62d4a8e9bc6144c995
Deleted: sha256:fe110d8af0b47d432832aeb641c9257a0b9ce2f1d76e88ae2cb34076e2f125ce
Deleted: sha256:4758ca3551fc97e7e41855ef89729738594d9885b3c67ff05e70e4b9f9f5a2bc
Deleted: sha256:16560919e85cbc4860b8b6236c55d58a9342d33e669c7de1f12c5d3330c924fa
Deleted: sha256:c32c0b0a0cb0cab9669a64d43c370710386fe086238e51d0bf31a0d19d0ac17d
Deleted: sha256:f684d32287285cbea833886a84d2e169188f278f8d59ce9745dfd9f759edc4ae
Deleted: sha256:dd9728c1e53b4d1de909daac1fd3380f9d3bf91539c6c76b740d2dc7ef21fd46
Deleted: sha256:9dece236d94be96401b0f133e2d964b7f901fedf4b057f5301ee05ce7d691346
Deleted: sha256:fb9b250cbdbd0449776df09f575ce1688c731c6b7786ba1eafbd97a117f4c77c
Deleted: sha256:e3e4fbd3db3b2bfd00f8bcbd941dfc0042597176883301c9d133859699d6abf9
Deleted: sha256:c7f9c517c33ff094e24f31edc5859cf06f49b11c1de523a2c4312e4f78dbc5ab
Deleted: sha256:149355eebe21fdb6e1d7686cca8a9c74800db419c4c587de50451b60b4a41284
Deleted: sha256:531ea77ee9dc16d67c3366960cbc401e73e08b141eaa02354e8400112ac6647f
Deleted: sha256:9b2e2218f747e0b5c4844ef995bb9f0a24de0b3f11e79e0cbd068b6612b25302
Deleted: sha256:a9d93708fe159ece667d39a3af5469ae7b467e69e14c8136a547690b45ea8ba1
Deleted: sha256:4787b1b0eec0cb1469475f8a42d8ea06e304dd396484af263008037c8d0a65bf
Deleted: sha256:76e711cc4ff5fa14035c97103806643bf0c82c5784d71b08529d277adb661c82
Deleted: sha256:ad1b29543c37d459daa1be03fd181ec1a0161c9a8a3d19b9806132e9923d0544
Deleted: sha256:86fa8752f7cf9bfbd71a7e3c76a7365a95151339c6e4498c4af64a951e50d580
Build step 'Execute shell' marked build as failure
Not sending mail to unregistered user neil.conway@gmail.com
Not sending mail to unregistered user xujyan@apple.com
Not sending mail to unregistered user yujie.jay@gmail.com
Not sending mail to unregistered user toenshoff@me.com

Mime
View raw message