mesos-builds mailing list archives

Site index · List index
Message view « Date » · « Thread »
Top « Date » · « Thread »
From Apache Jenkins Server <jenk...@builds.apache.org>
Subject Build failed in Jenkins: Mesos-Buildbot » autotools,gcc,--verbose,GLOG_v=1 MESOS_VERBOSE=1,centos:7,(ubuntu)&&(!ubuntu-us1)&&(!ubuntu-eu2) #3792
Date Tue, 13 Jun 2017 23:37:35 GMT
See <https://builds.apache.org/job/Mesos-Buildbot/BUILDTOOL=autotools,COMPILER=gcc,CONFIGURATION=--verbose,ENVIRONMENT=GLOG_v=1%20MESOS_VERBOSE=1,OS=centos%3A7,label_exp=(ubuntu)&&(!ubuntu-us1)&&(!ubuntu-eu2)/3792/display/redirect?page=changes>

Changes:

[neil.conway] Synchronized comment in v1 and unversioned master.proto.

------------------------------------------
[...truncated 28.18 MB...]
[ RUN      ] Endpoint/SlaveEndpointTest.AuthorizedRequest/2
I0613 23:37:29.853622  5898 containerizer.cpp:230] Using isolation: posix/cpu,posix/mem,filesystem/posix,network/cni,environment_secret
W0613 23:37:29.854112  5898 backend.cpp:76] Failed to create 'aufs' backend: AufsBackend requires
root privileges
W0613 23:37:29.854215  5898 backend.cpp:76] Failed to create 'bind' backend: BindBackend requires
root privileges
I0613 23:37:29.854244  5898 provisioner.cpp:255] Using default backend 'copy'
I0613 23:37:29.858093  5928 slave.cpp:248] Mesos agent started on (758)@172.17.0.3:42883
I0613 23:37:29.858117  5928 slave.cpp:249] Flags at startup: --acls="" --appc_simple_discovery_uri_prefix="http://"
--appc_store_dir="/tmp/Endpoint_SlaveEndpointTest_AuthorizedRequest_2_j7mXA7/store/appc" --authenticate_http_readonly="true"
--authenticate_http_readwrite="true" --authenticatee="crammd5" --authentication_backoff_factor="1secs"
--authorizer="local" --cgroups_cpu_enable_pids_and_tids_count="false" --cgroups_enable_cfs="false"
--cgroups_hierarchy="/sys/fs/cgroup" --cgroups_limit_swap="false" --cgroups_root="mesos" --container_disk_watch_interval="15secs"
--containerizers="mesos" --credential="/tmp/Endpoint_SlaveEndpointTest_AuthorizedRequest_2_j7mXA7/credential"
--default_role="*" --disk_watch_interval="1mins" --docker="docker" --docker_kill_orphans="true"
--docker_registry="https://registry-1.docker.io" --docker_remove_delay="6hrs" --docker_socket="/var/run/docker.sock"
--docker_stop_timeout="0ns" --docker_store_dir="/tmp/Endpoint_SlaveEndpointTest_AuthorizedRequest_2_j7mXA7/store/docker"
--docker_volume_checkpoint_dir="/var/run/mesos/isolators/docker/volume" --enforce_container_disk_quota="false"
--executor_registration_timeout="1mins" --executor_reregistration_timeout="2secs" --executor_shutdown_grace_period="5secs"
--fetcher_cache_dir="/tmp/Endpoint_SlaveEndpointTest_AuthorizedRequest_2_j7mXA7/fetch" --fetcher_cache_size="2GB"
--frameworks_home="" --gc_delay="1weeks" --gc_disk_headroom="0.1" --hadoop_home="" --help="false"
--hostname_lookup="true" --http_command_executor="false" --http_credentials="/tmp/Endpoint_SlaveEndpointTest_AuthorizedRequest_2_j7mXA7/http_credentials"
--http_heartbeat_interval="30secs" --initialize_driver_logging="true" --isolation="posix/cpu,posix/mem"
--launcher="posix" --launcher_dir="/mesos/mesos-1.4.0/_build/src" --logbufsecs="0" --logging_level="INFO"
--max_completed_executors_per_framework="150" --oversubscribed_resources_interval="15secs"
--perf_duration="10secs" --perf_interval="1mins" --port="5051" --qos_correction_interval_min="0ns"
--quiet="false" --recover="reconnect" --recovery_timeout="15mins" --registration_backoff_factor="10ms"
--resources="cpus:2;gpus:0;mem:1024;disk:1024;ports:[31000-32000]" --revocable_cpu_low_priority="true"
--runtime_dir="/tmp/Endpoint_SlaveEndpointTest_AuthorizedRequest_2_j7mXA7" --sandbox_directory="/mnt/mesos/sandbox"
--strict="true" --switch_user="true" --systemd_enable_support="true" --systemd_runtime_directory="/run/systemd/system"
--version="false" --work_dir="/tmp/Endpoint_SlaveEndpointTest_AuthorizedRequest_2_PI43um"
I0613 23:37:29.858541  5928 credentials.hpp:86] Loading credential for authentication from
'/tmp/Endpoint_SlaveEndpointTest_AuthorizedRequest_2_j7mXA7/credential'
I0613 23:37:29.858723  5928 slave.cpp:281] Agent using credential for: test-principal
I0613 23:37:29.858744  5928 credentials.hpp:37] Loading credentials for authentication from
'/tmp/Endpoint_SlaveEndpointTest_AuthorizedRequest_2_j7mXA7/http_credentials'
I0613 23:37:29.859005  5928 http.cpp:975] Creating default 'basic' HTTP authenticator for
realm 'mesos-agent-readonly'
I0613 23:37:29.859158  5928 http.cpp:975] Creating default 'basic' HTTP authenticator for
realm 'mesos-agent-readwrite'
I0613 23:37:29.860422  5928 slave.cpp:552] Agent resources: cpus(*):2; mem(*):1024; disk(*):1024;
ports(*):[31000-32000]
I0613 23:37:29.860496  5928 slave.cpp:560] Agent attributes: [  ]
I0613 23:37:29.860507  5928 slave.cpp:565] Agent hostname: 6d20e28bf990
I0613 23:37:29.860656  5924 status_update_manager.cpp:177] Pausing sending status updates
I0613 23:37:29.862182  5925 state.cpp:62] Recovering state from '/tmp/Endpoint_SlaveEndpointTest_AuthorizedRequest_2_PI43um/meta'
I0613 23:37:29.862435  5939 status_update_manager.cpp:203] Recovering status update manager
I0613 23:37:29.862685  5929 containerizer.cpp:582] Recovering containerizer
I0613 23:37:29.864246  5919 provisioner.cpp:416] Provisioner recovery complete
I0613 23:37:29.864647  5926 slave.cpp:6127] Finished recovery
I0613 23:37:29.865090  5926 slave.cpp:6309] Querying resource estimator for oversubscribable
resources
I0613 23:37:29.865356  5925 slave.cpp:6323] Received oversubscribable resources {} from the
resource estimator
I0613 23:37:29.867727  5924 process.cpp:3778] Handling HTTP event for process 'slave(758)'
with path: '/slave(758)/containers'
I0613 23:37:29.869048  5921 http.cpp:1115] HTTP GET for /slave(758)/containers from 172.17.0.3:47758
I0613 23:37:29.869132  5921 http.cpp:936] Authorizing principal 'test-principal' to GET the
'/containers' endpoint
I0613 23:37:29.872851  5926 slave.cpp:817] Agent terminating
[       OK ] Endpoint/SlaveEndpointTest.AuthorizedRequest/2 (29 ms)
[ RUN      ] Endpoint/SlaveEndpointTest.UnauthorizedRequest/0
I0613 23:37:29.883486  5898 containerizer.cpp:230] Using isolation: posix/cpu,posix/mem,filesystem/posix,network/cni,environment_secret
W0613 23:37:29.884002  5898 backend.cpp:76] Failed to create 'aufs' backend: AufsBackend requires
root privileges
W0613 23:37:29.884093  5898 backend.cpp:76] Failed to create 'bind' backend: BindBackend requires
root privileges
I0613 23:37:29.884124  5898 provisioner.cpp:255] Using default backend 'copy'
I0613 23:37:29.887506  5922 slave.cpp:248] Mesos agent started on (759)@172.17.0.3:42883
I0613 23:37:29.887528  5922 slave.cpp:249] Flags at startup: --acls="" --appc_simple_discovery_uri_prefix="http://"
--appc_store_dir="/tmp/Endpoint_SlaveEndpointTest_UnauthorizedRequest_0_BCEDda/store/appc"
--authenticate_http_readonly="true" --authenticate_http_readwrite="true" --authenticatee="crammd5"
--authentication_backoff_factor="1secs" --authorizer="local" --cgroups_cpu_enable_pids_and_tids_count="false"
--cgroups_enable_cfs="false" --cgroups_hierarchy="/sys/fs/cgroup" --cgroups_limit_swap="false"
--cgroups_root="mesos" --container_disk_watch_interval="15secs" --containerizers="mesos" --credential="/tmp/Endpoint_SlaveEndpointTest_UnauthorizedRequest_0_BCEDda/credential"
--default_role="*" --disk_watch_interval="1mins" --docker="docker" --docker_kill_orphans="true"
--docker_registry="https://registry-1.docker.io" --docker_remove_delay="6hrs" --docker_socket="/var/run/docker.sock"
--docker_stop_timeout="0ns" --docker_store_dir="/tmp/Endpoint_SlaveEndpointTest_UnauthorizedRequest_0_BCEDda/store/docker"
--docker_volume_checkpoint_dir="/var/run/mesos/isolators/docker/volume" --enforce_container_disk_quota="false"
--executor_registration_timeout="1mins" --executor_reregistration_timeout="2secs" --executor_shutdown_grace_period="5secs"
--fetcher_cache_dir="/tmp/Endpoint_SlaveEndpointTest_UnauthorizedRequest_0_BCEDda/fetch" --fetcher_cache_size="2GB"
--frameworks_home="" --gc_delay="1weeks" --gc_disk_headroom="0.1" --hadoop_home="" --help="false"
--hostname_lookup="true" --http_command_executor="false" --http_credentials="/tmp/Endpoint_SlaveEndpointTest_UnauthorizedRequest_0_BCEDda/http_credentials"
--http_heartbeat_interval="30secs" --initialize_driver_logging="true" --isolation="posix/cpu,posix/mem"
--launcher="posix" --launcher_dir="/mesos/mesos-1.4.0/_build/src" --logbufsecs="0" --logging_level="INFO"
--max_completed_executors_per_framework="150" --oversubscribed_resources_interval="15secs"
--perf_duration="10secs" --perf_interval="1mins" --port="5051" --qos_correction_interval_min="0ns"
--quiet="false" --recover="reconnect" --recovery_timeout="15mins" --registration_backoff_factor="10ms"
--resources="cpus:2;gpus:0;mem:1024;disk:1024;ports:[31000-32000]" --revocable_cpu_low_priority="true"
--runtime_dir="/tmp/Endpoint_SlaveEndpointTest_UnauthorizedRequest_0_BCEDda" --sandbox_directory="/mnt/mesos/sandbox"
--strict="true" --switch_user="true" --systemd_enable_support="true" --systemd_runtime_directory="/run/systemd/system"
--version="false" --work_dir="/tmp/Endpoint_SlaveEndpointTest_UnauthorizedRequest_0_l1oi3o"
I0613 23:37:29.887951  5922 credentials.hpp:86] Loading credential for authentication from
'/tmp/Endpoint_SlaveEndpointTest_UnauthorizedRequest_0_BCEDda/credential'
I0613 23:37:29.888110  5922 slave.cpp:281] Agent using credential for: test-principal
I0613 23:37:29.888133  5922 credentials.hpp:37] Loading credentials for authentication from
'/tmp/Endpoint_SlaveEndpointTest_UnauthorizedRequest_0_BCEDda/http_credentials'
I0613 23:37:29.888348  5922 http.cpp:975] Creating default 'basic' HTTP authenticator for
realm 'mesos-agent-readonly'
I0613 23:37:29.888494  5922 http.cpp:975] Creating default 'basic' HTTP authenticator for
realm 'mesos-agent-readwrite'
I0613 23:37:29.889812  5922 slave.cpp:552] Agent resources: cpus(*):2; mem(*):1024; disk(*):1024;
ports(*):[31000-32000]
I0613 23:37:29.889886  5922 slave.cpp:560] Agent attributes: [  ]
I0613 23:37:29.889899  5922 slave.cpp:565] Agent hostname: 6d20e28bf990
I0613 23:37:29.890070  5926 status_update_manager.cpp:177] Pausing sending status updates
I0613 23:37:29.891563  5934 state.cpp:62] Recovering state from '/tmp/Endpoint_SlaveEndpointTest_UnauthorizedRequest_0_l1oi3o/meta'
I0613 23:37:29.891896  5939 status_update_manager.cpp:203] Recovering status update manager
I0613 23:37:29.892101  5920 containerizer.cpp:582] Recovering containerizer
I0613 23:37:29.893602  5938 provisioner.cpp:416] Provisioner recovery complete
I0613 23:37:29.894032  5918 slave.cpp:6127] Finished recovery
I0613 23:37:29.894500  5918 slave.cpp:6309] Querying resource estimator for oversubscribable
resources
I0613 23:37:29.894765  5930 slave.cpp:6323] Received oversubscribable resources {} from the
resource estimator
I0613 23:37:29.896857  5937 process.cpp:3778] Handling HTTP event for process 'slave(759)'
with path: '/slave(759)/monitor/statistics'
I0613 23:37:29.898386  5929 http.cpp:1115] HTTP GET for /slave(759)/monitor/statistics from
172.17.0.3:47760
I0613 23:37:29.898454  5929 http.cpp:936] Authorizing principal 'test-principal' to GET the
'/monitor/statistics' endpoint
I0613 23:37:29.900825  5935 slave.cpp:817] Agent terminating
[       OK ] Endpoint/SlaveEndpointTest.UnauthorizedRequest/0 (28 ms)
[ RUN      ] Endpoint/SlaveEndpointTest.UnauthorizedRequest/1
I0613 23:37:29.912535  5898 containerizer.cpp:230] Using isolation: posix/cpu,posix/mem,filesystem/posix,network/cni,environment_secret
W0613 23:37:29.913080  5898 backend.cpp:76] Failed to create 'aufs' backend: AufsBackend requires
root privileges
W0613 23:37:29.913204  5898 backend.cpp:76] Failed to create 'bind' backend: BindBackend requires
root privileges
I0613 23:37:29.913246  5898 provisioner.cpp:255] Using default backend 'copy'
I0613 23:37:29.916777  5922 slave.cpp:248] Mesos agent started on (760)@172.17.0.3:42883
I0613 23:37:29.916810  5922 slave.cpp:249] Flags at startup: --acls="" --appc_simple_discovery_uri_prefix="http://"
--appc_store_dir="/tmp/Endpoint_SlaveEndpointTest_UnauthorizedRequest_1_Dmqu7c/store/appc"
--authenticate_http_readonly="true" --authenticate_http_readwrite="true" --authenticatee="crammd5"
--authentication_backoff_factor="1secs" --authorizer="local" --cgroups_cpu_enable_pids_and_tids_count="false"
--cgroups_enable_cfs="false" --cgroups_hierarchy="/sys/fs/cgroup" --cgroups_limit_swap="false"
--cgroups_root="mesos" --container_disk_watch_interval="15secs" --containerizers="mesos" --credential="/tmp/Endpoint_SlaveEndpointTest_UnauthorizedRequest_1_Dmqu7c/credential"
--default_role="*" --disk_watch_interval="1mins" --docker="docker" --docker_kill_orphans="true"
--docker_registry="https://registry-1.docker.io" --docker_remove_delay="6hrs" --docker_socket="/var/run/docker.sock"
--docker_stop_timeout="0ns" --docker_store_dir="/tmp/Endpoint_SlaveEndpointTest_UnauthorizedRequest_1_Dmqu7c/store/docker"
--docker_volume_checkpoint_dir="/var/run/mesos/isolators/docker/volume" --enforce_container_disk_quota="false"
--executor_registration_timeout="1mins" --executor_reregistration_timeout="2secs" --executor_shutdown_grace_period="5secs"
--fetcher_cache_dir="/tmp/Endpoint_SlaveEndpointTest_UnauthorizedRequest_1_Dmqu7c/fetch" --fetcher_cache_size="2GB"
--frameworks_home="" --gc_delay="1weeks" --gc_disk_headroom="0.1" --hadoop_home="" --help="false"
--hostname_lookup="true" --http_command_executor="false" --http_credentials="/tmp/Endpoint_SlaveEndpointTest_UnauthorizedRequest_1_Dmqu7c/http_credentials"
--http_heartbeat_interval="30secs" --initialize_driver_logging="true" --isolation="posix/cpu,posix/mem"
--launcher="posix" --launcher_dir="/mesos/mesos-1.4.0/_build/src" --logbufsecs="0" --logging_level="INFO"
--max_completed_executors_per_framework="150" --oversubscribed_resources_interval="15secs"
--perf_duration="10secs" --perf_interval="1mins" --port="5051" --qos_correction_interval_min="0ns"
--quiet="false" --recover="reconnect" --recovery_timeout="15mins" --registration_backoff_factor="10ms"
--resources="cpus:2;gpus:0;mem:1024;disk:1024;ports:[31000-32000]" --revocable_cpu_low_priority="true"
--runtime_dir="/tmp/Endpoint_SlaveEndpointTest_UnauthorizedRequest_1_Dmqu7c" --sandbox_directory="/mnt/mesos/sandbox"
--strict="true" --switch_user="true" --systemd_enable_support="true" --systemd_runtime_directory="/run/systemd/system"
--version="false" --work_dir="/tmp/Endpoint_SlaveEndpointTest_UnauthorizedRequest_1_3t1RSr"
I0613 23:37:29.917192  5922 credentials.hpp:86] Loading credential for authentication from
'/tmp/Endpoint_SlaveEndpointTest_UnauthorizedRequest_1_Dmqu7c/credential'
I0613 23:37:29.917332  5922 slave.cpp:281] Agent using credential for: test-principal
I0613 23:37:29.917353  5922 credentials.hpp:37] Loading credentials for authentication from
'/tmp/Endpoint_SlaveEndpointTest_UnauthorizedRequest_1_Dmqu7c/http_credentials'
I0613 23:37:29.917563  5922 http.cpp:975] Creating default 'basic' HTTP authenticator for
realm 'mesos-agent-readonly'
I0613 23:37:29.917692  5922 http.cpp:975] Creating default 'basic' HTTP authenticator for
realm 'mesos-agent-readwrite'
I0613 23:37:29.919040  5922 slave.cpp:552] Agent resources: cpus(*):2; mem(*):1024; disk(*):1024;
ports(*):[31000-32000]
I0613 23:37:29.919116  5922 slave.cpp:560] Agent attributes: [  ]
I0613 23:37:29.919127  5922 slave.cpp:565] Agent hostname: 6d20e28bf990
I0613 23:37:29.919277  5932 status_update_manager.cpp:177] Pausing sending status updates
I0613 23:37:29.920509  5928 state.cpp:62] Recovering state from '/tmp/Endpoint_SlaveEndpointTest_UnauthorizedRequest_1_3t1RSr/meta'
I0613 23:37:29.920985  5920 status_update_manager.cpp:203] Recovering status update manager
I0613 23:37:29.921315  5933 containerizer.cpp:582] Recovering containerizer
I0613 23:37:29.922863  5937 provisioner.cpp:416] Provisioner recovery complete
I0613 23:37:29.923285  5934 slave.cpp:6127] Finished recovery
I0613 23:37:29.923776  5934 slave.cpp:6309] Querying resource estimator for oversubscribable
resources
I0613 23:37:29.924041  5922 slave.cpp:6323] Received oversubscribable resources {} from the
resource estimator
I0613 23:37:29.926234  5921 process.cpp:3778] Handling HTTP event for process 'slave(760)'
with path: '/slave(760)/monitor/statistics.json'
I0613 23:37:29.927368  5934 http.cpp:1115] HTTP GET for /slave(760)/monitor/statistics.json
from 172.17.0.3:47764
I0613 23:37:29.927434  5934 http.cpp:936] Authorizing principal 'test-principal' to GET the
'/monitor/statistics.json' endpoint
I0613 23:37:29.929674  5934 slave.cpp:817] Agent terminating
[       OK ] Endpoint/SlaveEndpointTest.UnauthorizedRequest/1 (28 ms)
[ RUN      ] Endpoint/SlaveEndpointTest.UnauthorizedRequest/2
I0613 23:37:29.940233  5898 containerizer.cpp:230] Using isolation: posix/cpu,posix/mem,filesystem/posix,network/cni,environment_secret
W0613 23:37:29.940719  5898 backend.cpp:76] Failed to create 'aufs' backend: AufsBackend requires
root privileges
W0613 23:37:29.940814  5898 backend.cpp:76] Failed to create 'bind' backend: BindBackend requires
root privileges
I0613 23:37:29.940846  5898 provisioner.cpp:255] Using default backend 'copy'
I0613 23:37:29.944413  5922 slave.cpp:248] Mesos agent started on (761)@172.17.0.3:42883
I0613 23:37:29.944437  5922 slave.cpp:249] Flags at startup: --acls="" --appc_simple_discovery_uri_prefix="http://"
--appc_store_dir="/tmp/Endpoint_SlaveEndpointTest_UnauthorizedRequest_2_vq6aig/store/appc"
--authenticate_http_readonly="true" --authenticate_http_readwrite="true" --authenticatee="crammd5"
--authentication_backoff_factor="1secs" --authorizer="local" --cgroups_cpu_enable_pids_and_tids_count="false"
--cgroups_enable_cfs="false" --cgroups_hierarchy="/sys/fs/cgroup" --cgroups_limit_swap="false"
--cgroups_root="mesos" --container_disk_watch_interval="15secs" --containerizers="mesos" --credential="/tmp/Endpoint_SlaveEndpointTest_UnauthorizedRequest_2_vq6aig/credential"
--default_role="*" --disk_watch_interval="1mins" --docker="docker" --docker_kill_orphans="true"
--docker_registry="https://registry-1.docker.io" --docker_remove_delay="6hrs" --docker_socket="/var/run/docker.sock"
--docker_stop_timeout="0ns" --docker_store_dir="/tmp/Endpoint_SlaveEndpointTest_UnauthorizedRequest_2_vq6aig/store/docker"
--docker_volume_checkpoint_dir="/var/run/mesos/isolators/docker/volume" --enforce_container_disk_quota="false"
--executor_registration_timeout="1mins" --executor_reregistration_timeout="2secs" --executor_shutdown_grace_period="5secs"
--fetcher_cache_dir="/tmp/Endpoint_SlaveEndpointTest_UnauthorizedRequest_2_vq6aig/fetch" --fetcher_cache_size="2GB"
--frameworks_home="" --gc_delay="1weeks" --gc_disk_headroom="0.1" --hadoop_home="" --help="false"
--hostname_lookup="true" --http_command_executor="false" --http_credentials="/tmp/Endpoint_SlaveEndpointTest_UnauthorizedRequest_2_vq6aig/http_credentials"
--http_heartbeat_interval="30secs" --initialize_driver_logging="true" --isolation="posix/cpu,posix/mem"
--launcher="posix" --launcher_dir="/mesos/mesos-1.4.0/_build/src" --logbufsecs="0" --logging_level="INFO"
--max_completed_executors_per_framework="150" --oversubscribed_resources_interval="15secs"
--perf_duration="10secs" --perf_interval="1mins" --port="5051" --qos_correction_interval_min="0ns"
--quiet="false" --recover="reconnect" --recovery_timeout="15mins" --registration_backoff_factor="10ms"
--resources="cpus:2;gpus:0;mem:1024;disk:1024;ports:[31000-32000]" --revocable_cpu_low_priority="true"
--runtime_dir="/tmp/Endpoint_SlaveEndpointTest_UnauthorizedRequest_2_vq6aig" --sandbox_directory="/mnt/mesos/sandbox"
--strict="true" --switch_user="true" --systemd_enable_support="true" --systemd_runtime_directory="/run/systemd/system"
--version="false" --work_dir="/tmp/Endpoint_SlaveEndpointTest_UnauthorizedRequest_2_phVoZu"
I0613 23:37:29.944802  5922 credentials.hpp:86] Loading credential for authentication from
'/tmp/Endpoint_SlaveEndpointTest_UnauthorizedRequest_2_vq6aig/credential'
I0613 23:37:29.944939  5922 slave.cpp:281] Agent using credential for: test-principal
I0613 23:37:29.944959  5922 credentials.hpp:37] Loading credentials for authentication from
'/tmp/Endpoint_SlaveEndpointTest_UnauthorizedRequest_2_vq6aig/http_credentials'
I0613 23:37:29.945194  5922 http.cpp:975] Creating default 'basic' HTTP authenticator for
realm 'mesos-agent-readonly'
I0613 23:37:29.945325  5922 http.cpp:975] Creating default 'basic' HTTP authenticator for
realm 'mesos-agent-readwrite'
I0613 23:37:29.946638  5922 slave.cpp:552] Agent resources: cpus(*):2; mem(*):1024; disk(*):1024;
ports(*):[31000-32000]
I0613 23:37:29.946750  5922 slave.cpp:560] Agent attributes: [  ]
I0613 23:37:29.946764  5922 slave.cpp:565] Agent hostname: 6d20e28bf990
I0613 23:37:29.946897  5921 status_update_manager.cpp:177] Pausing sending status updates
I0613 23:37:29.948503  5937 state.cpp:62] Recovering state from '/tmp/Endpoint_SlaveEndpointTest_UnauthorizedRequest_2_phVoZu/meta'
I0613 23:37:29.948868  5917 status_update_manager.cpp:203] Recovering status update manager
I0613 23:37:29.949048  5918 containerizer.cpp:582] Recovering containerizer
I0613 23:37:29.950728  5931 provisioner.cpp:416] Provisioner recovery complete
I0613 23:37:29.951131  5932 slave.cpp:6127] Finished recovery
I0613 23:37:29.951658  5932 slave.cpp:6309] Querying resource estimator for oversubscribable
resources
I0613 23:37:29.951920  5936 slave.cpp:6323] Received oversubscribable resources {} from the
resource estimator
I0613 23:37:29.954056  5920 process.cpp:3778] Handling HTTP event for process 'slave(761)'
with path: '/slave(761)/containers'
I0613 23:37:29.955410  5935 http.cpp:1115] HTTP GET for /slave(761)/containers from 172.17.0.3:47766
I0613 23:37:29.955487  5935 http.cpp:936] Authorizing principal 'test-principal' to GET the
'/containers' endpoint
I0613 23:37:29.957901  5934 slave.cpp:817] Agent terminating
[       OK ] Endpoint/SlaveEndpointTest.UnauthorizedRequest/2 (28 ms)
[ RUN      ] Endpoint/SlaveEndpointTest.NoAuthorizer/0
I0613 23:37:29.969300  5898 containerizer.cpp:230] Using isolation: posix/cpu,posix/mem,filesystem/posix,network/cni,environment_secret
W0613 23:37:29.969851  5898 backend.cpp:76] Failed to create 'aufs' backend: AufsBackend requires
root privileges
W0613 23:37:29.969959  5898 backend.cpp:76] Failed to create 'bind' backend: BindBackend requires
root privileges
I0613 23:37:29.969990  5898 provisioner.cpp:255] Using default backend 'copy'
I0613 23:37:29.972023  5898 cluster.cpp:448] Creating default 'local' authorizer
I0613 23:37:29.973892  5931 slave.cpp:248] Mesos agent started on (762)@172.17.0.3:42883
I0613 23:37:29.973918  5931 slave.cpp:249] Flags at startup: --acls="" --appc_simple_discovery_uri_prefix="http://"
--appc_store_dir="/tmp/Endpoint_SlaveEndpointTest_NoAuthorizer_0_3snRJj/store/appc" --authenticate_http_readonly="true"
--authenticate_http_readwrite="true" --authenticatee="crammd5" --authentication_backoff_factor="1secs"
--authorizer="local" --cgroups_cpu_enable_pids_and_tids_count="false" --cgroups_enable_cfs="false"
--cgroups_hierarchy="/sys/fs/cgroup" --cgroups_limit_swap="false" --cgroups_root="mesos" --container_disk_watch_interval="15secs"
--containerizers="mesos" --credential="/tmp/Endpoint_SlaveEndpointTest_NoAuthorizer_0_3snRJj/credential"
--default_role="*" --disk_watch_interval="1mins" --docker="docker" --docker_kill_orphans="true"
--docker_registry="https://registry-1.docker.io" --docker_remove_delay="6hrs" --docker_socket="/var/run/docker.sock"
--docker_stop_timeout="0ns" --docker_store_dir="/tmp/Endpoint_SlaveEndpointTest_NoAuthorizer_0_3snRJj/store/docker"
--docker_volume_checkpoint_dir="/var/run/mesos/isolators/docker/volume" --enforce_container_disk_quota="false"
--executor_registration_timeout="1mins" --executor_reregistration_timeout="2secs" --executor_shutdown_grace_period="5secs"
--fetcher_cache_dir="/tmp/Endpoint_SlaveEndpointTest_NoAuthorizer_0_3snRJj/fetch" --fetcher_cache_size="2GB"
--frameworks_home="" --gc_delay="1weeks" --gc_disk_headroom="0.1" --hadoop_home="" --help="false"
--hostname_lookup="true" --http_command_executor="false" --http_credentials="/tmp/Endpoint_SlaveEndpointTest_NoAuthorizer_0_3snRJj/http_credentials"
--http_heartbeat_interval="30secs" --initialize_driver_logging="true" --isolation="posix/cpu,posix/mem"
--launcher="posix" --launcher_dir="/mesos/mesos-1.4.0/_build/src" --logbufsecs="0" --logging_level="INFO"
--max_completed_executors_per_framework="150" --oversubscribed_resources_interval="15secs"
--perf_duration="10secs" --perf_interval="1mins" --port="5051" --qos_correction_interval_min="0ns"
--quiet="false" --recover="reconnect" --recovery_timeout="15mins" --registration_backoff_factor="10ms"
--resources="cpus:2;gpus:0;mem:1024;disk:1024;ports:[31000-32000]" --revocable_cpu_low_priority="true"
--runtime_dir="/tmp/Endpoint_SlaveEndpointTest_NoAuthorizer_0_3snRJj" --sandbox_directory="/mnt/mesos/sandbox"
--strict="true" --switch_user="true" --systemd_enable_support="true" --systemd_runtime_directory="/run/systemd/system"
--version="false" --work_dir="/tmp/Endpoint_SlaveEndpointTest_NoAuthorizer_0_Xd2Nmy"
I0613 23:37:29.974299  5931 credentials.hpp:86] Loading credential for authentication from
'/tmp/Endpoint_SlaveEndpointTest_NoAuthorizer_0_3snRJj/credential'
I0613 23:37:29.974462  5931 slave.cpp:281] Agent using credential for: test-principal
I0613 23:37:29.974486  5931 credentials.hpp:37] Loading credentials for authentication from
'/tmp/Endpoint_SlaveEndpointTest_NoAuthorizer_0_3snRJj/http_credentials'
I0613 23:37:29.974723  5931 http.cpp:975] Creating default 'basic' HTTP authenticator for
realm 'mesos-agent-readonly'
I0613 23:37:29.975116  5931 http.cpp:975] Creating default 'basic' HTTP authenticator for
realm 'mesos-agent-readwrite'
I0613 23:37:29.976477  5931 slave.cpp:552] Agent resources: cpus(*):2; mem(*):1024; disk(*):1024;
ports(*):[31000-32000]
I0613 23:37:29.976552  5931 slave.cpp:560] Agent attributes: [  ]
I0613 23:37:29.976563  5931 slave.cpp:565] Agent hostname: 6d20e28bf990
I0613 23:37:29.976691  5940 status_update_manager.cpp:177] Pausing sending status updates
I0613 23:37:29.978036  5938 state.cpp:62] Recovering state from '/tmp/Endpoint_SlaveEndpointTest_NoAuthorizer_0_Xd2Nmy/meta'
I0613 23:37:29.978387  5932 status_update_manager.cpp:203] Recovering status update manager
I0613 23:37:29.978719  5918 containerizer.cpp:582] Recovering containerizer
I0613 23:37:29.980221  5927 provisioner.cpp:416] Provisioner recovery complete
I0613 23:37:29.980587  5931 slave.cpp:6127] Finished recovery
I0613 23:37:29.981092  5931 slave.cpp:6309] Querying resource estimator for oversubscribable
resources
I0613 23:37:29.981387  5930 slave.cpp:6323] Received oversubscribable resources {} from the
resource estimator
I0613 23:37:29.983402  5939 process.cpp:3778] Handling HTTP event for process 'slave(762)'
with path: '/slave(762)/monitor/statistics'
I0613 23:37:29.984724  5935 http.cpp:1115] HTTP GET for /slave(762)/monitor/statistics from
172.17.0.3:47768
I0613 23:37:29.984797  5935 http.cpp:936] Authorizing principal 'test-principal' to GET the
'/monitor/statistics' endpoint
I0613 23:37:29.988368  5935 slave.cpp:817] Agent terminating
[       OK ] Endpoint/SlaveEndpointTest.NoAuthorizer/0 (30 ms)
[ RUN      ] Endpoint/SlaveEndpointTest.NoAuthorizer/1
I0613 23:37:30.000604  5898 containerizer.cpp:230] Using isolation: posix/cpu,posix/mem,filesystem/posix,network/cni,environment_secret
W0613 23:37:30.001148  5898 backend.cpp:76] Failed to create 'aufs' backend: AufsBackend requires
root privileges
W0613 23:37:30.001251  5898 backend.cpp:76] Failed to create 'bind' backend: BindBackend requires
root privileges
I0613 23:37:30.001292  5898 provisioner.cpp:255] Using default backend 'copy'
I0613 23:37:30.003198  5898 cluster.cpp:448] Creating default 'local' authorizer
I0613 23:37:30.004937  5921 slave.cpp:248] Mesos agent started on (763)@172.17.0.3:42883
I0613 23:37:30.004959  5921 slave.cpp:249] Flags at startup: --acls="" --appc_simple_discovery_uri_prefix="http://"
--appc_store_dir="/tmp/Endpoint_SlaveEndpointTest_NoAuthorizer_1_pwURtn/store/appc" --authenticate_http_readonly="true"
--authenticate_http_readwrite="true" --authenticatee="crammd5" --authentication_backoff_factor="1secs"
--authorizer="local" --cgroups_cpu_enable_pids_and_tids_count="false" --cgroups_enable_cfs="false"
--cgroups_hierarchy="/sys/fs/cgroup" --cgroups_limit_swap="false" --cgroups_root="mesos" --container_disk_watch_interval="15secs"
--containerizers="mesos" --credential="/tmp/Endpoint_SlaveEndpointTest_NoAuthorizer_1_pwURtn/credential"
--default_role="*" --disk_watch_interval="1mins" --docker="docker" --docker_kill_orphans="true"
--docker_registry="https://registry-1.docker.io" --docker_remove_delay="6hrs" --docker_socket="/var/run/docker.sock"
--docker_stop_timeout="0ns" --docker_store_dir="/tmp/Endpoint_SlaveEndpointTest_NoAuthorizer_1_pwURtn/store/docker"
--docker_volume_checkpoint_dir="/var/run/mesos/isolators/docker/volume" --enforce_container_disk_quota="false"
--executor_registration_timeout="1mins" --executor_reregistration_timeout="2secs" --executor_shutdown_grace_period="5secs"
--fetcher_cache_dir="/tmp/Endpoint_SlaveEndpointTest_NoAuthorizer_1_pwURtn/fetch" --fetcher_cache_size="2GB"
--frameworks_home="" --gc_delay="1weeks" --gc_disk_headroom="0.1" --hadoop_home="" --help="false"
--hostname_lookup="true" --http_command_executor="false" --http_credentials="/tmp/Endpoint_SlaveEndpointTest_NoAuthorizer_1_pwURtn/http_credentials"
--http_heartbeat_interval="30secs" --initialize_driver_logging="true" --isolation="posix/cpu,posix/mem"
--launcher="posix" --launcher_dir="/mesos/mesos-1.4.0/_build/src" --logbufsecs="0" --logging_level="INFO"
--max_completed_executors_per_framework="150" --oversubscribed_resources_interval="15secs"
--perf_duration="10secs" --perf_interval="1mins" --port="5051" --qos_correction_interval_min="0ns"
--quiet="false" --recover="reconnect" --recovery_timeout="15mins" --registration_backoff_factor="10ms"
--resources="cpus:2;gpus:0;mem:1024;disk:1024;ports:[31000-32000]" --revocable_cpu_low_priority="true"
--runtime_dir="/tmp/Endpoint_SlaveEndpointTest_NoAuthorizer_1_pwURtn" --sandbox_directory="/mnt/mesos/sandbox"
--strict="true" --switch_user="true" --systemd_enable_support="true" --systemd_runtime_directory="/run/systemd/system"
--version="false" --work_dir="/tmp/Endpoint_SlaveEndpointTest_NoAuthorizer_1_PJda2B"
I0613 23:37:30.005462  5921 credentials.hpp:86] Loading credential for authentication from
'/tmp/Endpoint_SlaveEndpointTest_NoAuthorizer_1_pwURtn/credential'
I0613 23:37:30.005661  5921 slave.cpp:281] Agent using credential for: test-principal
I0613 23:37:30.005689  5921 credentials.hpp:37] Loading credentials for authentication from
'/tmp/Endpoint_SlaveEndpointTest_NoAuthorizer_1_pwURtn/http_credentials'
I0613 23:37:30.006026  5921 http.cpp:975] Creating default 'basic' HTTP authenticator for
realm 'mesos-agent-readonly'
I0613 23:37:30.006361  5921 http.cpp:975] Creating default 'basic' HTTP authenticator for
realm 'mesos-agent-readwrite'
I0613 23:37:30.007627  5921 slave.cpp:552] Agent resources: cpus(*):2; mem(*):1024; disk(*):1024;
ports(*):[31000-32000]
I0613 23:37:30.007699  5921 slave.cpp:560] Agent attributes: [  ]
I0613 23:37:30.007711  5921 slave.cpp:565] Agent hostname: 6d20e28bf990
I0613 23:37:30.007851  5917 status_update_manager.cpp:177] Pausing sending status updates
I0613 23:37:30.009588  5933 state.cpp:62] Recovering state from '/tmp/Endpoint_SlaveEndpointTest_NoAuthorizer_1_PJda2B/meta'
I0613 23:37:30.010170  5925 status_update_manager.cpp:203] Recovering status update manager
I0613 23:37:30.010527  5932 containerizer.cpp:582] Recovering containerizer
I0613 23:37:30.012045  5931 provisioner.cpp:416] Provisioner recovery complete
I0613 23:37:30.012559  5934 slave.cpp:6127] Finished recovery
I0613 23:37:30.013029  5934 slave.cpp:6309] Querying resource estimator for oversubscribable
resources
I0613 23:37:30.013335  5940 slave.cpp:6323] Received oversubscribable resources {} from the
resource estimator
I0613 23:37:30.015584  5934 process.cpp:3778] Handling HTTP event for process 'slave(763)'
with path: '/slave(763)/monitor/statistics.json'
I0613 23:37:30.016880  5928 http.cpp:1115] HTTP GET for /slave(763)/monitor/statistics.json
from 172.17.0.3:47772
I0613 23:37:30.016947  5928 http.cpp:936] Authorizing principal 'test-principal' to GET the
'/monitor/statistics.json' endpoint
I0613 23:37:30.020531  5917 slave.cpp:817] Agent terminating
[       OK ] Endpoint/SlaveEndpointTest.NoAuthorizer/1 (31 ms)
[ RUN      ] Endpoint/SlaveEndpointTest.NoAuthorizer/2
I0613 23:37:30.031383  5898 containerizer.cpp:230] Using isolation: posix/cpu,posix/mem,filesystem/posix,network/cni,environment_secret
W0613 23:37:30.031883  5898 backend.cpp:76] Failed to create 'aufs' backend: AufsBackend requires
root privileges
W0613 23:37:30.031975  5898 backend.cpp:76] Failed to create 'bind' backend: BindBackend requires
root privileges
I0613 23:37:30.032007  5898 provisioner.cpp:255] Using default backend 'copy'
I0613 23:37:30.034790  5898 cluster.cpp:448] Creating default 'local' authorizer
I0613 23:37:30.037444  5927 slave.cpp:248] Mesos agent started on (764)@172.17.0.3:42883
I0613 23:37:30.037466  5927 slave.cpp:249] Flags at startup: --acls="" --appc_simple_discovery_uri_prefix="http://"
--appc_store_dir="/tmp/Endpoint_SlaveEndpointTest_NoAuthorizer_2_zNtvwr/store/appc" --authenticate_http_readonly="true"
--authenticate_http_readwrite="true" --authenticatee="crammd5" --authentication_backoff_factor="1secs"
--authorizer="local" --cgroups_cpu_enable_pids_and_tids_count="false" --cgroups_enable_cfs="false"
--cgroups_hierarchy="/sys/fs/cgroup" --cgroups_limit_swap="false" --cgroups_root="mesos" --container_disk_watch_interval="15secs"
--containerizers="mesos" --credential="/tmp/Endpoint_SlaveEndpointTest_NoAuthorizer_2_zNtvwr/credential"
--default_role="*" --disk_watch_interval="1mins" --docker="docker" --docker_kill_orphans="true"
--docker_registry="https://registry-1.docker.io" --docker_remove_delay="6hrs" --docker_socket="/var/run/docker.sock"
--docker_stop_timeout="0ns" --docker_store_dir="/tmp/Endpoint_SlaveEndpointTest_NoAuthorizer_2_zNtvwr/store/docker"
--docker_volume_checkpoint_dir="/var/run/mesos/isolators/docker/volume" --enforce_container_disk_quota="false"
--executor_registration_timeout="1mins" --executor_reregistration_timeout="2secs" --executor_shutdown_grace_period="5secs"
--fetcher_cache_dir="/tmp/Endpoint_SlaveEndpointTest_NoAuthorizer_2_zNtvwr/fetch" --fetcher_cache_size="2GB"
--frameworks_home="" --gc_delay="1weeks" --gc_disk_headroom="0.1" --hadoop_home="" --help="false"
--hostname_lookup="true" --http_command_executor="false" --http_credentials="/tmp/Endpoint_SlaveEndpointTest_NoAuthorizer_2_zNtvwr/http_credentials"
--http_heartbeat_interval="30secs" --initialize_driver_logging="true" --isolation="posix/cpu,posix/mem"
--launcher="posix" --launcher_dir="/mesos/mesos-1.4.0/_build/src" --logbufsecs="0" --logging_level="INFO"
--max_completed_executors_per_framework="150" --oversubscribed_resources_interval="15secs"
--perf_duration="10secs" --perf_interval="1mins" --port="5051" --qos_correction_interval_min="0ns"
--quiet="false" --recover="reconnect" --recovery_timeout="15mins" --registration_backoff_factor="10ms"
--resources="cpus:2;gpus:0;mem:1024;disk:1024;ports:[31000-32000]" --revocable_cpu_low_priority="true"
--runtime_dir="/tmp/Endpoint_SlaveEndpointTest_NoAuthorizer_2_zNtvwr" --sandbox_directory="/mnt/mesos/sandbox"
--strict="true" --switch_user="true" --systemd_enable_support="true" --systemd_runtime_directory="/run/systemd/system"
--version="false" --work_dir="/tmp/Endpoint_SlaveEndpointTest_NoAuthorizer_2_P6Hb0F"
I0613 23:37:30.037847  5927 credentials.hpp:86] Loading credential for authentication from
'/tmp/Endpoint_SlaveEndpointTest_NoAuthorizer_2_zNtvwr/credential'
I0613 23:37:30.037997  5927 slave.cpp:281] Agent using credential for: test-principal
I0613 23:37:30.038018  5927 credentials.hpp:37] Loading credentials for authentication from
'/tmp/Endpoint_SlaveEndpointTest_NoAuthorizer_2_zNtvwr/http_credentials'
I0613 23:37:30.038249  5927 http.cpp:975] Creating default 'basic' HTTP authenticator for
realm 'mesos-agent-readonly'
I0613 23:37:30.038378  5927 http.cpp:975] Creating default 'basic' HTTP authenticator for
realm 'mesos-agent-readwrite'
I0613 23:37:30.039548  5927 slave.cpp:552] Agent resources: cpus(*):2; mem(*):1024; disk(*):1024;
ports(*):[31000-32000]
I0613 23:37:30.039620  5927 slave.cpp:560] Agent attributes: [  ]
I0613 23:37:30.039635  5927 slave.cpp:565] Agent hostname: 6d20e28bf990
I0613 23:37:30.039796  5918 status_update_manager.cpp:177] Pausing sending status updates
I0613 23:37:30.040968  5934 state.cpp:62] Recovering state from '/tmp/Endpoint_SlaveEndpointTest_NoAuthorizer_2_P6Hb0F/meta'
I0613 23:37:30.041338  5922 status_update_manager.cpp:203] Recovering status update manager
I0613 23:37:30.041601  5919 containerizer.cpp:582] Recovering containerizer
I0613 23:37:30.043225  5933 provisioner.cpp:416] Provisioner recovery complete
I0613 23:37:30.043733  5927 slave.cpp:6127] Finished recovery
I0613 23:37:30.044181  5927 slave.cpp:6309] Querying resource estimator for oversubscribable
resources
I0613 23:37:30.044442  5938 slave.cpp:6323] Received oversubscribable resources {} from the
resource estimator
I0613 23:37:30.046561  5919 process.cpp:3778] Handling HTTP event for process 'slave(764)'
with path: '/slave(764)/containers'
I0613 23:37:30.047951  5930 http.cpp:1115] HTTP GET for /slave(764)/containers from 172.17.0.3:47774
I0613 23:37:30.048032  5930 http.cpp:936] Authorizing principal 'test-principal' to GET the
'/containers' endpoint
I0613 23:37:30.051610  5929 slave.cpp:817] Agent terminating
[       OK ] Endpoint/SlaveEndpointTest.NoAuthorizer/2 (32 ms)
[----------] 9 tests from Endpoint/SlaveEndpointTest (274 ms total)

[----------] Global test environment tear-down
[==========] 1589 tests from 176 test cases ran. (551006 ms total)
[  PASSED  ] 1588 tests.
[  FAILED  ] 1 test, listed below:
[  FAILED  ] MasterTest.IgnoreOldAgentReregistration

 1 FAILED TEST
  YOU HAVE 19 DISABLED TESTS

E0613 23:37:30.122125  5941 process.cpp:968] Failed to accept socket: future discarded
make[4]: *** [check-local] Error 1
make[4]: Leaving directory `/mesos/mesos-1.4.0/_build/src'
make[3]: *** [check-am] Error 2
make[3]: Leaving directory `/mesos/mesos-1.4.0/_build/src'
make[2]: *** [check] Error 2
make[2]: Leaving directory `/mesos/mesos-1.4.0/_build/src'
make[1]: *** [check-recursive] Error 1
make[1]: Leaving directory `/mesos/mesos-1.4.0/_build'
make: *** [distcheck] Error 1
+ docker rmi mesos-1497394515-25751
Untagged: mesos-1497394515-25751:latest
Deleted: sha256:207d8d0cf0f907576454d872f5761b49ff4dc6674c9edf816857ef31948dbee7
Deleted: sha256:dc640c9143e8f2ad31f3a379b65be8f25e002ca1003774fd39238891d98bd77f
Deleted: sha256:c0f1ea65bbcf49bb6bdbfaef6cb7e86a9fb97c3df9de9dc80a0a67bc42832e3d
Deleted: sha256:5f5fce0c19a227dd7d2f88dea44610acb3b6f23a1664b3ec95d207455d17e920
Deleted: sha256:fcaf7ae590eb621da25c8f8ad8888ba408fb0c7f797cd70f81e1464d03954dfd
Deleted: sha256:1b9857f4bdefbcdb3b1fa24e0b392b5fa53f63251b2fe3c2e01802fa8555d0b8
Deleted: sha256:967d32108e6be03373d5f7b14ab148d3582fbf1bf3b44f34f1cfa21d5d357551
Deleted: sha256:0292d357fc372686a6b1ff58877408107961a0721e63fcff02c1da9d4b8d5624
Deleted: sha256:5e7c179b6686aa2285620a4a83ff32b9200a24741a09f75c82a79937e7e51cc7
Deleted: sha256:9d940eb5449ec81d997b7ed10f8f760d0cd9c068451b28c13025f0de04699010
Deleted: sha256:4e4bd755ae3e060a5a539b951d41ef2f12a668cbc72077e16f2acd4687a5ec2a
Deleted: sha256:aaa110e99dbb459a816dc92bc49451492bccdd256eb45887052a4e62728f0335
Deleted: sha256:7c2c529c4e708999e8ef89377a432d9886f3b653527b2bf36a188b39fed54eee
Deleted: sha256:2caec3090996e247a0c84ee00981d78a387610cb6e84c7e0ab5ae1ce1926fdc5
Deleted: sha256:64e7c3f9ddb9df5a2423f2e63359873d5ab6c03efb6b8cb29b9a6ed70e4e352b
Deleted: sha256:5de8b3e4c29e1681fe6a54b2337e2f957cb64615f97a40aa4e42b43c6b6dedf5
Deleted: sha256:95adf82fbee098682a66c0ca9b77cf94dace8819603b5703e85a42aec10381f0
Deleted: sha256:7b0ede0e2b91201c0442eaca21554d666a2e473446f650296db61888d724f626
Deleted: sha256:7ee43599804efbee322cf6887f27cb57181e4c88dadb0e01100bc05f72487e26
Deleted: sha256:1d08f592aa9537b4d32738c1e09f0e6eb810f0fcf0dd5608bd46e668eda25d51
Deleted: sha256:b7b88081f462bfce3504b7402c75a8bcbd5d13d853f47ecfc17f9678ba276b4e
Deleted: sha256:bcbf210bd34e0733680f92591e0adf30dd45041a7e1c58d6ac3204a8d67bacf2
Deleted: sha256:a4a4dad480890a7b63400b1db92c92f0936eb31353b06e69c7caa801ea66e411
Deleted: sha256:741663491e4b22553c95e76106675f5e1a1cbcb4a8c8a02091cf5e13a48a2822
Deleted: sha256:e69a57f9170a0e562ff0875401d6df740fcc0d2fdcb34560f84bf6cb630335e5
Build step 'Execute shell' marked build as failure
Not sending mail to unregistered user neil.conway@gmail.com

Mime
View raw message