mesos-builds mailing list archives

Site index · List index
Message view « Date » · « Thread »
Top « Date » · « Thread »
From Apache Jenkins Server <jenk...@builds.apache.org>
Subject Build failed in Jenkins: Mesos-Reviewbot #18405
Date Sat, 17 Jun 2017 16:09:54 GMT
See <https://builds.apache.org/job/Mesos-Reviewbot/18405/display/redirect?page=changes>

Changes:

[alexr] Removed superfluous log message in docker containerizer.

------------------------------------------
[...truncated 28.53 MB...]
I0617 16:09:47.604957  4585 containerizer.cpp:230] Using isolation: posix/cpu,posix/mem,filesystem/posix,network/cni,environment_secret
W0617 16:09:47.605718  4585 backend.cpp:76] Failed to create 'overlay' backend: OverlayBackend
requires root privileges
W0617 16:09:47.605914  4585 backend.cpp:76] Failed to create 'bind' backend: BindBackend requires
root privileges
I0617 16:09:47.605962  4585 provisioner.cpp:255] Using default backend 'copy'
I0617 16:09:47.611207  4605 slave.cpp:249] Mesos agent started on (764)@172.17.0.2:46709
I0617 16:09:47.611245  4605 slave.cpp:250] Flags at startup: --acls="" --appc_simple_discovery_uri_prefix="http://"
--appc_store_dir="/tmp/Endpoint_SlaveEndpointTest_AuthorizedRequest_2_FrOWFP/store/appc" --authenticate_http_readonly="true"
--authenticate_http_readwrite="true" --authenticatee="crammd5" --authentication_backoff_factor="1secs"
--authorizer="local" --cgroups_cpu_enable_pids_and_tids_count="false" --cgroups_enable_cfs="false"
--cgroups_hierarchy="/sys/fs/cgroup" --cgroups_limit_swap="false" --cgroups_root="mesos" --container_disk_watch_interval="15secs"
--containerizers="mesos" --credential="/tmp/Endpoint_SlaveEndpointTest_AuthorizedRequest_2_FrOWFP/credential"
--default_role="*" --disk_watch_interval="1mins" --docker="docker" --docker_kill_orphans="true"
--docker_registry="https://registry-1.docker.io" --docker_remove_delay="6hrs" --docker_socket="/var/run/docker.sock"
--docker_stop_timeout="0ns" --docker_store_dir="/tmp/Endpoint_SlaveEndpointTest_AuthorizedRequest_2_FrOWFP/store/docker"
--docker_volume_checkpoint_dir="/var/run/mesos/isolators/docker/volume" --enforce_container_disk_quota="false"
--executor_registration_timeout="1mins" --executor_reregistration_timeout="2secs" --executor_shutdown_grace_period="5secs"
--fetcher_cache_dir="/tmp/Endpoint_SlaveEndpointTest_AuthorizedRequest_2_FrOWFP/fetch" --fetcher_cache_size="2GB"
--frameworks_home="" --gc_delay="1weeks" --gc_disk_headroom="0.1" --hadoop_home="" --help="false"
--hostname_lookup="true" --http_command_executor="false" --http_credentials="/tmp/Endpoint_SlaveEndpointTest_AuthorizedRequest_2_FrOWFP/http_credentials"
--http_heartbeat_interval="30secs" --initialize_driver_logging="true" --isolation="posix/cpu,posix/mem"
--launcher="posix" --launcher_dir="/mesos/mesos-1.4.0/_build/src" --logbufsecs="0" --logging_level="INFO"
--max_completed_executors_per_framework="150" --oversubscribed_resources_interval="15secs"
--perf_duration="10secs" --perf_interval="1mins" --port="5051" --qos_correction_interval_min="0ns"
--quiet="false" --recover="reconnect" --recovery_timeout="15mins" --registration_backoff_factor="10ms"
--resources="cpus:2;gpus:0;mem:1024;disk:1024;ports:[31000-32000]" --revocable_cpu_low_priority="true"
--runtime_dir="/tmp/Endpoint_SlaveEndpointTest_AuthorizedRequest_2_FrOWFP" --sandbox_directory="/mnt/mesos/sandbox"
--strict="true" --switch_user="true" --systemd_enable_support="true" --systemd_runtime_directory="/run/systemd/system"
--version="false" --work_dir="/tmp/Endpoint_SlaveEndpointTest_AuthorizedRequest_2_SG0Gbb"
I0617 16:09:47.612051  4605 credentials.hpp:86] Loading credential for authentication from
'/tmp/Endpoint_SlaveEndpointTest_AuthorizedRequest_2_FrOWFP/credential'
I0617 16:09:47.612432  4605 slave.cpp:282] Agent using credential for: test-principal
I0617 16:09:47.612458  4605 credentials.hpp:37] Loading credentials for authentication from
'/tmp/Endpoint_SlaveEndpointTest_AuthorizedRequest_2_FrOWFP/http_credentials'
I0617 16:09:47.612931  4605 http.cpp:975] Creating default 'basic' HTTP authenticator for
realm 'mesos-agent-readonly'
I0617 16:09:47.613236  4605 http.cpp:975] Creating default 'basic' HTTP authenticator for
realm 'mesos-agent-readwrite'
I0617 16:09:47.615494  4605 slave.cpp:553] Agent resources: cpus(*):2; mem(*):1024; disk(*):1024;
ports(*):[31000-32000]
I0617 16:09:47.615643  4605 slave.cpp:561] Agent attributes: [  ]
I0617 16:09:47.615662  4605 slave.cpp:566] Agent hostname: 25a226265524
I0617 16:09:47.616004  4611 status_update_manager.cpp:177] Pausing sending status updates
I0617 16:09:47.618880  4605 state.cpp:62] Recovering state from '/tmp/Endpoint_SlaveEndpointTest_AuthorizedRequest_2_SG0Gbb/meta'
I0617 16:09:47.619550  4604 status_update_manager.cpp:203] Recovering status update manager
I0617 16:09:47.619947  4609 containerizer.cpp:582] Recovering containerizer
I0617 16:09:47.622253  4604 provisioner.cpp:416] Provisioner recovery complete
I0617 16:09:47.622990  4609 slave.cpp:6128] Finished recovery
I0617 16:09:47.623790  4609 slave.cpp:6310] Querying resource estimator for oversubscribable
resources
I0617 16:09:47.624239  4609 slave.cpp:6324] Received oversubscribable resources {} from the
resource estimator
I0617 16:09:47.628312  4609 process.cpp:3779] Handling HTTP event for process 'slave(764)'
with path: '/slave(764)/containers'
I0617 16:09:47.630455  4611 http.cpp:1115] HTTP GET for /slave(764)/containers from 172.17.0.2:40800
I0617 16:09:47.630776  4611 http.cpp:936] Authorizing principal 'test-principal' to GET the
'/containers' endpoint
I0617 16:09:47.636416  4604 slave.cpp:818] Agent terminating
[       OK ] Endpoint/SlaveEndpointTest.AuthorizedRequest/2 (48 ms)
[ RUN      ] Endpoint/SlaveEndpointTest.UnauthorizedRequest/0
I0617 16:09:47.653404  4585 containerizer.cpp:230] Using isolation: posix/cpu,posix/mem,filesystem/posix,network/cni,environment_secret
W0617 16:09:47.654181  4585 backend.cpp:76] Failed to create 'overlay' backend: OverlayBackend
requires root privileges
W0617 16:09:47.654353  4585 backend.cpp:76] Failed to create 'bind' backend: BindBackend requires
root privileges
I0617 16:09:47.654399  4585 provisioner.cpp:255] Using default backend 'copy'
I0617 16:09:47.659636  4608 slave.cpp:249] Mesos agent started on (765)@172.17.0.2:46709
I0617 16:09:47.659675  4608 slave.cpp:250] Flags at startup: --acls="" --appc_simple_discovery_uri_prefix="http://"
--appc_store_dir="/tmp/Endpoint_SlaveEndpointTest_UnauthorizedRequest_0_hHPM3r/store/appc"
--authenticate_http_readonly="true" --authenticate_http_readwrite="true" --authenticatee="crammd5"
--authentication_backoff_factor="1secs" --authorizer="local" --cgroups_cpu_enable_pids_and_tids_count="false"
--cgroups_enable_cfs="false" --cgroups_hierarchy="/sys/fs/cgroup" --cgroups_limit_swap="false"
--cgroups_root="mesos" --container_disk_watch_interval="15secs" --containerizers="mesos" --credential="/tmp/Endpoint_SlaveEndpointTest_UnauthorizedRequest_0_hHPM3r/credential"
--default_role="*" --disk_watch_interval="1mins" --docker="docker" --docker_kill_orphans="true"
--docker_registry="https://registry-1.docker.io" --docker_remove_delay="6hrs" --docker_socket="/var/run/docker.sock"
--docker_stop_timeout="0ns" --docker_store_dir="/tmp/Endpoint_SlaveEndpointTest_UnauthorizedRequest_0_hHPM3r/store/docker"
--docker_volume_checkpoint_dir="/var/run/mesos/isolators/docker/volume" --enforce_container_disk_quota="false"
--executor_registration_timeout="1mins" --executor_reregistration_timeout="2secs" --executor_shutdown_grace_period="5secs"
--fetcher_cache_dir="/tmp/Endpoint_SlaveEndpointTest_UnauthorizedRequest_0_hHPM3r/fetch" --fetcher_cache_size="2GB"
--frameworks_home="" --gc_delay="1weeks" --gc_disk_headroom="0.1" --hadoop_home="" --help="false"
--hostname_lookup="true" --http_command_executor="false" --http_credentials="/tmp/Endpoint_SlaveEndpointTest_UnauthorizedRequest_0_hHPM3r/http_credentials"
--http_heartbeat_interval="30secs" --initialize_driver_logging="true" --isolation="posix/cpu,posix/mem"
--launcher="posix" --launcher_dir="/mesos/mesos-1.4.0/_build/src" --logbufsecs="0" --logging_level="INFO"
--max_completed_executors_per_framework="150" --oversubscribed_resources_interval="15secs"
--perf_duration="10secs" --perf_interval="1mins" --port="5051" --qos_correction_interval_min="0ns"
--quiet="false" --recover="reconnect" --recovery_timeout="15mins" --registration_backoff_factor="10ms"
--resources="cpus:2;gpus:0;mem:1024;disk:1024;ports:[31000-32000]" --revocable_cpu_low_priority="true"
--runtime_dir="/tmp/Endpoint_SlaveEndpointTest_UnauthorizedRequest_0_hHPM3r" --sandbox_directory="/mnt/mesos/sandbox"
--strict="true" --switch_user="true" --systemd_enable_support="true" --systemd_runtime_directory="/run/systemd/system"
--version="false" --work_dir="/tmp/Endpoint_SlaveEndpointTest_UnauthorizedRequest_0_spvErN"
I0617 16:09:47.660472  4608 credentials.hpp:86] Loading credential for authentication from
'/tmp/Endpoint_SlaveEndpointTest_UnauthorizedRequest_0_hHPM3r/credential'
I0617 16:09:47.660912  4608 slave.cpp:282] Agent using credential for: test-principal
I0617 16:09:47.660941  4608 credentials.hpp:37] Loading credentials for authentication from
'/tmp/Endpoint_SlaveEndpointTest_UnauthorizedRequest_0_hHPM3r/http_credentials'
I0617 16:09:47.661378  4608 http.cpp:975] Creating default 'basic' HTTP authenticator for
realm 'mesos-agent-readonly'
I0617 16:09:47.661731  4608 http.cpp:975] Creating default 'basic' HTTP authenticator for
realm 'mesos-agent-readwrite'
I0617 16:09:47.664129  4608 slave.cpp:553] Agent resources: cpus(*):2; mem(*):1024; disk(*):1024;
ports(*):[31000-32000]
I0617 16:09:47.664278  4608 slave.cpp:561] Agent attributes: [  ]
I0617 16:09:47.664300  4608 slave.cpp:566] Agent hostname: 25a226265524
I0617 16:09:47.664594  4611 status_update_manager.cpp:177] Pausing sending status updates
I0617 16:09:47.666914  4611 state.cpp:62] Recovering state from '/tmp/Endpoint_SlaveEndpointTest_UnauthorizedRequest_0_spvErN/meta'
I0617 16:09:47.667855  4609 status_update_manager.cpp:203] Recovering status update manager
I0617 16:09:47.668283  4606 containerizer.cpp:582] Recovering containerizer
I0617 16:09:47.670395  4607 provisioner.cpp:416] Provisioner recovery complete
I0617 16:09:47.670902  4605 slave.cpp:6128] Finished recovery
I0617 16:09:47.671620  4605 slave.cpp:6310] Querying resource estimator for oversubscribable
resources
I0617 16:09:47.672086  4604 slave.cpp:6324] Received oversubscribable resources {} from the
resource estimator
I0617 16:09:47.676761  4605 process.cpp:3779] Handling HTTP event for process 'slave(765)'
with path: '/slave(765)/monitor/statistics'
I0617 16:09:47.678968  4607 http.cpp:1115] HTTP GET for /slave(765)/monitor/statistics from
172.17.0.2:40802
I0617 16:09:47.679095  4607 http.cpp:936] Authorizing principal 'test-principal' to GET the
'/monitor/statistics' endpoint
I0617 16:09:47.682626  4607 slave.cpp:818] Agent terminating
[       OK ] Endpoint/SlaveEndpointTest.UnauthorizedRequest/0 (45 ms)
[ RUN      ] Endpoint/SlaveEndpointTest.UnauthorizedRequest/1
I0617 16:09:47.698606  4585 containerizer.cpp:230] Using isolation: posix/cpu,posix/mem,filesystem/posix,network/cni,environment_secret
W0617 16:09:47.699389  4585 backend.cpp:76] Failed to create 'overlay' backend: OverlayBackend
requires root privileges
W0617 16:09:47.699568  4585 backend.cpp:76] Failed to create 'bind' backend: BindBackend requires
root privileges
I0617 16:09:47.699614  4585 provisioner.cpp:255] Using default backend 'copy'
I0617 16:09:47.704834  4606 slave.cpp:249] Mesos agent started on (766)@172.17.0.2:46709
I0617 16:09:47.705160  4606 slave.cpp:250] Flags at startup: --acls="" --appc_simple_discovery_uri_prefix="http://"
--appc_store_dir="/tmp/Endpoint_SlaveEndpointTest_UnauthorizedRequest_1_NRTdV4/store/appc"
--authenticate_http_readonly="true" --authenticate_http_readwrite="true" --authenticatee="crammd5"
--authentication_backoff_factor="1secs" --authorizer="local" --cgroups_cpu_enable_pids_and_tids_count="false"
--cgroups_enable_cfs="false" --cgroups_hierarchy="/sys/fs/cgroup" --cgroups_limit_swap="false"
--cgroups_root="mesos" --container_disk_watch_interval="15secs" --containerizers="mesos" --credential="/tmp/Endpoint_SlaveEndpointTest_UnauthorizedRequest_1_NRTdV4/credential"
--default_role="*" --disk_watch_interval="1mins" --docker="docker" --docker_kill_orphans="true"
--docker_registry="https://registry-1.docker.io" --docker_remove_delay="6hrs" --docker_socket="/var/run/docker.sock"
--docker_stop_timeout="0ns" --docker_store_dir="/tmp/Endpoint_SlaveEndpointTest_UnauthorizedRequest_1_NRTdV4/store/docker"
--docker_volume_checkpoint_dir="/var/run/mesos/isolators/docker/volume" --enforce_container_disk_quota="false"
--executor_registration_timeout="1mins" --executor_reregistration_timeout="2secs" --executor_shutdown_grace_period="5secs"
--fetcher_cache_dir="/tmp/Endpoint_SlaveEndpointTest_UnauthorizedRequest_1_NRTdV4/fetch" --fetcher_cache_size="2GB"
--frameworks_home="" --gc_delay="1weeks" --gc_disk_headroom="0.1" --hadoop_home="" --help="false"
--hostname_lookup="true" --http_command_executor="false" --http_credentials="/tmp/Endpoint_SlaveEndpointTest_UnauthorizedRequest_1_NRTdV4/http_credentials"
--http_heartbeat_interval="30secs" --initialize_driver_logging="true" --isolation="posix/cpu,posix/mem"
--launcher="posix" --launcher_dir="/mesos/mesos-1.4.0/_build/src" --logbufsecs="0" --logging_level="INFO"
--max_completed_executors_per_framework="150" --oversubscribed_resources_interval="15secs"
--perf_duration="10secs" --perf_interval="1mins" --port="5051" --qos_correction_interval_min="0ns"
--quiet="false" --recover="reconnect" --recovery_timeout="15mins" --registration_backoff_factor="10ms"
--resources="cpus:2;gpus:0;mem:1024;disk:1024;ports:[31000-32000]" --revocable_cpu_low_priority="true"
--runtime_dir="/tmp/Endpoint_SlaveEndpointTest_UnauthorizedRequest_1_NRTdV4" --sandbox_directory="/mnt/mesos/sandbox"
--strict="true" --switch_user="true" --systemd_enable_support="true" --systemd_runtime_directory="/run/systemd/system"
--version="false" --work_dir="/tmp/Endpoint_SlaveEndpointTest_UnauthorizedRequest_1_8eKObq"
I0617 16:09:47.706159  4606 credentials.hpp:86] Loading credential for authentication from
'/tmp/Endpoint_SlaveEndpointTest_UnauthorizedRequest_1_NRTdV4/credential'
I0617 16:09:47.706636  4606 slave.cpp:282] Agent using credential for: test-principal
I0617 16:09:47.706748  4606 credentials.hpp:37] Loading credentials for authentication from
'/tmp/Endpoint_SlaveEndpointTest_UnauthorizedRequest_1_NRTdV4/http_credentials'
I0617 16:09:47.707267  4606 http.cpp:975] Creating default 'basic' HTTP authenticator for
realm 'mesos-agent-readonly'
I0617 16:09:47.707681  4606 http.cpp:975] Creating default 'basic' HTTP authenticator for
realm 'mesos-agent-readwrite'
I0617 16:09:47.710067  4606 slave.cpp:553] Agent resources: cpus(*):2; mem(*):1024; disk(*):1024;
ports(*):[31000-32000]
I0617 16:09:47.710405  4606 slave.cpp:561] Agent attributes: [  ]
I0617 16:09:47.710490  4606 slave.cpp:566] Agent hostname: 25a226265524
I0617 16:09:47.710862  4607 status_update_manager.cpp:177] Pausing sending status updates
I0617 16:09:47.713040  4605 state.cpp:62] Recovering state from '/tmp/Endpoint_SlaveEndpointTest_UnauthorizedRequest_1_8eKObq/meta'
I0617 16:09:47.713543  4611 status_update_manager.cpp:203] Recovering status update manager
I0617 16:09:47.714133  4605 containerizer.cpp:582] Recovering containerizer
I0617 16:09:47.716408  4607 provisioner.cpp:416] Provisioner recovery complete
I0617 16:09:47.717092  4611 slave.cpp:6128] Finished recovery
I0617 16:09:47.717855  4611 slave.cpp:6310] Querying resource estimator for oversubscribable
resources
I0617 16:09:47.718436  4604 slave.cpp:6324] Received oversubscribable resources {} from the
resource estimator
I0617 16:09:47.722801  4607 process.cpp:3779] Handling HTTP event for process 'slave(766)'
with path: '/slave(766)/monitor/statistics.json'
I0617 16:09:47.724943  4611 http.cpp:1115] HTTP GET for /slave(766)/monitor/statistics.json
from 172.17.0.2:40804
I0617 16:09:47.725271  4611 http.cpp:936] Authorizing principal 'test-principal' to GET the
'/monitor/statistics.json' endpoint
I0617 16:09:47.729375  4604 slave.cpp:818] Agent terminating
[       OK ] Endpoint/SlaveEndpointTest.UnauthorizedRequest/1 (46 ms)
[ RUN      ] Endpoint/SlaveEndpointTest.UnauthorizedRequest/2
I0617 16:09:47.744876  4585 containerizer.cpp:230] Using isolation: posix/cpu,posix/mem,filesystem/posix,network/cni,environment_secret
W0617 16:09:47.745643  4585 backend.cpp:76] Failed to create 'overlay' backend: OverlayBackend
requires root privileges
W0617 16:09:47.745882  4585 backend.cpp:76] Failed to create 'bind' backend: BindBackend requires
root privileges
I0617 16:09:47.745951  4585 provisioner.cpp:255] Using default backend 'copy'
I0617 16:09:47.751301  4609 slave.cpp:249] Mesos agent started on (767)@172.17.0.2:46709
I0617 16:09:47.751340  4609 slave.cpp:250] Flags at startup: --acls="" --appc_simple_discovery_uri_prefix="http://"
--appc_store_dir="/tmp/Endpoint_SlaveEndpointTest_UnauthorizedRequest_2_TooJgI/store/appc"
--authenticate_http_readonly="true" --authenticate_http_readwrite="true" --authenticatee="crammd5"
--authentication_backoff_factor="1secs" --authorizer="local" --cgroups_cpu_enable_pids_and_tids_count="false"
--cgroups_enable_cfs="false" --cgroups_hierarchy="/sys/fs/cgroup" --cgroups_limit_swap="false"
--cgroups_root="mesos" --container_disk_watch_interval="15secs" --containerizers="mesos" --credential="/tmp/Endpoint_SlaveEndpointTest_UnauthorizedRequest_2_TooJgI/credential"
--default_role="*" --disk_watch_interval="1mins" --docker="docker" --docker_kill_orphans="true"
--docker_registry="https://registry-1.docker.io" --docker_remove_delay="6hrs" --docker_socket="/var/run/docker.sock"
--docker_stop_timeout="0ns" --docker_store_dir="/tmp/Endpoint_SlaveEndpointTest_UnauthorizedRequest_2_TooJgI/store/docker"
--docker_volume_checkpoint_dir="/var/run/mesos/isolators/docker/volume" --enforce_container_disk_quota="false"
--executor_registration_timeout="1mins" --executor_reregistration_timeout="2secs" --executor_shutdown_grace_period="5secs"
--fetcher_cache_dir="/tmp/Endpoint_SlaveEndpointTest_UnauthorizedRequest_2_TooJgI/fetch" --fetcher_cache_size="2GB"
--frameworks_home="" --gc_delay="1weeks" --gc_disk_headroom="0.1" --hadoop_home="" --help="false"
--hostname_lookup="true" --http_command_executor="false" --http_credentials="/tmp/Endpoint_SlaveEndpointTest_UnauthorizedRequest_2_TooJgI/http_credentials"
--http_heartbeat_interval="30secs" --initialize_driver_logging="true" --isolation="posix/cpu,posix/mem"
--launcher="posix" --launcher_dir="/mesos/mesos-1.4.0/_build/src" --logbufsecs="0" --logging_level="INFO"
--max_completed_executors_per_framework="150" --oversubscribed_resources_interval="15secs"
--perf_duration="10secs" --perf_interval="1mins" --port="5051" --qos_correction_interval_min="0ns"
--quiet="false" --recover="reconnect" --recovery_timeout="15mins" --registration_backoff_factor="10ms"
--resources="cpus:2;gpus:0;mem:1024;disk:1024;ports:[31000-32000]" --revocable_cpu_low_priority="true"
--runtime_dir="/tmp/Endpoint_SlaveEndpointTest_UnauthorizedRequest_2_TooJgI" --sandbox_directory="/mnt/mesos/sandbox"
--strict="true" --switch_user="true" --systemd_enable_support="true" --systemd_runtime_directory="/run/systemd/system"
--version="false" --work_dir="/tmp/Endpoint_SlaveEndpointTest_UnauthorizedRequest_2_quuNp3"
I0617 16:09:47.752177  4609 credentials.hpp:86] Loading credential for authentication from
'/tmp/Endpoint_SlaveEndpointTest_UnauthorizedRequest_2_TooJgI/credential'
I0617 16:09:47.752566  4609 slave.cpp:282] Agent using credential for: test-principal
I0617 16:09:47.752606  4609 credentials.hpp:37] Loading credentials for authentication from
'/tmp/Endpoint_SlaveEndpointTest_UnauthorizedRequest_2_TooJgI/http_credentials'
I0617 16:09:47.753290  4609 http.cpp:975] Creating default 'basic' HTTP authenticator for
realm 'mesos-agent-readonly'
I0617 16:09:47.753662  4609 http.cpp:975] Creating default 'basic' HTTP authenticator for
realm 'mesos-agent-readwrite'
I0617 16:09:47.756323  4609 slave.cpp:553] Agent resources: cpus(*):2; mem(*):1024; disk(*):1024;
ports(*):[31000-32000]
I0617 16:09:47.756476  4609 slave.cpp:561] Agent attributes: [  ]
I0617 16:09:47.756496  4609 slave.cpp:566] Agent hostname: 25a226265524
I0617 16:09:47.756813  4604 status_update_manager.cpp:177] Pausing sending status updates
I0617 16:09:47.759124  4608 state.cpp:62] Recovering state from '/tmp/Endpoint_SlaveEndpointTest_UnauthorizedRequest_2_quuNp3/meta'
I0617 16:09:47.759578  4610 status_update_manager.cpp:203] Recovering status update manager
I0617 16:09:47.759996  4610 containerizer.cpp:582] Recovering containerizer
I0617 16:09:47.762276  4604 provisioner.cpp:416] Provisioner recovery complete
I0617 16:09:47.762934  4610 slave.cpp:6128] Finished recovery
I0617 16:09:47.763545  4610 slave.cpp:6310] Querying resource estimator for oversubscribable
resources
I0617 16:09:47.764104  4607 slave.cpp:6324] Received oversubscribable resources {} from the
resource estimator
I0617 16:09:47.768522  4608 process.cpp:3779] Handling HTTP event for process 'slave(767)'
with path: '/slave(767)/containers'
I0617 16:09:47.770494  4609 http.cpp:1115] HTTP GET for /slave(767)/containers from 172.17.0.2:40806
I0617 16:09:47.770622  4609 http.cpp:936] Authorizing principal 'test-principal' to GET the
'/containers' endpoint
I0617 16:09:47.774893  4606 slave.cpp:818] Agent terminating
[       OK ] Endpoint/SlaveEndpointTest.UnauthorizedRequest/2 (45 ms)
[ RUN      ] Endpoint/SlaveEndpointTest.NoAuthorizer/0
I0617 16:09:47.791198  4585 containerizer.cpp:230] Using isolation: posix/cpu,posix/mem,filesystem/posix,network/cni,environment_secret
W0617 16:09:47.791965  4585 backend.cpp:76] Failed to create 'overlay' backend: OverlayBackend
requires root privileges
W0617 16:09:47.792140  4585 backend.cpp:76] Failed to create 'bind' backend: BindBackend requires
root privileges
I0617 16:09:47.792187  4585 provisioner.cpp:255] Using default backend 'copy'
I0617 16:09:47.794870  4585 cluster.cpp:448] Creating default 'local' authorizer
I0617 16:09:47.798966  4605 slave.cpp:249] Mesos agent started on (768)@172.17.0.2:46709
I0617 16:09:47.799005  4605 slave.cpp:250] Flags at startup: --acls="" --appc_simple_discovery_uri_prefix="http://"
--appc_store_dir="/tmp/Endpoint_SlaveEndpointTest_NoAuthorizer_0_nKWV5l/store/appc" --authenticate_http_readonly="true"
--authenticate_http_readwrite="true" --authenticatee="crammd5" --authentication_backoff_factor="1secs"
--authorizer="local" --cgroups_cpu_enable_pids_and_tids_count="false" --cgroups_enable_cfs="false"
--cgroups_hierarchy="/sys/fs/cgroup" --cgroups_limit_swap="false" --cgroups_root="mesos" --container_disk_watch_interval="15secs"
--containerizers="mesos" --credential="/tmp/Endpoint_SlaveEndpointTest_NoAuthorizer_0_nKWV5l/credential"
--default_role="*" --disk_watch_interval="1mins" --docker="docker" --docker_kill_orphans="true"
--docker_registry="https://registry-1.docker.io" --docker_remove_delay="6hrs" --docker_socket="/var/run/docker.sock"
--docker_stop_timeout="0ns" --docker_store_dir="/tmp/Endpoint_SlaveEndpointTest_NoAuthorizer_0_nKWV5l/store/docker"
--docker_volume_checkpoint_dir="/var/run/mesos/isolators/docker/volume" --enforce_container_disk_quota="false"
--executor_registration_timeout="1mins" --executor_reregistration_timeout="2secs" --executor_shutdown_grace_period="5secs"
--fetcher_cache_dir="/tmp/Endpoint_SlaveEndpointTest_NoAuthorizer_0_nKWV5l/fetch" --fetcher_cache_size="2GB"
--frameworks_home="" --gc_delay="1weeks" --gc_disk_headroom="0.1" --hadoop_home="" --help="false"
--hostname_lookup="true" --http_command_executor="false" --http_credentials="/tmp/Endpoint_SlaveEndpointTest_NoAuthorizer_0_nKWV5l/http_credentials"
--http_heartbeat_interval="30secs" --initialize_driver_logging="true" --isolation="posix/cpu,posix/mem"
--launcher="posix" --launcher_dir="/mesos/mesos-1.4.0/_build/src" --logbufsecs="0" --logging_level="INFO"
--max_completed_executors_per_framework="150" --oversubscribed_resources_interval="15secs"
--perf_duration="10secs" --perf_interval="1mins" --port="5051" --qos_correction_interval_min="0ns"
--quiet="false" --recover="reconnect" --recovery_timeout="15mins" --registration_backoff_factor="10ms"
--resources="cpus:2;gpus:0;mem:1024;disk:1024;ports:[31000-32000]" --revocable_cpu_low_priority="true"
--runtime_dir="/tmp/Endpoint_SlaveEndpointTest_NoAuthorizer_0_nKWV5l" --sandbox_directory="/mnt/mesos/sandbox"
--strict="true" --switch_user="true" --systemd_enable_support="true" --systemd_runtime_directory="/run/systemd/system"
--version="false" --work_dir="/tmp/Endpoint_SlaveEndpointTest_NoAuthorizer_0_kRez7G"
I0617 16:09:47.799970  4605 credentials.hpp:86] Loading credential for authentication from
'/tmp/Endpoint_SlaveEndpointTest_NoAuthorizer_0_nKWV5l/credential'
I0617 16:09:47.800447  4605 slave.cpp:282] Agent using credential for: test-principal
I0617 16:09:47.800475  4605 credentials.hpp:37] Loading credentials for authentication from
'/tmp/Endpoint_SlaveEndpointTest_NoAuthorizer_0_nKWV5l/http_credentials'
I0617 16:09:47.800918  4605 http.cpp:975] Creating default 'basic' HTTP authenticator for
realm 'mesos-agent-readonly'
I0617 16:09:47.801240  4605 http.cpp:975] Creating default 'basic' HTTP authenticator for
realm 'mesos-agent-readwrite'
I0617 16:09:47.803477  4605 slave.cpp:553] Agent resources: cpus(*):2; mem(*):1024; disk(*):1024;
ports(*):[31000-32000]
I0617 16:09:47.803624  4605 slave.cpp:561] Agent attributes: [  ]
I0617 16:09:47.803643  4605 slave.cpp:566] Agent hostname: 25a226265524
I0617 16:09:47.804126  4607 status_update_manager.cpp:177] Pausing sending status updates
I0617 16:09:47.806088  4610 state.cpp:62] Recovering state from '/tmp/Endpoint_SlaveEndpointTest_NoAuthorizer_0_kRez7G/meta'
I0617 16:09:47.806680  4604 status_update_manager.cpp:203] Recovering status update manager
I0617 16:09:47.806974  4610 containerizer.cpp:582] Recovering containerizer
I0617 16:09:47.809504  4611 provisioner.cpp:416] Provisioner recovery complete
I0617 16:09:47.810600  4611 slave.cpp:6128] Finished recovery
I0617 16:09:47.811660  4611 slave.cpp:6310] Querying resource estimator for oversubscribable
resources
I0617 16:09:47.812219  4605 slave.cpp:6324] Received oversubscribable resources {} from the
resource estimator
I0617 16:09:47.816586  4606 process.cpp:3779] Handling HTTP event for process 'slave(768)'
with path: '/slave(768)/monitor/statistics'
I0617 16:09:47.818627  4608 http.cpp:1115] HTTP GET for /slave(768)/monitor/statistics from
172.17.0.2:40808
I0617 16:09:47.818744  4608 http.cpp:936] Authorizing principal 'test-principal' to GET the
'/monitor/statistics' endpoint
I0617 16:09:47.824338  4585 slave.cpp:818] Agent terminating
[       OK ] Endpoint/SlaveEndpointTest.NoAuthorizer/0 (48 ms)
[ RUN      ] Endpoint/SlaveEndpointTest.NoAuthorizer/1
I0617 16:09:47.840059  4585 containerizer.cpp:230] Using isolation: posix/cpu,posix/mem,filesystem/posix,network/cni,environment_secret
W0617 16:09:47.840873  4585 backend.cpp:76] Failed to create 'overlay' backend: OverlayBackend
requires root privileges
W0617 16:09:47.841048  4585 backend.cpp:76] Failed to create 'bind' backend: BindBackend requires
root privileges
I0617 16:09:47.841094  4585 provisioner.cpp:255] Using default backend 'copy'
I0617 16:09:47.843724  4585 cluster.cpp:448] Creating default 'local' authorizer
I0617 16:09:47.846930  4611 slave.cpp:249] Mesos agent started on (769)@172.17.0.2:46709
I0617 16:09:47.847164  4611 slave.cpp:250] Flags at startup: --acls="" --appc_simple_discovery_uri_prefix="http://"
--appc_store_dir="/tmp/Endpoint_SlaveEndpointTest_NoAuthorizer_1_JJJHq0/store/appc" --authenticate_http_readonly="true"
--authenticate_http_readwrite="true" --authenticatee="crammd5" --authentication_backoff_factor="1secs"
--authorizer="local" --cgroups_cpu_enable_pids_and_tids_count="false" --cgroups_enable_cfs="false"
--cgroups_hierarchy="/sys/fs/cgroup" --cgroups_limit_swap="false" --cgroups_root="mesos" --container_disk_watch_interval="15secs"
--containerizers="mesos" --credential="/tmp/Endpoint_SlaveEndpointTest_NoAuthorizer_1_JJJHq0/credential"
--default_role="*" --disk_watch_interval="1mins" --docker="docker" --docker_kill_orphans="true"
--docker_registry="https://registry-1.docker.io" --docker_remove_delay="6hrs" --docker_socket="/var/run/docker.sock"
--docker_stop_timeout="0ns" --docker_store_dir="/tmp/Endpoint_SlaveEndpointTest_NoAuthorizer_1_JJJHq0/store/docker"
--docker_volume_checkpoint_dir="/var/run/mesos/isolators/docker/volume" --enforce_container_disk_quota="false"
--executor_registration_timeout="1mins" --executor_reregistration_timeout="2secs" --executor_shutdown_grace_period="5secs"
--fetcher_cache_dir="/tmp/Endpoint_SlaveEndpointTest_NoAuthorizer_1_JJJHq0/fetch" --fetcher_cache_size="2GB"
--frameworks_home="" --gc_delay="1weeks" --gc_disk_headroom="0.1" --hadoop_home="" --help="false"
--hostname_lookup="true" --http_command_executor="false" --http_credentials="/tmp/Endpoint_SlaveEndpointTest_NoAuthorizer_1_JJJHq0/http_credentials"
--http_heartbeat_interval="30secs" --initialize_driver_logging="true" --isolation="posix/cpu,posix/mem"
--launcher="posix" --launcher_dir="/mesos/mesos-1.4.0/_build/src" --logbufsecs="0" --logging_level="INFO"
--max_completed_executors_per_framework="150" --oversubscribed_resources_interval="15secs"
--perf_duration="10secs" --perf_interval="1mins" --port="5051" --qos_correction_interval_min="0ns"
--quiet="false" --recover="reconnect" --recovery_timeout="15mins" --registration_backoff_factor="10ms"
--resources="cpus:2;gpus:0;mem:1024;disk:1024;ports:[31000-32000]" --revocable_cpu_low_priority="true"
--runtime_dir="/tmp/Endpoint_SlaveEndpointTest_NoAuthorizer_1_JJJHq0" --sandbox_directory="/mnt/mesos/sandbox"
--strict="true" --switch_user="true" --systemd_enable_support="true" --systemd_runtime_directory="/run/systemd/system"
--version="false" --work_dir="/tmp/Endpoint_SlaveEndpointTest_NoAuthorizer_1_k1Opkl"
I0617 16:09:47.848218  4611 credentials.hpp:86] Loading credential for authentication from
'/tmp/Endpoint_SlaveEndpointTest_NoAuthorizer_1_JJJHq0/credential'
I0617 16:09:47.848683  4611 slave.cpp:282] Agent using credential for: test-principal
I0617 16:09:47.848824  4611 credentials.hpp:37] Loading credentials for authentication from
'/tmp/Endpoint_SlaveEndpointTest_NoAuthorizer_1_JJJHq0/http_credentials'
I0617 16:09:47.849383  4611 http.cpp:975] Creating default 'basic' HTTP authenticator for
realm 'mesos-agent-readonly'
I0617 16:09:47.849757  4611 http.cpp:975] Creating default 'basic' HTTP authenticator for
realm 'mesos-agent-readwrite'
I0617 16:09:47.852108  4611 slave.cpp:553] Agent resources: cpus(*):2; mem(*):1024; disk(*):1024;
ports(*):[31000-32000]
I0617 16:09:47.852401  4611 slave.cpp:561] Agent attributes: [  ]
I0617 16:09:47.852540  4611 slave.cpp:566] Agent hostname: 25a226265524
I0617 16:09:47.852895  4608 status_update_manager.cpp:177] Pausing sending status updates
I0617 16:09:47.855072  4610 state.cpp:62] Recovering state from '/tmp/Endpoint_SlaveEndpointTest_NoAuthorizer_1_k1Opkl/meta'
I0617 16:09:47.855654  4606 status_update_manager.cpp:203] Recovering status update manager
I0617 16:09:47.856173  4604 containerizer.cpp:582] Recovering containerizer
I0617 16:09:47.858261  4608 provisioner.cpp:416] Provisioner recovery complete
I0617 16:09:47.859045  4609 slave.cpp:6128] Finished recovery
I0617 16:09:47.860137  4609 slave.cpp:6310] Querying resource estimator for oversubscribable
resources
I0617 16:09:47.860829  4608 slave.cpp:6324] Received oversubscribable resources {} from the
resource estimator
I0617 16:09:47.865494  4606 process.cpp:3779] Handling HTTP event for process 'slave(769)'
with path: '/slave(769)/monitor/statistics.json'
I0617 16:09:47.868151  4606 http.cpp:1115] HTTP GET for /slave(769)/monitor/statistics.json
from 172.17.0.2:40810
I0617 16:09:47.868522  4606 http.cpp:936] Authorizing principal 'test-principal' to GET the
'/monitor/statistics.json' endpoint
I0617 16:09:47.874148  4606 slave.cpp:818] Agent terminating
[       OK ] Endpoint/SlaveEndpointTest.NoAuthorizer/1 (49 ms)
[ RUN      ] Endpoint/SlaveEndpointTest.NoAuthorizer/2
I0617 16:09:47.890424  4585 containerizer.cpp:230] Using isolation: posix/cpu,posix/mem,filesystem/posix,network/cni,environment_secret
W0617 16:09:47.891185  4585 backend.cpp:76] Failed to create 'overlay' backend: OverlayBackend
requires root privileges
W0617 16:09:47.891358  4585 backend.cpp:76] Failed to create 'bind' backend: BindBackend requires
root privileges
I0617 16:09:47.891402  4585 provisioner.cpp:255] Using default backend 'copy'
I0617 16:09:47.894064  4585 cluster.cpp:448] Creating default 'local' authorizer
I0617 16:09:47.896828  4609 slave.cpp:249] Mesos agent started on (770)@172.17.0.2:46709
I0617 16:09:47.896869  4609 slave.cpp:250] Flags at startup: --acls="" --appc_simple_discovery_uri_prefix="http://"
--appc_store_dir="/tmp/Endpoint_SlaveEndpointTest_NoAuthorizer_2_jaTKhF/store/appc" --authenticate_http_readonly="true"
--authenticate_http_readwrite="true" --authenticatee="crammd5" --authentication_backoff_factor="1secs"
--authorizer="local" --cgroups_cpu_enable_pids_and_tids_count="false" --cgroups_enable_cfs="false"
--cgroups_hierarchy="/sys/fs/cgroup" --cgroups_limit_swap="false" --cgroups_root="mesos" --container_disk_watch_interval="15secs"
--containerizers="mesos" --credential="/tmp/Endpoint_SlaveEndpointTest_NoAuthorizer_2_jaTKhF/credential"
--default_role="*" --disk_watch_interval="1mins" --docker="docker" --docker_kill_orphans="true"
--docker_registry="https://registry-1.docker.io" --docker_remove_delay="6hrs" --docker_socket="/var/run/docker.sock"
--docker_stop_timeout="0ns" --docker_store_dir="/tmp/Endpoint_SlaveEndpointTest_NoAuthorizer_2_jaTKhF/store/docker"
--docker_volume_checkpoint_dir="/var/run/mesos/isolators/docker/volume" --enforce_container_disk_quota="false"
--executor_registration_timeout="1mins" --executor_reregistration_timeout="2secs" --executor_shutdown_grace_period="5secs"
--fetcher_cache_dir="/tmp/Endpoint_SlaveEndpointTest_NoAuthorizer_2_jaTKhF/fetch" --fetcher_cache_size="2GB"
--frameworks_home="" --gc_delay="1weeks" --gc_disk_headroom="0.1" --hadoop_home="" --help="false"
--hostname_lookup="true" --http_command_executor="false" --http_credentials="/tmp/Endpoint_SlaveEndpointTest_NoAuthorizer_2_jaTKhF/http_credentials"
--http_heartbeat_interval="30secs" --initialize_driver_logging="true" --isolation="posix/cpu,posix/mem"
--launcher="posix" --launcher_dir="/mesos/mesos-1.4.0/_build/src" --logbufsecs="0" --logging_level="INFO"
--max_completed_executors_per_framework="150" --oversubscribed_resources_interval="15secs"
--perf_duration="10secs" --perf_interval="1mins" --port="5051" --qos_correction_interval_min="0ns"
--quiet="false" --recover="reconnect" --recovery_timeout="15mins" --registration_backoff_factor="10ms"
--resources="cpus:2;gpus:0;mem:1024;disk:1024;ports:[31000-32000]" --revocable_cpu_low_priority="true"
--runtime_dir="/tmp/Endpoint_SlaveEndpointTest_NoAuthorizer_2_jaTKhF" --sandbox_directory="/mnt/mesos/sandbox"
--strict="true" --switch_user="true" --systemd_enable_support="true" --systemd_runtime_directory="/run/systemd/system"
--version="false" --work_dir="/tmp/Endpoint_SlaveEndpointTest_NoAuthorizer_2_cxYi3Z"
I0617 16:09:47.897716  4609 credentials.hpp:86] Loading credential for authentication from
'/tmp/Endpoint_SlaveEndpointTest_NoAuthorizer_2_jaTKhF/credential'
I0617 16:09:47.898106  4609 slave.cpp:282] Agent using credential for: test-principal
I0617 16:09:47.898142  4609 credentials.hpp:37] Loading credentials for authentication from
'/tmp/Endpoint_SlaveEndpointTest_NoAuthorizer_2_jaTKhF/http_credentials'
I0617 16:09:47.898870  4609 http.cpp:975] Creating default 'basic' HTTP authenticator for
realm 'mesos-agent-readonly'
I0617 16:09:47.899230  4609 http.cpp:975] Creating default 'basic' HTTP authenticator for
realm 'mesos-agent-readwrite'
I0617 16:09:47.902451  4609 slave.cpp:553] Agent resources: cpus(*):2; mem(*):1024; disk(*):1024;
ports(*):[31000-32000]
I0617 16:09:47.902602  4609 slave.cpp:561] Agent attributes: [  ]
I0617 16:09:47.902621  4609 slave.cpp:566] Agent hostname: 25a226265524
I0617 16:09:47.902947  4606 status_update_manager.cpp:177] Pausing sending status updates
I0617 16:09:47.905577  4608 state.cpp:62] Recovering state from '/tmp/Endpoint_SlaveEndpointTest_NoAuthorizer_2_cxYi3Z/meta'
I0617 16:09:47.906204  4608 status_update_manager.cpp:203] Recovering status update manager
I0617 16:09:47.906543  4606 containerizer.cpp:582] Recovering containerizer
I0617 16:09:47.908910  4606 provisioner.cpp:416] Provisioner recovery complete
I0617 16:09:47.909662  4609 slave.cpp:6128] Finished recovery
I0617 16:09:47.910802  4609 slave.cpp:6310] Querying resource estimator for oversubscribable
resources
I0617 16:09:47.911322  4609 slave.cpp:6324] Received oversubscribable resources {} from the
resource estimator
I0617 16:09:47.915586  4611 process.cpp:3779] Handling HTTP event for process 'slave(770)'
with path: '/slave(770)/containers'
I0617 16:09:47.917628  4609 http.cpp:1115] HTTP GET for /slave(770)/containers from 172.17.0.2:40812
I0617 16:09:47.917752  4609 http.cpp:936] Authorizing principal 'test-principal' to GET the
'/containers' endpoint
I0617 16:09:47.923400  4606 slave.cpp:818] Agent terminating
[       OK ] Endpoint/SlaveEndpointTest.NoAuthorizer/2 (48 ms)
[----------] 9 tests from Endpoint/SlaveEndpointTest (441 ms total)

[----------] Global test environment tear-down
[==========] 1610 tests from 176 test cases ran. (713546 ms total)
[  PASSED  ] 1606 tests.
[  FAILED  ] 4 tests, listed below:
[  FAILED  ] DefaultExecutorCheckTest.CommandCheckDeliveredAndReconciled
[  FAILED  ] DefaultExecutorCheckTest.CommandCheckStatusChange
[  FAILED  ] DefaultExecutorCheckTest.CommandCheckSeesParentsEnv
[  FAILED  ] DefaultExecutorCheckTest.CommandCheckSharesWorkDirWithTask

 4 FAILED TESTS
  YOU HAVE 20 DISABLED TESTS

E0617 16:09:48.067282  4612 process.cpp:968] Failed to accept socket: future discarded
make[4]: *** [check-local] Error 1
make[4]: Leaving directory `/mesos/mesos-1.4.0/_build/src'
make[3]: *** [check-am] Error 2
make[3]: Leaving directory `/mesos/mesos-1.4.0/_build/src'
make[2]: *** [check] Error 2
make[2]: Leaving directory `/mesos/mesos-1.4.0/_build/src'
make[1]: *** [check-recursive] Error 1
make[1]: Leaving directory `/mesos/mesos-1.4.0/_build'
make: *** [distcheck] Error 1
+ docker rmi mesos-1497710270-7432
Untagged: mesos-1497710270-7432:latest
Deleted: sha256:10d32e5dbc8609dec1b7fe3b0390ffbf9004057430f45d86c51480d1a9da55bb
Deleted: sha256:353678d8fd4653514bc54ec1441a35d9c7e6bf48f154d0902e49cc7c67cf7099
Deleted: sha256:586a71e93ba01f095d974cebbb511895e3df045ebb4f294173b33f56e4d03a09
Deleted: sha256:40768833e7f3f909349ac3239a7f22a765b7ce865e7436c4c597cf3eda60968a
Deleted: sha256:65ecf434527ad2d8868d32ade85970619c0fff8044c927b18146a92bcdc37ca9
Deleted: sha256:574f30faec51a5afb8492c1320d82a5af5b734c277b3b27bfccfcf317d8b9da2
Deleted: sha256:6ede7a96f3e99ab4c8888f688d4ed0a19319978f3fa76a57e82a936b8cb315b6
Deleted: sha256:2a488f4469111850db6440f678597204ca7558a46f3e9daa9533e72aca8c3873
Deleted: sha256:38eaec64ab14f7e5ebf6557df144fe5b5dd562bf3b2893bb36ec388c89866238
Deleted: sha256:4498a640996a35037c49a2b36b4f39776432cfd679921ca5d5bd42de3a36cc9f
Deleted: sha256:63464d250e21c7dc13765c01af1a1aad63c658ee0931d9dc133d1bc51c3d7850
Deleted: sha256:c27800214613e0f382d7a9271b5d61e8c6ae75d88298d52a144f0fefd41a5f14
Deleted: sha256:489ffa3173f242a3b74a471b18d08fb7369934c9660a906dd564539d94d4a606
Deleted: sha256:37fd893ffaed3231bfd524f5fa2e198b2303b4c054d34b03f63d803de313d3ee
Deleted: sha256:9f0f876cfabcb369837052511dfe57eae0a6ca3dca2e4c7a743a06961908ba26
Deleted: sha256:d0766577c80ce0e93a4065dcb61197bc8175e134a91c10d82e93161f8634c0b9
Deleted: sha256:1a10da12ed53ff9a9d476dc2720a45dca57012cb4cec51851369b47d5f3a5642
Deleted: sha256:ff0bebc0083a9acfa2f44c0870ea6ab16bbde270f6819762d3ec0c82928a436c
Deleted: sha256:32d8a4e772af49d9efcd692bf893d8e740f7aaf158fe0f82a4930a4a00df011f
Deleted: sha256:38b759672f6103812b2150285e8e952cb4e15fdf009bce16d5a85851d6a8f761
Deleted: sha256:e57c7fdacf8a0034a8002e8e88f459d2595f8365704089d61fb8845495c48d9f
Deleted: sha256:fca838714bb478b854fe3a630de8fb2db50c49f715a7661f4b965f0f675bc1fe
Deleted: sha256:6e84edd2dd5530a2611aa8f30938a4318a556711056e682edf9c8f3cc34404b5
Deleted: sha256:cd3c9b59305fe83fcaffc749cc8b8e7bf1a4b2e9454936c9f5f89ec27dd07d66
Build step 'Execute shell' marked build as failure

Mime
View raw message