mesos-builds mailing list archives

Site index · List index
Message view « Date » · « Thread »
Top « Date » · « Thread »
From Apache Jenkins Server <jenk...@builds.apache.org>
Subject Build failed in Jenkins: Mesos-Buildbot » cmake,clang,--verbose,GLOG_v=1 MESOS_VERBOSE=1,ubuntu:14.04,(ubuntu)&&(!ubuntu-us1)&&(!ubuntu-eu2) #3815
Date Mon, 19 Jun 2017 08:47:17 GMT
See <https://builds.apache.org/job/Mesos-Buildbot/BUILDTOOL=cmake,COMPILER=clang,CONFIGURATION=--verbose,ENVIRONMENT=GLOG_v=1%20MESOS_VERBOSE=1,OS=ubuntu%3A14.04,label_exp=(ubuntu)&&(!ubuntu-us1)&&(!ubuntu-eu2)/3815/display/redirect?page=changes>

Changes:

[mpark] Fixed some formatting of log messages in `hierarchical.cpp`.

------------------------------------------
[...truncated 26.47 MB...]
I0619 08:47:08.124215 30648 http.cpp:1159] HTTP GET for /slave(760)/monitor/statistics.json
from 172.17.0.2:43730
I0619 08:47:08.124353 30648 http.cpp:980] Authorizing principal 'test-principal' to GET the
'/monitor/statistics.json' endpoint
I0619 08:47:08.154121 30645 slave.cpp:818] Agent terminating
[       OK ] Endpoint/SlaveEndpointTest.AuthorizedRequest/1 (96 ms)
[ RUN      ] Endpoint/SlaveEndpointTest.AuthorizedRequest/2
I0619 08:47:08.173763 30645 containerizer.cpp:230] Using isolation: posix/cpu,posix/mem,filesystem/posix,network/cni,environment_secret
W0619 08:47:08.183424 30645 backend.cpp:76] Failed to create 'overlay' backend: OverlayBackend
requires root privileges
W0619 08:47:08.183621 30645 backend.cpp:76] Failed to create 'bind' backend: BindBackend requires
root privileges
I0619 08:47:08.183672 30645 provisioner.cpp:255] Using default backend 'copy'
I0619 08:47:08.191432 30652 slave.cpp:249] Mesos agent started on (761)@172.17.0.2:36253
I0619 08:47:08.191488 30652 slave.cpp:250] Flags at startup: --acls="" --appc_simple_discovery_uri_prefix="http://"
--appc_store_dir="/tmp/Endpoint_SlaveEndpointTest_AuthorizedRequest_2_Bd22pu/store/appc" --authenticate_http_readonly="true"
--authenticate_http_readwrite="true" --authenticatee="crammd5" --authentication_backoff_factor="1secs"
--authorizer="local" --cgroups_cpu_enable_pids_and_tids_count="false" --cgroups_enable_cfs="false"
--cgroups_hierarchy="/sys/fs/cgroup" --cgroups_limit_swap="false" --cgroups_root="mesos" --container_disk_watch_interval="15secs"
--containerizers="mesos" --credential="/tmp/Endpoint_SlaveEndpointTest_AuthorizedRequest_2_Bd22pu/credential"
--default_role="*" --disk_watch_interval="1mins" --docker="docker" --docker_kill_orphans="true"
--docker_registry="https://registry-1.docker.io" --docker_remove_delay="6hrs" --docker_socket="/var/run/docker.sock"
--docker_stop_timeout="0ns" --docker_store_dir="/tmp/Endpoint_SlaveEndpointTest_AuthorizedRequest_2_Bd22pu/store/docker"
--docker_volume_checkpoint_dir="/var/run/mesos/isolators/docker/volume" --enforce_container_disk_quota="false"
--executor_registration_timeout="1mins" --executor_reregistration_timeout="2secs" --executor_shutdown_grace_period="5secs"
--fetcher_cache_dir="/tmp/Endpoint_SlaveEndpointTest_AuthorizedRequest_2_Bd22pu/fetch" --fetcher_cache_size="2GB"
--frameworks_home="" --gc_delay="1weeks" --gc_disk_headroom="0.1" --hadoop_home="" --help="false"
--hostname_lookup="true" --http_command_executor="false" --http_credentials="/tmp/Endpoint_SlaveEndpointTest_AuthorizedRequest_2_Bd22pu/http_credentials"
--http_heartbeat_interval="30secs" --initialize_driver_logging="true" --isolation="posix/cpu,posix/mem"
--launcher="posix" --launcher_dir="/mesos/build/src" --logbufsecs="0" --logging_level="INFO"
--max_completed_executors_per_framework="150" --oversubscribed_resources_interval="15secs"
--perf_duration="10secs" --perf_interval="1mins" --port="5051" --qos_correction_interval_min="0ns"
--quiet="false" --recover="reconnect" --recovery_timeout="15mins" --registration_backoff_factor="10ms"
--resources="cpus:2;gpus:0;mem:1024;disk:1024;ports:[31000-32000]" --revocable_cpu_low_priority="true"
--runtime_dir="/tmp/Endpoint_SlaveEndpointTest_AuthorizedRequest_2_Bd22pu" --sandbox_directory="/mnt/mesos/sandbox"
--strict="true" --switch_user="true" --systemd_enable_support="true" --systemd_runtime_directory="/run/systemd/system"
--version="false" --work_dir="/tmp/Endpoint_SlaveEndpointTest_AuthorizedRequest_2_Qrk63f"
I0619 08:47:08.192126 30652 credentials.hpp:86] Loading credential for authentication from
'/tmp/Endpoint_SlaveEndpointTest_AuthorizedRequest_2_Bd22pu/credential'
I0619 08:47:08.192350 30652 slave.cpp:282] Agent using credential for: test-principal
I0619 08:47:08.192370 30652 credentials.hpp:37] Loading credentials for authentication from
'/tmp/Endpoint_SlaveEndpointTest_AuthorizedRequest_2_Bd22pu/http_credentials'
I0619 08:47:08.192657 30652 http.cpp:1019] Creating default 'basic' HTTP authenticator for
realm 'mesos-agent-readonly'
I0619 08:47:08.192863 30652 http.cpp:1019] Creating default 'basic' HTTP authenticator for
realm 'mesos-agent-readwrite'
I0619 08:47:08.199667 30652 slave.cpp:553] Agent resources: cpus(*):2; mem(*):1024; disk(*):1024;
ports(*):[31000-32000]
I0619 08:47:08.199810 30652 slave.cpp:561] Agent attributes: [  ]
I0619 08:47:08.199826 30652 slave.cpp:566] Agent hostname: 9f423e53fa53
I0619 08:47:08.202091 30652 status_update_manager.cpp:177] Pausing sending status updates
I0619 08:47:08.203052 30652 state.cpp:62] Recovering state from '/tmp/Endpoint_SlaveEndpointTest_AuthorizedRequest_2_Qrk63f/meta'
I0619 08:47:08.203632 30652 status_update_manager.cpp:203] Recovering status update manager
I0619 08:47:08.203829 30652 containerizer.cpp:582] Recovering containerizer
I0619 08:47:08.210453 30652 provisioner.cpp:416] Provisioner recovery complete
I0619 08:47:08.211170 30652 slave.cpp:6128] Finished recovery
I0619 08:47:08.211853 30652 slave.cpp:6310] Querying resource estimator for oversubscribable
resources
I0619 08:47:08.212728 30652 slave.cpp:6324] Received oversubscribable resources {} from the
resource estimator
I0619 08:47:08.224035 30646 process.cpp:3779] Handling HTTP event for process 'slave(761)'
with path: '/slave(761)/containers'
I0619 08:47:08.226764 30647 http.cpp:1159] HTTP GET for /slave(761)/containers from 172.17.0.2:43732
I0619 08:47:08.226891 30647 http.cpp:980] Authorizing principal 'test-principal' to GET the
'/containers' endpoint
[       OK ] Endpoint/SlaveEndpointTest.AuthorizedRequest/2 (95 ms)
[ RUN      ] Endpoint/SlaveEndpointTest.UnauthorizedRequest/0
I0619 08:47:08.251476 30650 slave.cpp:818] Agent terminating
I0619 08:47:08.278398 30645 containerizer.cpp:230] Using isolation: posix/cpu,posix/mem,filesystem/posix,network/cni,environment_secret
W0619 08:47:08.279191 30645 backend.cpp:76] Failed to create 'overlay' backend: OverlayBackend
requires root privileges
W0619 08:47:08.279364 30645 backend.cpp:76] Failed to create 'bind' backend: BindBackend requires
root privileges
I0619 08:47:08.279412 30645 provisioner.cpp:255] Using default backend 'copy'
I0619 08:47:08.298413 30648 slave.cpp:249] Mesos agent started on (762)@172.17.0.2:36253
I0619 08:47:08.298482 30648 slave.cpp:250] Flags at startup: --acls="" --appc_simple_discovery_uri_prefix="http://"
--appc_store_dir="/tmp/Endpoint_SlaveEndpointTest_UnauthorizedRequest_0_joNEJq/store/appc"
--authenticate_http_readonly="true" --authenticate_http_readwrite="true" --authenticatee="crammd5"
--authentication_backoff_factor="1secs" --authorizer="local" --cgroups_cpu_enable_pids_and_tids_count="false"
--cgroups_enable_cfs="false" --cgroups_hierarchy="/sys/fs/cgroup" --cgroups_limit_swap="false"
--cgroups_root="mesos" --container_disk_watch_interval="15secs" --containerizers="mesos" --credential="/tmp/Endpoint_SlaveEndpointTest_UnauthorizedRequest_0_joNEJq/credential"
--default_role="*" --disk_watch_interval="1mins" --docker="docker" --docker_kill_orphans="true"
--docker_registry="https://registry-1.docker.io" --docker_remove_delay="6hrs" --docker_socket="/var/run/docker.sock"
--docker_stop_timeout="0ns" --docker_store_dir="/tmp/Endpoint_SlaveEndpointTest_UnauthorizedRequest_0_joNEJq/store/docker"
--docker_volume_checkpoint_dir="/var/run/mesos/isolators/docker/volume" --enforce_container_disk_quota="false"
--executor_registration_timeout="1mins" --executor_reregistration_timeout="2secs" --executor_shutdown_grace_period="5secs"
--fetcher_cache_dir="/tmp/Endpoint_SlaveEndpointTest_UnauthorizedRequest_0_joNEJq/fetch" --fetcher_cache_size="2GB"
--frameworks_home="" --gc_delay="1weeks" --gc_disk_headroom="0.1" --hadoop_home="" --help="false"
--hostname_lookup="true" --http_command_executor="false" --http_credentials="/tmp/Endpoint_SlaveEndpointTest_UnauthorizedRequest_0_joNEJq/http_credentials"
--http_heartbeat_interval="30secs" --initialize_driver_logging="true" --isolation="posix/cpu,posix/mem"
--launcher="posix" --launcher_dir="/mesos/build/src" --logbufsecs="0" --logging_level="INFO"
--max_completed_executors_per_framework="150" --oversubscribed_resources_interval="15secs"
--perf_duration="10secs" --perf_interval="1mins" --port="5051" --qos_correction_interval_min="0ns"
--quiet="false" --recover="reconnect" --recovery_timeout="15mins" --registration_backoff_factor="10ms"
--resources="cpus:2;gpus:0;mem:1024;disk:1024;ports:[31000-32000]" --revocable_cpu_low_priority="true"
--runtime_dir="/tmp/Endpoint_SlaveEndpointTest_UnauthorizedRequest_0_joNEJq" --sandbox_directory="/mnt/mesos/sandbox"
--strict="true" --switch_user="true" --systemd_enable_support="true" --systemd_runtime_directory="/run/systemd/system"
--version="false" --work_dir="/tmp/Endpoint_SlaveEndpointTest_UnauthorizedRequest_0_cVkM6b"
I0619 08:47:08.299180 30648 credentials.hpp:86] Loading credential for authentication from
'/tmp/Endpoint_SlaveEndpointTest_UnauthorizedRequest_0_joNEJq/credential'
I0619 08:47:08.299425 30648 slave.cpp:282] Agent using credential for: test-principal
I0619 08:47:08.299453 30648 credentials.hpp:37] Loading credentials for authentication from
'/tmp/Endpoint_SlaveEndpointTest_UnauthorizedRequest_0_joNEJq/http_credentials'
I0619 08:47:08.299795 30648 http.cpp:1019] Creating default 'basic' HTTP authenticator for
realm 'mesos-agent-readonly'
I0619 08:47:08.300040 30648 http.cpp:1019] Creating default 'basic' HTTP authenticator for
realm 'mesos-agent-readwrite'
I0619 08:47:08.302351 30648 slave.cpp:553] Agent resources: cpus(*):2; mem(*):1024; disk(*):1024;
ports(*):[31000-32000]
I0619 08:47:08.302505 30648 slave.cpp:561] Agent attributes: [  ]
I0619 08:47:08.302522 30648 slave.cpp:566] Agent hostname: 9f423e53fa53
I0619 08:47:08.304033 30646 status_update_manager.cpp:177] Pausing sending status updates
I0619 08:47:08.306399 30647 state.cpp:62] Recovering state from '/tmp/Endpoint_SlaveEndpointTest_UnauthorizedRequest_0_cVkM6b/meta'
I0619 08:47:08.307106 30647 status_update_manager.cpp:203] Recovering status update manager
I0619 08:47:08.307348 30647 containerizer.cpp:582] Recovering containerizer
I0619 08:47:08.311115 30652 provisioner.cpp:416] Provisioner recovery complete
I0619 08:47:08.317981 30652 slave.cpp:6128] Finished recovery
I0619 08:47:08.318874 30652 slave.cpp:6310] Querying resource estimator for oversubscribable
resources
I0619 08:47:08.319775 30652 slave.cpp:6324] Received oversubscribable resources {} from the
resource estimator
I0619 08:47:08.333274 30649 process.cpp:3779] Handling HTTP event for process 'slave(762)'
with path: '/slave(762)/monitor/statistics'
I0619 08:47:08.335536 30647 http.cpp:1159] HTTP GET for /slave(762)/monitor/statistics from
172.17.0.2:43738
I0619 08:47:08.335670 30647 http.cpp:980] Authorizing principal 'test-principal' to GET the
'/monitor/statistics' endpoint
I0619 08:47:08.349683 30645 slave.cpp:818] Agent terminating
[       OK ] Endpoint/SlaveEndpointTest.UnauthorizedRequest/0 (99 ms)
[ RUN      ] Endpoint/SlaveEndpointTest.UnauthorizedRequest/1
I0619 08:47:08.384733 30645 containerizer.cpp:230] Using isolation: posix/cpu,posix/mem,filesystem/posix,network/cni,environment_secret
W0619 08:47:08.385545 30645 backend.cpp:76] Failed to create 'overlay' backend: OverlayBackend
requires root privileges
W0619 08:47:08.385730 30645 backend.cpp:76] Failed to create 'bind' backend: BindBackend requires
root privileges
I0619 08:47:08.385778 30645 provisioner.cpp:255] Using default backend 'copy'
I0619 08:47:08.396448 30651 slave.cpp:249] Mesos agent started on (763)@172.17.0.2:36253
I0619 08:47:08.396512 30651 slave.cpp:250] Flags at startup: --acls="" --appc_simple_discovery_uri_prefix="http://"
--appc_store_dir="/tmp/Endpoint_SlaveEndpointTest_UnauthorizedRequest_1_PaPc4n/store/appc"
--authenticate_http_readonly="true" --authenticate_http_readwrite="true" --authenticatee="crammd5"
--authentication_backoff_factor="1secs" --authorizer="local" --cgroups_cpu_enable_pids_and_tids_count="false"
--cgroups_enable_cfs="false" --cgroups_hierarchy="/sys/fs/cgroup" --cgroups_limit_swap="false"
--cgroups_root="mesos" --container_disk_watch_interval="15secs" --containerizers="mesos" --credential="/tmp/Endpoint_SlaveEndpointTest_UnauthorizedRequest_1_PaPc4n/credential"
--default_role="*" --disk_watch_interval="1mins" --docker="docker" --docker_kill_orphans="true"
--docker_registry="https://registry-1.docker.io" --docker_remove_delay="6hrs" --docker_socket="/var/run/docker.sock"
--docker_stop_timeout="0ns" --docker_store_dir="/tmp/Endpoint_SlaveEndpointTest_UnauthorizedRequest_1_PaPc4n/store/docker"
--docker_volume_checkpoint_dir="/var/run/mesos/isolators/docker/volume" --enforce_container_disk_quota="false"
--executor_registration_timeout="1mins" --executor_reregistration_timeout="2secs" --executor_shutdown_grace_period="5secs"
--fetcher_cache_dir="/tmp/Endpoint_SlaveEndpointTest_UnauthorizedRequest_1_PaPc4n/fetch" --fetcher_cache_size="2GB"
--frameworks_home="" --gc_delay="1weeks" --gc_disk_headroom="0.1" --hadoop_home="" --help="false"
--hostname_lookup="true" --http_command_executor="false" --http_credentials="/tmp/Endpoint_SlaveEndpointTest_UnauthorizedRequest_1_PaPc4n/http_credentials"
--http_heartbeat_interval="30secs" --initialize_driver_logging="true" --isolation="posix/cpu,posix/mem"
--launcher="posix" --launcher_dir="/mesos/build/src" --logbufsecs="0" --logging_level="INFO"
--max_completed_executors_per_framework="150" --oversubscribed_resources_interval="15secs"
--perf_duration="10secs" --perf_interval="1mins" --port="5051" --qos_correction_interval_min="0ns"
--quiet="false" --recover="reconnect" --recovery_timeout="15mins" --registration_backoff_factor="10ms"
--resources="cpus:2;gpus:0;mem:1024;disk:1024;ports:[31000-32000]" --revocable_cpu_low_priority="true"
--runtime_dir="/tmp/Endpoint_SlaveEndpointTest_UnauthorizedRequest_1_PaPc4n" --sandbox_directory="/mnt/mesos/sandbox"
--strict="true" --switch_user="true" --systemd_enable_support="true" --systemd_runtime_directory="/run/systemd/system"
--version="false" --work_dir="/tmp/Endpoint_SlaveEndpointTest_UnauthorizedRequest_1_g36yc9"
I0619 08:47:08.397202 30651 credentials.hpp:86] Loading credential for authentication from
'/tmp/Endpoint_SlaveEndpointTest_UnauthorizedRequest_1_PaPc4n/credential'
I0619 08:47:08.397444 30651 slave.cpp:282] Agent using credential for: test-principal
I0619 08:47:08.397472 30651 credentials.hpp:37] Loading credentials for authentication from
'/tmp/Endpoint_SlaveEndpointTest_UnauthorizedRequest_1_PaPc4n/http_credentials'
I0619 08:47:08.397810 30651 http.cpp:1019] Creating default 'basic' HTTP authenticator for
realm 'mesos-agent-readonly'
I0619 08:47:08.398046 30651 http.cpp:1019] Creating default 'basic' HTTP authenticator for
realm 'mesos-agent-readwrite'
I0619 08:47:08.400306 30651 slave.cpp:553] Agent resources: cpus(*):2; mem(*):1024; disk(*):1024;
ports(*):[31000-32000]
I0619 08:47:08.400462 30651 slave.cpp:561] Agent attributes: [  ]
I0619 08:47:08.400480 30651 slave.cpp:566] Agent hostname: 9f423e53fa53
I0619 08:47:08.403780 30646 status_update_manager.cpp:177] Pausing sending status updates
I0619 08:47:08.404065 30649 state.cpp:62] Recovering state from '/tmp/Endpoint_SlaveEndpointTest_UnauthorizedRequest_1_g36yc9/meta'
I0619 08:47:08.404546 30650 status_update_manager.cpp:203] Recovering status update manager
I0619 08:47:08.404799 30650 containerizer.cpp:582] Recovering containerizer
I0619 08:47:08.416544 30650 provisioner.cpp:416] Provisioner recovery complete
I0619 08:47:08.417259 30650 slave.cpp:6128] Finished recovery
I0619 08:47:08.417863 30650 slave.cpp:6310] Querying resource estimator for oversubscribable
resources
I0619 08:47:08.418684 30650 slave.cpp:6324] Received oversubscribable resources {} from the
resource estimator
I0619 08:47:08.423691 30646 process.cpp:3779] Handling HTTP event for process 'slave(763)'
with path: '/slave(763)/monitor/statistics.json'
I0619 08:47:08.426944 30646 http.cpp:1159] HTTP GET for /slave(763)/monitor/statistics.json
from 172.17.0.2:43740
I0619 08:47:08.427078 30646 http.cpp:980] Authorizing principal 'test-principal' to GET the
'/monitor/statistics.json' endpoint
I0619 08:47:08.449842 30647 slave.cpp:818] Agent terminating
[       OK ] Endpoint/SlaveEndpointTest.UnauthorizedRequest/1 (103 ms)
[ RUN      ] Endpoint/SlaveEndpointTest.UnauthorizedRequest/2
I0619 08:47:08.489383 30645 containerizer.cpp:230] Using isolation: posix/cpu,posix/mem,filesystem/posix,network/cni,environment_secret
W0619 08:47:08.496453 30645 backend.cpp:76] Failed to create 'overlay' backend: OverlayBackend
requires root privileges
W0619 08:47:08.496731 30645 backend.cpp:76] Failed to create 'bind' backend: BindBackend requires
root privileges
I0619 08:47:08.496930 30645 provisioner.cpp:255] Using default backend 'copy'
I0619 08:47:08.516494 30649 slave.cpp:249] Mesos agent started on (764)@172.17.0.2:36253
I0619 08:47:08.516558 30649 slave.cpp:250] Flags at startup: --acls="" --appc_simple_discovery_uri_prefix="http://"
--appc_store_dir="/tmp/Endpoint_SlaveEndpointTest_UnauthorizedRequest_2_Nn50vm/store/appc"
--authenticate_http_readonly="true" --authenticate_http_readwrite="true" --authenticatee="crammd5"
--authentication_backoff_factor="1secs" --authorizer="local" --cgroups_cpu_enable_pids_and_tids_count="false"
--cgroups_enable_cfs="false" --cgroups_hierarchy="/sys/fs/cgroup" --cgroups_limit_swap="false"
--cgroups_root="mesos" --container_disk_watch_interval="15secs" --containerizers="mesos" --credential="/tmp/Endpoint_SlaveEndpointTest_UnauthorizedRequest_2_Nn50vm/credential"
--default_role="*" --disk_watch_interval="1mins" --docker="docker" --docker_kill_orphans="true"
--docker_registry="https://registry-1.docker.io" --docker_remove_delay="6hrs" --docker_socket="/var/run/docker.sock"
--docker_stop_timeout="0ns" --docker_store_dir="/tmp/Endpoint_SlaveEndpointTest_UnauthorizedRequest_2_Nn50vm/store/docker"
--docker_volume_checkpoint_dir="/var/run/mesos/isolators/docker/volume" --enforce_container_disk_quota="false"
--executor_registration_timeout="1mins" --executor_reregistration_timeout="2secs" --executor_shutdown_grace_period="5secs"
--fetcher_cache_dir="/tmp/Endpoint_SlaveEndpointTest_UnauthorizedRequest_2_Nn50vm/fetch" --fetcher_cache_size="2GB"
--frameworks_home="" --gc_delay="1weeks" --gc_disk_headroom="0.1" --hadoop_home="" --help="false"
--hostname_lookup="true" --http_command_executor="false" --http_credentials="/tmp/Endpoint_SlaveEndpointTest_UnauthorizedRequest_2_Nn50vm/http_credentials"
--http_heartbeat_interval="30secs" --initialize_driver_logging="true" --isolation="posix/cpu,posix/mem"
--launcher="posix" --launcher_dir="/mesos/build/src" --logbufsecs="0" --logging_level="INFO"
--max_completed_executors_per_framework="150" --oversubscribed_resources_interval="15secs"
--perf_duration="10secs" --perf_interval="1mins" --port="5051" --qos_correction_interval_min="0ns"
--quiet="false" --recover="reconnect" --recovery_timeout="15mins" --registration_backoff_factor="10ms"
--resources="cpus:2;gpus:0;mem:1024;disk:1024;ports:[31000-32000]" --revocable_cpu_low_priority="true"
--runtime_dir="/tmp/Endpoint_SlaveEndpointTest_UnauthorizedRequest_2_Nn50vm" --sandbox_directory="/mnt/mesos/sandbox"
--strict="true" --switch_user="true" --systemd_enable_support="true" --systemd_runtime_directory="/run/systemd/system"
--version="false" --work_dir="/tmp/Endpoint_SlaveEndpointTest_UnauthorizedRequest_2_8uC8l7"
I0619 08:47:08.517246 30649 credentials.hpp:86] Loading credential for authentication from
'/tmp/Endpoint_SlaveEndpointTest_UnauthorizedRequest_2_Nn50vm/credential'
I0619 08:47:08.517494 30649 slave.cpp:282] Agent using credential for: test-principal
I0619 08:47:08.517521 30649 credentials.hpp:37] Loading credentials for authentication from
'/tmp/Endpoint_SlaveEndpointTest_UnauthorizedRequest_2_Nn50vm/http_credentials'
I0619 08:47:08.517859 30649 http.cpp:1019] Creating default 'basic' HTTP authenticator for
realm 'mesos-agent-readonly'
I0619 08:47:08.518102 30649 http.cpp:1019] Creating default 'basic' HTTP authenticator for
realm 'mesos-agent-readwrite'
I0619 08:47:08.520347 30649 slave.cpp:553] Agent resources: cpus(*):2; mem(*):1024; disk(*):1024;
ports(*):[31000-32000]
I0619 08:47:08.520496 30649 slave.cpp:561] Agent attributes: [  ]
I0619 08:47:08.520514 30649 slave.cpp:566] Agent hostname: 9f423e53fa53
I0619 08:47:08.523269 30649 status_update_manager.cpp:177] Pausing sending status updates
I0619 08:47:08.524094 30650 state.cpp:62] Recovering state from '/tmp/Endpoint_SlaveEndpointTest_UnauthorizedRequest_2_8uC8l7/meta'
I0619 08:47:08.524809 30650 status_update_manager.cpp:203] Recovering status update manager
I0619 08:47:08.525065 30650 containerizer.cpp:582] Recovering containerizer
I0619 08:47:08.528614 30650 provisioner.cpp:416] Provisioner recovery complete
I0619 08:47:08.529489 30650 slave.cpp:6128] Finished recovery
I0619 08:47:08.530148 30650 slave.cpp:6310] Querying resource estimator for oversubscribable
resources
I0619 08:47:08.531072 30650 slave.cpp:6324] Received oversubscribable resources {} from the
resource estimator
I0619 08:47:08.538897 30648 process.cpp:3779] Handling HTTP event for process 'slave(764)'
with path: '/slave(764)/containers'
I0619 08:47:08.541766 30648 http.cpp:1159] HTTP GET for /slave(764)/containers from 172.17.0.2:43742
I0619 08:47:08.541896 30648 http.cpp:980] Authorizing principal 'test-principal' to GET the
'/containers' endpoint
I0619 08:47:08.564396 30645 slave.cpp:818] Agent terminating
[       OK ] Endpoint/SlaveEndpointTest.UnauthorizedRequest/2 (123 ms)
[ RUN      ] Endpoint/SlaveEndpointTest.NoAuthorizer/0
I0619 08:47:08.597113 30645 containerizer.cpp:230] Using isolation: posix/cpu,posix/mem,filesystem/posix,network/cni,environment_secret
W0619 08:47:08.597949 30645 backend.cpp:76] Failed to create 'overlay' backend: OverlayBackend
requires root privileges
W0619 08:47:08.598145 30645 backend.cpp:76] Failed to create 'bind' backend: BindBackend requires
root privileges
I0619 08:47:08.598193 30645 provisioner.cpp:255] Using default backend 'copy'
I0619 08:47:08.602030 30645 cluster.cpp:448] Creating default 'local' authorizer
I0619 08:47:08.619066 30649 slave.cpp:249] Mesos agent started on (765)@172.17.0.2:36253
I0619 08:47:08.619130 30649 slave.cpp:250] Flags at startup: --acls="" --appc_simple_discovery_uri_prefix="http://"
--appc_store_dir="/tmp/Endpoint_SlaveEndpointTest_NoAuthorizer_0_p9uWam/store/appc" --authenticate_http_readonly="true"
--authenticate_http_readwrite="true" --authenticatee="crammd5" --authentication_backoff_factor="1secs"
--authorizer="local" --cgroups_cpu_enable_pids_and_tids_count="false" --cgroups_enable_cfs="false"
--cgroups_hierarchy="/sys/fs/cgroup" --cgroups_limit_swap="false" --cgroups_root="mesos" --container_disk_watch_interval="15secs"
--containerizers="mesos" --credential="/tmp/Endpoint_SlaveEndpointTest_NoAuthorizer_0_p9uWam/credential"
--default_role="*" --disk_watch_interval="1mins" --docker="docker" --docker_kill_orphans="true"
--docker_registry="https://registry-1.docker.io" --docker_remove_delay="6hrs" --docker_socket="/var/run/docker.sock"
--docker_stop_timeout="0ns" --docker_store_dir="/tmp/Endpoint_SlaveEndpointTest_NoAuthorizer_0_p9uWam/store/docker"
--docker_volume_checkpoint_dir="/var/run/mesos/isolators/docker/volume" --enforce_container_disk_quota="false"
--executor_registration_timeout="1mins" --executor_reregistration_timeout="2secs" --executor_shutdown_grace_period="5secs"
--fetcher_cache_dir="/tmp/Endpoint_SlaveEndpointTest_NoAuthorizer_0_p9uWam/fetch" --fetcher_cache_size="2GB"
--frameworks_home="" --gc_delay="1weeks" --gc_disk_headroom="0.1" --hadoop_home="" --help="false"
--hostname_lookup="true" --http_command_executor="false" --http_credentials="/tmp/Endpoint_SlaveEndpointTest_NoAuthorizer_0_p9uWam/http_credentials"
--http_heartbeat_interval="30secs" --initialize_driver_logging="true" --isolation="posix/cpu,posix/mem"
--launcher="posix" --launcher_dir="/mesos/build/src" --logbufsecs="0" --logging_level="INFO"
--max_completed_executors_per_framework="150" --oversubscribed_resources_interval="15secs"
--perf_duration="10secs" --perf_interval="1mins" --port="5051" --qos_correction_interval_min="0ns"
--quiet="false" --recover="reconnect" --recovery_timeout="15mins" --registration_backoff_factor="10ms"
--resources="cpus:2;gpus:0;mem:1024;disk:1024;ports:[31000-32000]" --revocable_cpu_low_priority="true"
--runtime_dir="/tmp/Endpoint_SlaveEndpointTest_NoAuthorizer_0_p9uWam" --sandbox_directory="/mnt/mesos/sandbox"
--strict="true" --switch_user="true" --systemd_enable_support="true" --systemd_runtime_directory="/run/systemd/system"
--version="false" --work_dir="/tmp/Endpoint_SlaveEndpointTest_NoAuthorizer_0_kF9AI6"
I0619 08:47:08.619817 30649 credentials.hpp:86] Loading credential for authentication from
'/tmp/Endpoint_SlaveEndpointTest_NoAuthorizer_0_p9uWam/credential'
I0619 08:47:08.620065 30649 slave.cpp:282] Agent using credential for: test-principal
I0619 08:47:08.620095 30649 credentials.hpp:37] Loading credentials for authentication from
'/tmp/Endpoint_SlaveEndpointTest_NoAuthorizer_0_p9uWam/http_credentials'
I0619 08:47:08.620443 30649 http.cpp:1019] Creating default 'basic' HTTP authenticator for
realm 'mesos-agent-readonly'
I0619 08:47:08.620688 30649 http.cpp:1019] Creating default 'basic' HTTP authenticator for
realm 'mesos-agent-readwrite'
I0619 08:47:08.622944 30649 slave.cpp:553] Agent resources: cpus(*):2; mem(*):1024; disk(*):1024;
ports(*):[31000-32000]
I0619 08:47:08.623095 30649 slave.cpp:561] Agent attributes: [  ]
I0619 08:47:08.623113 30649 slave.cpp:566] Agent hostname: 9f423e53fa53
I0619 08:47:08.634305 30648 status_update_manager.cpp:177] Pausing sending status updates
I0619 08:47:08.637023 30649 state.cpp:62] Recovering state from '/tmp/Endpoint_SlaveEndpointTest_NoAuthorizer_0_kF9AI6/meta'
I0619 08:47:08.637853 30648 status_update_manager.cpp:203] Recovering status update manager
I0619 08:47:08.638233 30649 containerizer.cpp:582] Recovering containerizer
I0619 08:47:08.641446 30649 provisioner.cpp:416] Provisioner recovery complete
I0619 08:47:08.642391 30649 slave.cpp:6128] Finished recovery
I0619 08:47:08.643095 30649 slave.cpp:6310] Querying resource estimator for oversubscribable
resources
I0619 08:47:08.644045 30651 slave.cpp:6324] Received oversubscribable resources {} from the
resource estimator
I0619 08:47:08.652693 30651 process.cpp:3779] Handling HTTP event for process 'slave(765)'
with path: '/slave(765)/monitor/statistics'
I0619 08:47:08.655347 30651 http.cpp:1159] HTTP GET for /slave(765)/monitor/statistics from
172.17.0.2:43744
I0619 08:47:08.655479 30651 http.cpp:980] Authorizing principal 'test-principal' to GET the
'/monitor/statistics' endpoint
I0619 08:47:08.693192 30647 slave.cpp:818] Agent terminating
[       OK ] Endpoint/SlaveEndpointTest.NoAuthorizer/0 (129 ms)
[ RUN      ] Endpoint/SlaveEndpointTest.NoAuthorizer/1
I0619 08:47:08.728188 30645 containerizer.cpp:230] Using isolation: posix/cpu,posix/mem,filesystem/posix,network/cni,environment_secret
W0619 08:47:08.729008 30645 backend.cpp:76] Failed to create 'overlay' backend: OverlayBackend
requires root privileges
W0619 08:47:08.729560 30645 backend.cpp:76] Failed to create 'bind' backend: BindBackend requires
root privileges
I0619 08:47:08.729627 30645 provisioner.cpp:255] Using default backend 'copy'
I0619 08:47:08.734422 30645 cluster.cpp:448] Creating default 'local' authorizer
I0619 08:47:08.745198 30649 slave.cpp:249] Mesos agent started on (766)@172.17.0.2:36253
I0619 08:47:08.745251 30649 slave.cpp:250] Flags at startup: --acls="" --appc_simple_discovery_uri_prefix="http://"
--appc_store_dir="/tmp/Endpoint_SlaveEndpointTest_NoAuthorizer_1_bk7n9m/store/appc" --authenticate_http_readonly="true"
--authenticate_http_readwrite="true" --authenticatee="crammd5" --authentication_backoff_factor="1secs"
--authorizer="local" --cgroups_cpu_enable_pids_and_tids_count="false" --cgroups_enable_cfs="false"
--cgroups_hierarchy="/sys/fs/cgroup" --cgroups_limit_swap="false" --cgroups_root="mesos" --container_disk_watch_interval="15secs"
--containerizers="mesos" --credential="/tmp/Endpoint_SlaveEndpointTest_NoAuthorizer_1_bk7n9m/credential"
--default_role="*" --disk_watch_interval="1mins" --docker="docker" --docker_kill_orphans="true"
--docker_registry="https://registry-1.docker.io" --docker_remove_delay="6hrs" --docker_socket="/var/run/docker.sock"
--docker_stop_timeout="0ns" --docker_store_dir="/tmp/Endpoint_SlaveEndpointTest_NoAuthorizer_1_bk7n9m/store/docker"
--docker_volume_checkpoint_dir="/var/run/mesos/isolators/docker/volume" --enforce_container_disk_quota="false"
--executor_registration_timeout="1mins" --executor_reregistration_timeout="2secs" --executor_shutdown_grace_period="5secs"
--fetcher_cache_dir="/tmp/Endpoint_SlaveEndpointTest_NoAuthorizer_1_bk7n9m/fetch" --fetcher_cache_size="2GB"
--frameworks_home="" --gc_delay="1weeks" --gc_disk_headroom="0.1" --hadoop_home="" --help="false"
--hostname_lookup="true" --http_command_executor="false" --http_credentials="/tmp/Endpoint_SlaveEndpointTest_NoAuthorizer_1_bk7n9m/http_credentials"
--http_heartbeat_interval="30secs" --initialize_driver_logging="true" --isolation="posix/cpu,posix/mem"
--launcher="posix" --launcher_dir="/mesos/build/src" --logbufsecs="0" --logging_level="INFO"
--max_completed_executors_per_framework="150" --oversubscribed_resources_interval="15secs"
--perf_duration="10secs" --perf_interval="1mins" --port="5051" --qos_correction_interval_min="0ns"
--quiet="false" --recover="reconnect" --recovery_timeout="15mins" --registration_backoff_factor="10ms"
--resources="cpus:2;gpus:0;mem:1024;disk:1024;ports:[31000-32000]" --revocable_cpu_low_priority="true"
--runtime_dir="/tmp/Endpoint_SlaveEndpointTest_NoAuthorizer_1_bk7n9m" --sandbox_directory="/mnt/mesos/sandbox"
--strict="true" --switch_user="true" --systemd_enable_support="true" --systemd_runtime_directory="/run/systemd/system"
--version="false" --work_dir="/tmp/Endpoint_SlaveEndpointTest_NoAuthorizer_1_CGAXl7"
I0619 08:47:08.745932 30649 credentials.hpp:86] Loading credential for authentication from
'/tmp/Endpoint_SlaveEndpointTest_NoAuthorizer_1_bk7n9m/credential'
I0619 08:47:08.746168 30649 slave.cpp:282] Agent using credential for: test-principal
I0619 08:47:08.746196 30649 credentials.hpp:37] Loading credentials for authentication from
'/tmp/Endpoint_SlaveEndpointTest_NoAuthorizer_1_bk7n9m/http_credentials'
I0619 08:47:08.746536 30649 http.cpp:1019] Creating default 'basic' HTTP authenticator for
realm 'mesos-agent-readonly'
I0619 08:47:08.746805 30649 http.cpp:1019] Creating default 'basic' HTTP authenticator for
realm 'mesos-agent-readwrite'
I0619 08:47:08.749104 30649 slave.cpp:553] Agent resources: cpus(*):2; mem(*):1024; disk(*):1024;
ports(*):[31000-32000]
I0619 08:47:08.749253 30649 slave.cpp:561] Agent attributes: [  ]
I0619 08:47:08.749269 30649 slave.cpp:566] Agent hostname: 9f423e53fa53
I0619 08:47:08.749460 30652 status_update_manager.cpp:177] Pausing sending status updates
I0619 08:47:08.751574 30652 state.cpp:62] Recovering state from '/tmp/Endpoint_SlaveEndpointTest_NoAuthorizer_1_CGAXl7/meta'
I0619 08:47:08.752180 30652 status_update_manager.cpp:203] Recovering status update manager
I0619 08:47:08.752481 30651 containerizer.cpp:582] Recovering containerizer
I0619 08:47:08.756095 30651 provisioner.cpp:416] Provisioner recovery complete
I0619 08:47:08.757340 30651 slave.cpp:6128] Finished recovery
I0619 08:47:08.758026 30651 slave.cpp:6310] Querying resource estimator for oversubscribable
resources
I0619 08:47:08.758535 30651 slave.cpp:6324] Received oversubscribable resources {} from the
resource estimator
I0619 08:47:08.816814 30652 process.cpp:3779] Handling HTTP event for process 'slave(766)'
with path: '/slave(766)/monitor/statistics.json'
I0619 08:47:08.819031 30652 http.cpp:1159] HTTP GET for /slave(766)/monitor/statistics.json
from 172.17.0.2:43746
I0619 08:47:08.819150 30652 http.cpp:980] Authorizing principal 'test-principal' to GET the
'/monitor/statistics.json' endpoint
I0619 08:47:08.856366 30649 slave.cpp:818] Agent terminating
[       OK ] Endpoint/SlaveEndpointTest.NoAuthorizer/1 (231 ms)
[ RUN      ] Endpoint/SlaveEndpointTest.NoAuthorizer/2
I0619 08:47:08.958364 30645 containerizer.cpp:230] Using isolation: posix/cpu,posix/mem,filesystem/posix,network/cni,environment_secret
W0619 08:47:08.959432 30645 backend.cpp:76] Failed to create 'overlay' backend: OverlayBackend
requires root privileges
W0619 08:47:08.959913 30645 backend.cpp:76] Failed to create 'bind' backend: BindBackend requires
root privileges
I0619 08:47:08.960199 30645 provisioner.cpp:255] Using default backend 'copy'
I0619 08:47:08.963563 30645 cluster.cpp:448] Creating default 'local' authorizer
I0619 08:47:08.970335 30652 slave.cpp:249] Mesos agent started on (767)@172.17.0.2:36253
I0619 08:47:08.970389 30652 slave.cpp:250] Flags at startup: --acls="" --appc_simple_discovery_uri_prefix="http://"
--appc_store_dir="/tmp/Endpoint_SlaveEndpointTest_NoAuthorizer_2_jmHSeq/store/appc" --authenticate_http_readonly="true"
--authenticate_http_readwrite="true" --authenticatee="crammd5" --authentication_backoff_factor="1secs"
--authorizer="local" --cgroups_cpu_enable_pids_and_tids_count="false" --cgroups_enable_cfs="false"
--cgroups_hierarchy="/sys/fs/cgroup" --cgroups_limit_swap="false" --cgroups_root="mesos" --container_disk_watch_interval="15secs"
--containerizers="mesos" --credential="/tmp/Endpoint_SlaveEndpointTest_NoAuthorizer_2_jmHSeq/credential"
--default_role="*" --disk_watch_interval="1mins" --docker="docker" --docker_kill_orphans="true"
--docker_registry="https://registry-1.docker.io" --docker_remove_delay="6hrs" --docker_socket="/var/run/docker.sock"
--docker_stop_timeout="0ns" --docker_store_dir="/tmp/Endpoint_SlaveEndpointTest_NoAuthorizer_2_jmHSeq/store/docker"
--docker_volume_checkpoint_dir="/var/run/mesos/isolators/docker/volume" --enforce_container_disk_quota="false"
--executor_registration_timeout="1mins" --executor_reregistration_timeout="2secs" --executor_shutdown_grace_period="5secs"
--fetcher_cache_dir="/tmp/Endpoint_SlaveEndpointTest_NoAuthorizer_2_jmHSeq/fetch" --fetcher_cache_size="2GB"
--frameworks_home="" --gc_delay="1weeks" --gc_disk_headroom="0.1" --hadoop_home="" --help="false"
--hostname_lookup="true" --http_command_executor="false" --http_credentials="/tmp/Endpoint_SlaveEndpointTest_NoAuthorizer_2_jmHSeq/http_credentials"
--http_heartbeat_interval="30secs" --initialize_driver_logging="true" --isolation="posix/cpu,posix/mem"
--launcher="posix" --launcher_dir="/mesos/build/src" --logbufsecs="0" --logging_level="INFO"
--max_completed_executors_per_framework="150" --oversubscribed_resources_interval="15secs"
--perf_duration="10secs" --perf_interval="1mins" --port="5051" --qos_correction_interval_min="0ns"
--quiet="false" --recover="reconnect" --recovery_timeout="15mins" --registration_backoff_factor="10ms"
--resources="cpus:2;gpus:0;mem:1024;disk:1024;ports:[31000-32000]" --revocable_cpu_low_priority="true"
--runtime_dir="/tmp/Endpoint_SlaveEndpointTest_NoAuthorizer_2_jmHSeq" --sandbox_directory="/mnt/mesos/sandbox"
--strict="true" --switch_user="true" --systemd_enable_support="true" --systemd_runtime_directory="/run/systemd/system"
--version="false" --work_dir="/tmp/Endpoint_SlaveEndpointTest_NoAuthorizer_2_wLpYP9"
I0619 08:47:08.971035 30652 credentials.hpp:86] Loading credential for authentication from
'/tmp/Endpoint_SlaveEndpointTest_NoAuthorizer_2_jmHSeq/credential'
I0619 08:47:08.971266 30652 slave.cpp:282] Agent using credential for: test-principal
I0619 08:47:08.971288 30652 credentials.hpp:37] Loading credentials for authentication from
'/tmp/Endpoint_SlaveEndpointTest_NoAuthorizer_2_jmHSeq/http_credentials'
I0619 08:47:08.971607 30652 http.cpp:1019] Creating default 'basic' HTTP authenticator for
realm 'mesos-agent-readonly'
I0619 08:47:08.971837 30652 http.cpp:1019] Creating default 'basic' HTTP authenticator for
realm 'mesos-agent-readwrite'
I0619 08:47:08.973835 30652 slave.cpp:553] Agent resources: cpus(*):2; mem(*):1024; disk(*):1024;
ports(*):[31000-32000]
I0619 08:47:08.975064 30652 slave.cpp:561] Agent attributes: [  ]
I0619 08:47:08.975085 30652 slave.cpp:566] Agent hostname: 9f423e53fa53
I0619 08:47:08.977758 30652 status_update_manager.cpp:177] Pausing sending status updates
I0619 08:47:08.978682 30648 state.cpp:62] Recovering state from '/tmp/Endpoint_SlaveEndpointTest_NoAuthorizer_2_wLpYP9/meta'
I0619 08:47:08.979704 30648 status_update_manager.cpp:203] Recovering status update manager
I0619 08:47:08.980280 30648 containerizer.cpp:582] Recovering containerizer
I0619 08:47:08.983770 30648 provisioner.cpp:416] Provisioner recovery complete
I0619 08:47:08.985136 30647 slave.cpp:6128] Finished recovery
I0619 08:47:08.985796 30647 slave.cpp:6310] Querying resource estimator for oversubscribable
resources
I0619 08:47:08.986209 30647 slave.cpp:6324] Received oversubscribable resources {} from the
resource estimator
I0619 08:47:09.035462 30646 process.cpp:3779] Handling HTTP event for process 'slave(767)'
with path: '/slave(767)/containers'
I0619 08:47:09.038671 30646 http.cpp:1159] HTTP GET for /slave(767)/containers from 172.17.0.2:43750
I0619 08:47:09.039041 30646 http.cpp:980] Authorizing principal 'test-principal' to GET the
'/containers' endpoint
I0619 08:47:09.075294 30645 slave.cpp:818] Agent terminating
[       OK ] Endpoint/SlaveEndpointTest.NoAuthorizer/2 (136 ms)
[----------] 9 tests from Endpoint/SlaveEndpointTest (1125 ms total)

[----------] Global test environment tear-down
[==========] 1564 tests from 169 test cases ran. (547997 ms total)
[  PASSED  ] 1563 tests.
[  FAILED  ] 1 test, listed below:
[  FAILED  ] MasterTest.IgnoreOldAgentReregistration

 1 FAILED TEST
  YOU HAVE 20 DISABLED TESTS

E0619 08:47:09.244459 30654 process.cpp:968] Failed to accept socket: future discarded
make[3]: *** [CMakeFiles/check] Error 1
make[3]: Leaving directory `/mesos/build'
make[2]: *** [CMakeFiles/check.dir/all] Error 2
make[2]: Leaving directory `/mesos/build'
make[1]: *** [CMakeFiles/check.dir/rule] Error 2
make[1]: Leaving directory `/mesos/build'
make: *** [check] Error 2
+ docker rmi mesos-1497856916-29557
Untagged: mesos-1497856916-29557:latest
Deleted: sha256:62bd0b2b1cca5519da50262db71592df382804d01eb039367956f0ab06d6dd12
Deleted: sha256:7328c4093b08f72bf4ad65b1946fe2be5e92541162179e7f6880b119c5a2b09f
Deleted: sha256:eaf4607ff987efd501921a120555b9594105535f9dab0a79ebf6a5b58d6e8586
Deleted: sha256:847e86a5c780342103fc1eaf0e27565c675f7c36fd61f22c599cd9919e070c69
Deleted: sha256:cf959b30acdc63ab617ecd9d395789260dd7f78a2e2513bf871ac694e023147b
Deleted: sha256:8dc2bb8a27f695252b999cf3ed7f99d68244e791e337a25deafbf603ea5bada6
Deleted: sha256:13a16a294c394bec43e2e6e3954f5f960388599258fbcc4f797c025a096a5635
Deleted: sha256:855c44ae3b9eb4aab6f6b3c19b39784900051ed4654f34ee4fdc7261c70c0b80
Deleted: sha256:f42cf185bf97fa302dbb9ede37194bd2c0457d11ef516317f0e44c6a387798b4
Deleted: sha256:f83dd4b6b7bb3cb349f67e22dfad520135ec52dc67fea8d41436278b62789ed7
Deleted: sha256:e11bd7d7c498cf449f3bf592e2fd0af118ad7cbcbc7f0ebd4ecab449f16b8ef0
Deleted: sha256:278ddc084f3a1f18d1eb5d4297138075c848f3f487b40f5749a4582e96b2093e
Deleted: sha256:b18d16ac6835ccdfb234c71603ec6f7310c65c6dd6332755bc413e26cfabcc5a
Deleted: sha256:e959065fda232e95e8049031ca7370b98fa595f879f64d21e862c36d4c534fc3
Deleted: sha256:aeb9b9079fdc96664fc4b6790637f52bfd9b8f70e16865f88a950daf37510b07
Deleted: sha256:dc58fe61d7fe7c0645c162067fa7bc390aab8a471ba1ccf75111e38995212140
Deleted: sha256:3b0d662f4cbfed65b197c57f948dfca5e2812165802963043391d89e805f4f6e
Deleted: sha256:b722dd337fd5c6c9b30a5a8847aecc6e44ebe4b09b307ca740acfabb8c14b2dc
Deleted: sha256:981a8435dfd244c7f440fd0f716a4540553dfafc0b1767e68597535d0a819eff
Deleted: sha256:eae32a6679a29c633c50d196391f50d5b70e9f9768dc83c627ed54e9ae626bdf
Deleted: sha256:ac62173eb5f6b2d6ea5c44276930941d01f53402873f9bed7b14f27bf81fdb26
Deleted: sha256:a227f795f2d351d3efcfd6f7d12a20ab9e23d656293f77fc6254df2158c42ad0
Deleted: sha256:f1e2fe1ba894b86522815433d685a2108225980bd68192a757f9ef2140e57edc
Deleted: sha256:f53dc88742af5099d03d91dd9a571a682ddad6cf986ae8e1abd42e8f9c9945e1
Build step 'Execute shell' marked build as failure

Mime
View raw message