mesos-builds mailing list archives

Site index · List index
Message view « Date » · « Thread »
Top « Date » · « Thread »
From Apache Jenkins Server <jenk...@builds.apache.org>
Subject Build failed in Jenkins: Mesos-Buildbot » cmake,gcc,--verbose,GLOG_v=1 MESOS_VERBOSE=1,centos:7,(ubuntu)&&(!ubuntu-us1)&&(!ubuntu-eu2) #3760
Date Fri, 02 Jun 2017 23:34:41 GMT
See <https://builds.apache.org/job/Mesos-Buildbot/BUILDTOOL=cmake,COMPILER=gcc,CONFIGURATION=--verbose,ENVIRONMENT=GLOG_v=1%20MESOS_VERBOSE=1,OS=centos%3A7,label_exp=(ubuntu)&&(!ubuntu-us1)&&(!ubuntu-eu2)/3760/display/redirect?page=changes>

Changes:

[neil.conway] Copy-edited persistent volume docs.

------------------------------------------
[...truncated 25.67 MB...]
I0602 23:34:34.368999 31366 slave.cpp:817] Agent terminating
[       OK ] Endpoint/SlaveEndpointTest.AuthorizedRequest/1 (18 ms)
[ RUN      ] Endpoint/SlaveEndpointTest.AuthorizedRequest/2
I0602 23:34:34.374948 31362 containerizer.cpp:230] Using isolation: posix/cpu,posix/mem,filesystem/posix,network/cni,environment_secret
W0602 23:34:34.375321 31362 backend.cpp:76] Failed to create 'aufs' backend: AufsBackend requires
root privileges
W0602 23:34:34.375366 31362 backend.cpp:76] Failed to create 'bind' backend: BindBackend requires
root privileges
I0602 23:34:34.375385 31362 provisioner.cpp:255] Using default backend 'copy'
I0602 23:34:34.376551 31381 slave.cpp:248] Mesos agent started on (748)@172.17.0.4:41193
I0602 23:34:34.376569 31381 slave.cpp:249] Flags at startup: --acls="" --appc_simple_discovery_uri_prefix="http://"
--appc_store_dir="/tmp/Endpoint_SlaveEndpointTest_AuthorizedRequest_2_9VvkCK/store/appc" --authenticate_http_readonly="true"
--authenticate_http_readwrite="true" --authenticatee="crammd5" --authentication_backoff_factor="1secs"
--authorizer="local" --cgroups_cpu_enable_pids_and_tids_count="false" --cgroups_enable_cfs="false"
--cgroups_hierarchy="/sys/fs/cgroup" --cgroups_limit_swap="false" --cgroups_root="mesos" --container_disk_watch_interval="15secs"
--containerizers="mesos" --credential="/tmp/Endpoint_SlaveEndpointTest_AuthorizedRequest_2_9VvkCK/credential"
--default_role="*" --disk_watch_interval="1mins" --docker="docker" --docker_kill_orphans="true"
--docker_registry="https://registry-1.docker.io" --docker_remove_delay="6hrs" --docker_socket="/var/run/docker.sock"
--docker_stop_timeout="0ns" --docker_store_dir="/tmp/Endpoint_SlaveEndpointTest_AuthorizedRequest_2_9VvkCK/store/docker"
--docker_volume_checkpoint_dir="/var/run/mesos/isolators/docker/volume" --enforce_container_disk_quota="false"
--executor_registration_timeout="1mins" --executor_reregistration_timeout="2secs" --executor_shutdown_grace_period="5secs"
--fetcher_cache_dir="/tmp/Endpoint_SlaveEndpointTest_AuthorizedRequest_2_9VvkCK/fetch" --fetcher_cache_size="2GB"
--frameworks_home="" --gc_delay="1weeks" --gc_disk_headroom="0.1" --hadoop_home="" --help="false"
--hostname_lookup="true" --http_command_executor="false" --http_credentials="/tmp/Endpoint_SlaveEndpointTest_AuthorizedRequest_2_9VvkCK/http_credentials"
--http_heartbeat_interval="30secs" --initialize_driver_logging="true" --isolation="posix/cpu,posix/mem"
--launcher="posix" --launcher_dir="/mesos/build/src" --logbufsecs="0" --logging_level="INFO"
--max_completed_executors_per_framework="150" --oversubscribed_resources_interval="15secs"
--perf_duration="10secs" --perf_interval="1mins" --port="5051" --qos_correction_interval_min="0ns"
--quiet="false" --recover="reconnect" --recovery_timeout="15mins" --registration_backoff_factor="10ms"
--resources="cpus:2;gpus:0;mem:1024;disk:1024;ports:[31000-32000]" --revocable_cpu_low_priority="true"
--runtime_dir="/tmp/Endpoint_SlaveEndpointTest_AuthorizedRequest_2_9VvkCK" --sandbox_directory="/mnt/mesos/sandbox"
--strict="true" --switch_user="true" --systemd_enable_support="true" --systemd_runtime_directory="/run/systemd/system"
--version="false" --work_dir="/tmp/Endpoint_SlaveEndpointTest_AuthorizedRequest_2_4JBieN"
I0602 23:34:34.376812 31381 credentials.hpp:86] Loading credential for authentication from
'/tmp/Endpoint_SlaveEndpointTest_AuthorizedRequest_2_9VvkCK/credential'
I0602 23:34:34.376895 31381 slave.cpp:281] Agent using credential for: test-principal
I0602 23:34:34.376905 31381 credentials.hpp:37] Loading credentials for authentication from
'/tmp/Endpoint_SlaveEndpointTest_AuthorizedRequest_2_9VvkCK/http_credentials'
I0602 23:34:34.377005 31381 http.cpp:975] Creating default 'basic' HTTP authenticator for
realm 'mesos-agent-readonly'
I0602 23:34:34.377068 31381 http.cpp:975] Creating default 'basic' HTTP authenticator for
realm 'mesos-agent-readwrite'
I0602 23:34:34.377472 31381 slave.cpp:552] Agent resources: cpus(*):2; mem(*):1024; disk(*):1024;
ports(*):[31000-32000]
I0602 23:34:34.377503 31381 slave.cpp:560] Agent attributes: [  ]
I0602 23:34:34.377508 31381 slave.cpp:565] Agent hostname: 6e2d2b656e14
I0602 23:34:34.377566 31366 status_update_manager.cpp:177] Pausing sending status updates
I0602 23:34:34.377933 31363 state.cpp:62] Recovering state from '/tmp/Endpoint_SlaveEndpointTest_AuthorizedRequest_2_4JBieN/meta'
I0602 23:34:34.378099 31383 status_update_manager.cpp:203] Recovering status update manager
I0602 23:34:34.378268 31386 containerizer.cpp:582] Recovering containerizer
I0602 23:34:34.378877 31366 provisioner.cpp:416] Provisioner recovery complete
I0602 23:34:34.379132 31374 slave.cpp:6119] Finished recovery
I0602 23:34:34.379508 31374 slave.cpp:6301] Querying resource estimator for oversubscribable
resources
I0602 23:34:34.379636 31373 slave.cpp:6315] Received oversubscribable resources {} from the
resource estimator
I0602 23:34:34.380395 31368 process.cpp:3778] Handling HTTP event for process 'slave(748)'
with path: '/slave(748)/containers'
I0602 23:34:34.380802 31386 http.cpp:1115] HTTP GET for /slave(748)/containers from 172.17.0.4:33792
I0602 23:34:34.380847 31386 http.cpp:936] Authorizing principal 'test-principal' to GET the
'/containers' endpoint
I0602 23:34:34.382293 31369 slave.cpp:817] Agent terminating
[       OK ] Endpoint/SlaveEndpointTest.AuthorizedRequest/2 (12 ms)
[ RUN      ] Endpoint/SlaveEndpointTest.UnauthorizedRequest/0
I0602 23:34:34.387094 31362 containerizer.cpp:230] Using isolation: posix/cpu,posix/mem,filesystem/posix,network/cni,environment_secret
W0602 23:34:34.387394 31362 backend.cpp:76] Failed to create 'aufs' backend: AufsBackend requires
root privileges
W0602 23:34:34.387430 31362 backend.cpp:76] Failed to create 'bind' backend: BindBackend requires
root privileges
I0602 23:34:34.387444 31362 provisioner.cpp:255] Using default backend 'copy'
I0602 23:34:34.388495 31371 slave.cpp:248] Mesos agent started on (749)@172.17.0.4:41193
I0602 23:34:34.388535 31371 slave.cpp:249] Flags at startup: --acls="" --appc_simple_discovery_uri_prefix="http://"
--appc_store_dir="/tmp/Endpoint_SlaveEndpointTest_UnauthorizedRequest_0_0FLOgA/store/appc"
--authenticate_http_readonly="true" --authenticate_http_readwrite="true" --authenticatee="crammd5"
--authentication_backoff_factor="1secs" --authorizer="local" --cgroups_cpu_enable_pids_and_tids_count="false"
--cgroups_enable_cfs="false" --cgroups_hierarchy="/sys/fs/cgroup" --cgroups_limit_swap="false"
--cgroups_root="mesos" --container_disk_watch_interval="15secs" --containerizers="mesos" --credential="/tmp/Endpoint_SlaveEndpointTest_UnauthorizedRequest_0_0FLOgA/credential"
--default_role="*" --disk_watch_interval="1mins" --docker="docker" --docker_kill_orphans="true"
--docker_registry="https://registry-1.docker.io" --docker_remove_delay="6hrs" --docker_socket="/var/run/docker.sock"
--docker_stop_timeout="0ns" --docker_store_dir="/tmp/Endpoint_SlaveEndpointTest_UnauthorizedRequest_0_0FLOgA/store/docker"
--docker_volume_checkpoint_dir="/var/run/mesos/isolators/docker/volume" --enforce_container_disk_quota="false"
--executor_registration_timeout="1mins" --executor_reregistration_timeout="2secs" --executor_shutdown_grace_period="5secs"
--fetcher_cache_dir="/tmp/Endpoint_SlaveEndpointTest_UnauthorizedRequest_0_0FLOgA/fetch" --fetcher_cache_size="2GB"
--frameworks_home="" --gc_delay="1weeks" --gc_disk_headroom="0.1" --hadoop_home="" --help="false"
--hostname_lookup="true" --http_command_executor="false" --http_credentials="/tmp/Endpoint_SlaveEndpointTest_UnauthorizedRequest_0_0FLOgA/http_credentials"
--http_heartbeat_interval="30secs" --initialize_driver_logging="true" --isolation="posix/cpu,posix/mem"
--launcher="posix" --launcher_dir="/mesos/build/src" --logbufsecs="0" --logging_level="INFO"
--max_completed_executors_per_framework="150" --oversubscribed_resources_interval="15secs"
--perf_duration="10secs" --perf_interval="1mins" --port="5051" --qos_correction_interval_min="0ns"
--quiet="false" --recover="reconnect" --recovery_timeout="15mins" --registration_backoff_factor="10ms"
--resources="cpus:2;gpus:0;mem:1024;disk:1024;ports:[31000-32000]" --revocable_cpu_low_priority="true"
--runtime_dir="/tmp/Endpoint_SlaveEndpointTest_UnauthorizedRequest_0_0FLOgA" --sandbox_directory="/mnt/mesos/sandbox"
--strict="true" --switch_user="true" --systemd_enable_support="true" --systemd_runtime_directory="/run/systemd/system"
--version="false" --work_dir="/tmp/Endpoint_SlaveEndpointTest_UnauthorizedRequest_0_YStUQC"
I0602 23:34:34.388744 31371 credentials.hpp:86] Loading credential for authentication from
'/tmp/Endpoint_SlaveEndpointTest_UnauthorizedRequest_0_0FLOgA/credential'
I0602 23:34:34.388841 31371 slave.cpp:281] Agent using credential for: test-principal
I0602 23:34:34.388856 31371 credentials.hpp:37] Loading credentials for authentication from
'/tmp/Endpoint_SlaveEndpointTest_UnauthorizedRequest_0_0FLOgA/http_credentials'
I0602 23:34:34.388957 31371 http.cpp:975] Creating default 'basic' HTTP authenticator for
realm 'mesos-agent-readonly'
I0602 23:34:34.389024 31371 http.cpp:975] Creating default 'basic' HTTP authenticator for
realm 'mesos-agent-readwrite'
I0602 23:34:34.389539 31371 slave.cpp:552] Agent resources: cpus(*):2; mem(*):1024; disk(*):1024;
ports(*):[31000-32000]
I0602 23:34:34.389569 31371 slave.cpp:560] Agent attributes: [  ]
I0602 23:34:34.389575 31371 slave.cpp:565] Agent hostname: 6e2d2b656e14
I0602 23:34:34.389629 31383 status_update_manager.cpp:177] Pausing sending status updates
I0602 23:34:34.389943 31379 state.cpp:62] Recovering state from '/tmp/Endpoint_SlaveEndpointTest_UnauthorizedRequest_0_YStUQC/meta'
I0602 23:34:34.390090 31366 status_update_manager.cpp:203] Recovering status update manager
I0602 23:34:34.390225 31375 containerizer.cpp:582] Recovering containerizer
I0602 23:34:34.390728 31367 provisioner.cpp:416] Provisioner recovery complete
I0602 23:34:34.390915 31373 slave.cpp:6119] Finished recovery
I0602 23:34:34.391302 31373 slave.cpp:6301] Querying resource estimator for oversubscribable
resources
I0602 23:34:34.391469 31383 slave.cpp:6315] Received oversubscribable resources {} from the
resource estimator
I0602 23:34:34.392283 31365 process.cpp:3778] Handling HTTP event for process 'slave(749)'
with path: '/slave(749)/monitor/statistics'
I0602 23:34:34.392719 31370 http.cpp:1115] HTTP GET for /slave(749)/monitor/statistics from
172.17.0.4:33794
I0602 23:34:34.392760 31370 http.cpp:936] Authorizing principal 'test-principal' to GET the
'/monitor/statistics' endpoint
I0602 23:34:34.393754 31364 slave.cpp:817] Agent terminating
[       OK ] Endpoint/SlaveEndpointTest.UnauthorizedRequest/0 (12 ms)
[ RUN      ] Endpoint/SlaveEndpointTest.UnauthorizedRequest/1
I0602 23:34:34.399443 31362 containerizer.cpp:230] Using isolation: posix/cpu,posix/mem,filesystem/posix,network/cni,environment_secret
W0602 23:34:34.399796 31362 backend.cpp:76] Failed to create 'aufs' backend: AufsBackend requires
root privileges
W0602 23:34:34.399837 31362 backend.cpp:76] Failed to create 'bind' backend: BindBackend requires
root privileges
I0602 23:34:34.399852 31362 provisioner.cpp:255] Using default backend 'copy'
I0602 23:34:34.401029 31386 slave.cpp:248] Mesos agent started on (750)@172.17.0.4:41193
I0602 23:34:34.401067 31386 slave.cpp:249] Flags at startup: --acls="" --appc_simple_discovery_uri_prefix="http://"
--appc_store_dir="/tmp/Endpoint_SlaveEndpointTest_UnauthorizedRequest_1_GJzn2p/store/appc"
--authenticate_http_readonly="true" --authenticate_http_readwrite="true" --authenticatee="crammd5"
--authentication_backoff_factor="1secs" --authorizer="local" --cgroups_cpu_enable_pids_and_tids_count="false"
--cgroups_enable_cfs="false" --cgroups_hierarchy="/sys/fs/cgroup" --cgroups_limit_swap="false"
--cgroups_root="mesos" --container_disk_watch_interval="15secs" --containerizers="mesos" --credential="/tmp/Endpoint_SlaveEndpointTest_UnauthorizedRequest_1_GJzn2p/credential"
--default_role="*" --disk_watch_interval="1mins" --docker="docker" --docker_kill_orphans="true"
--docker_registry="https://registry-1.docker.io" --docker_remove_delay="6hrs" --docker_socket="/var/run/docker.sock"
--docker_stop_timeout="0ns" --docker_store_dir="/tmp/Endpoint_SlaveEndpointTest_UnauthorizedRequest_1_GJzn2p/store/docker"
--docker_volume_checkpoint_dir="/var/run/mesos/isolators/docker/volume" --enforce_container_disk_quota="false"
--executor_registration_timeout="1mins" --executor_reregistration_timeout="2secs" --executor_shutdown_grace_period="5secs"
--fetcher_cache_dir="/tmp/Endpoint_SlaveEndpointTest_UnauthorizedRequest_1_GJzn2p/fetch" --fetcher_cache_size="2GB"
--frameworks_home="" --gc_delay="1weeks" --gc_disk_headroom="0.1" --hadoop_home="" --help="false"
--hostname_lookup="true" --http_command_executor="false" --http_credentials="/tmp/Endpoint_SlaveEndpointTest_UnauthorizedRequest_1_GJzn2p/http_credentials"
--http_heartbeat_interval="30secs" --initialize_driver_logging="true" --isolation="posix/cpu,posix/mem"
--launcher="posix" --launcher_dir="/mesos/build/src" --logbufsecs="0" --logging_level="INFO"
--max_completed_executors_per_framework="150" --oversubscribed_resources_interval="15secs"
--perf_duration="10secs" --perf_interval="1mins" --port="5051" --qos_correction_interval_min="0ns"
--quiet="false" --recover="reconnect" --recovery_timeout="15mins" --registration_backoff_factor="10ms"
--resources="cpus:2;gpus:0;mem:1024;disk:1024;ports:[31000-32000]" --revocable_cpu_low_priority="true"
--runtime_dir="/tmp/Endpoint_SlaveEndpointTest_UnauthorizedRequest_1_GJzn2p" --sandbox_directory="/mnt/mesos/sandbox"
--strict="true" --switch_user="true" --systemd_enable_support="true" --systemd_runtime_directory="/run/systemd/system"
--version="false" --work_dir="/tmp/Endpoint_SlaveEndpointTest_UnauthorizedRequest_1_6GIGAs"
I0602 23:34:34.401391 31386 credentials.hpp:86] Loading credential for authentication from
'/tmp/Endpoint_SlaveEndpointTest_UnauthorizedRequest_1_GJzn2p/credential'
I0602 23:34:34.401584 31386 slave.cpp:281] Agent using credential for: test-principal
I0602 23:34:34.401674 31386 credentials.hpp:37] Loading credentials for authentication from
'/tmp/Endpoint_SlaveEndpointTest_UnauthorizedRequest_1_GJzn2p/http_credentials'
I0602 23:34:34.401953 31386 http.cpp:975] Creating default 'basic' HTTP authenticator for
realm 'mesos-agent-readonly'
I0602 23:34:34.402127 31386 http.cpp:975] Creating default 'basic' HTTP authenticator for
realm 'mesos-agent-readwrite'
I0602 23:34:34.402767 31386 slave.cpp:552] Agent resources: cpus(*):2; mem(*):1024; disk(*):1024;
ports(*):[31000-32000]
I0602 23:34:34.402948 31386 slave.cpp:560] Agent attributes: [  ]
I0602 23:34:34.403017 31386 slave.cpp:565] Agent hostname: 6e2d2b656e14
I0602 23:34:34.403180 31371 status_update_manager.cpp:177] Pausing sending status updates
I0602 23:34:34.403570 31386 state.cpp:62] Recovering state from '/tmp/Endpoint_SlaveEndpointTest_UnauthorizedRequest_1_6GIGAs/meta'
I0602 23:34:34.403864 31386 status_update_manager.cpp:203] Recovering status update manager
I0602 23:34:34.404094 31363 containerizer.cpp:582] Recovering containerizer
I0602 23:34:34.404820 31385 provisioner.cpp:416] Provisioner recovery complete
I0602 23:34:34.404995 31385 slave.cpp:6119] Finished recovery
I0602 23:34:34.405488 31385 slave.cpp:6301] Querying resource estimator for oversubscribable
resources
I0602 23:34:34.405692 31385 slave.cpp:6315] Received oversubscribable resources {} from the
resource estimator
I0602 23:34:34.406515 31367 process.cpp:3778] Handling HTTP event for process 'slave(750)'
with path: '/slave(750)/monitor/statistics.json'
I0602 23:34:34.406925 31367 http.cpp:1115] HTTP GET for /slave(750)/monitor/statistics.json
from 172.17.0.4:33796
I0602 23:34:34.406970 31367 http.cpp:936] Authorizing principal 'test-principal' to GET the
'/monitor/statistics.json' endpoint
I0602 23:34:34.408013 31373 slave.cpp:817] Agent terminating
[       OK ] Endpoint/SlaveEndpointTest.UnauthorizedRequest/1 (14 ms)
[ RUN      ] Endpoint/SlaveEndpointTest.UnauthorizedRequest/2
I0602 23:34:34.413419 31362 containerizer.cpp:230] Using isolation: posix/cpu,posix/mem,filesystem/posix,network/cni,environment_secret
W0602 23:34:34.413740 31362 backend.cpp:76] Failed to create 'aufs' backend: AufsBackend requires
root privileges
W0602 23:34:34.413789 31362 backend.cpp:76] Failed to create 'bind' backend: BindBackend requires
root privileges
I0602 23:34:34.413805 31362 provisioner.cpp:255] Using default backend 'copy'
I0602 23:34:34.414902 31365 slave.cpp:248] Mesos agent started on (751)@172.17.0.4:41193
I0602 23:34:34.414921 31365 slave.cpp:249] Flags at startup: --acls="" --appc_simple_discovery_uri_prefix="http://"
--appc_store_dir="/tmp/Endpoint_SlaveEndpointTest_UnauthorizedRequest_2_ahnoWf/store/appc"
--authenticate_http_readonly="true" --authenticate_http_readwrite="true" --authenticatee="crammd5"
--authentication_backoff_factor="1secs" --authorizer="local" --cgroups_cpu_enable_pids_and_tids_count="false"
--cgroups_enable_cfs="false" --cgroups_hierarchy="/sys/fs/cgroup" --cgroups_limit_swap="false"
--cgroups_root="mesos" --container_disk_watch_interval="15secs" --containerizers="mesos" --credential="/tmp/Endpoint_SlaveEndpointTest_UnauthorizedRequest_2_ahnoWf/credential"
--default_role="*" --disk_watch_interval="1mins" --docker="docker" --docker_kill_orphans="true"
--docker_registry="https://registry-1.docker.io" --docker_remove_delay="6hrs" --docker_socket="/var/run/docker.sock"
--docker_stop_timeout="0ns" --docker_store_dir="/tmp/Endpoint_SlaveEndpointTest_UnauthorizedRequest_2_ahnoWf/store/docker"
--docker_volume_checkpoint_dir="/var/run/mesos/isolators/docker/volume" --enforce_container_disk_quota="false"
--executor_registration_timeout="1mins" --executor_reregistration_timeout="2secs" --executor_shutdown_grace_period="5secs"
--fetcher_cache_dir="/tmp/Endpoint_SlaveEndpointTest_UnauthorizedRequest_2_ahnoWf/fetch" --fetcher_cache_size="2GB"
--frameworks_home="" --gc_delay="1weeks" --gc_disk_headroom="0.1" --hadoop_home="" --help="false"
--hostname_lookup="true" --http_command_executor="false" --http_credentials="/tmp/Endpoint_SlaveEndpointTest_UnauthorizedRequest_2_ahnoWf/http_credentials"
--http_heartbeat_interval="30secs" --initialize_driver_logging="true" --isolation="posix/cpu,posix/mem"
--launcher="posix" --launcher_dir="/mesos/build/src" --logbufsecs="0" --logging_level="INFO"
--max_completed_executors_per_framework="150" --oversubscribed_resources_interval="15secs"
--perf_duration="10secs" --perf_interval="1mins" --port="5051" --qos_correction_interval_min="0ns"
--quiet="false" --recover="reconnect" --recovery_timeout="15mins" --registration_backoff_factor="10ms"
--resources="cpus:2;gpus:0;mem:1024;disk:1024;ports:[31000-32000]" --revocable_cpu_low_priority="true"
--runtime_dir="/tmp/Endpoint_SlaveEndpointTest_UnauthorizedRequest_2_ahnoWf" --sandbox_directory="/mnt/mesos/sandbox"
--strict="true" --switch_user="true" --systemd_enable_support="true" --systemd_runtime_directory="/run/systemd/system"
--version="false" --work_dir="/tmp/Endpoint_SlaveEndpointTest_UnauthorizedRequest_2_d6OAsi"
I0602 23:34:34.415570 31365 credentials.hpp:86] Loading credential for authentication from
'/tmp/Endpoint_SlaveEndpointTest_UnauthorizedRequest_2_ahnoWf/credential'
I0602 23:34:34.415675 31365 slave.cpp:281] Agent using credential for: test-principal
I0602 23:34:34.415689 31365 credentials.hpp:37] Loading credentials for authentication from
'/tmp/Endpoint_SlaveEndpointTest_UnauthorizedRequest_2_ahnoWf/http_credentials'
I0602 23:34:34.415803 31365 http.cpp:975] Creating default 'basic' HTTP authenticator for
realm 'mesos-agent-readonly'
I0602 23:34:34.415860 31365 http.cpp:975] Creating default 'basic' HTTP authenticator for
realm 'mesos-agent-readwrite'
I0602 23:34:34.416294 31365 slave.cpp:552] Agent resources: cpus(*):2; mem(*):1024; disk(*):1024;
ports(*):[31000-32000]
I0602 23:34:34.416328 31365 slave.cpp:560] Agent attributes: [  ]
I0602 23:34:34.416335 31365 slave.cpp:565] Agent hostname: 6e2d2b656e14
I0602 23:34:34.416476 31367 status_update_manager.cpp:177] Pausing sending status updates
I0602 23:34:34.416859 31382 state.cpp:62] Recovering state from '/tmp/Endpoint_SlaveEndpointTest_UnauthorizedRequest_2_d6OAsi/meta'
I0602 23:34:34.417016 31379 status_update_manager.cpp:203] Recovering status update manager
I0602 23:34:34.417186 31366 containerizer.cpp:582] Recovering containerizer
I0602 23:34:34.417742 31366 provisioner.cpp:416] Provisioner recovery complete
I0602 23:34:34.417881 31366 slave.cpp:6119] Finished recovery
I0602 23:34:34.418287 31366 slave.cpp:6301] Querying resource estimator for oversubscribable
resources
I0602 23:34:34.418453 31366 slave.cpp:6315] Received oversubscribable resources {} from the
resource estimator
I0602 23:34:34.419296 31369 process.cpp:3778] Handling HTTP event for process 'slave(751)'
with path: '/slave(751)/containers'
I0602 23:34:34.419704 31381 http.cpp:1115] HTTP GET for /slave(751)/containers from 172.17.0.4:33798
I0602 23:34:34.419750 31381 http.cpp:936] Authorizing principal 'test-principal' to GET the
'/containers' endpoint
I0602 23:34:34.420580 31380 slave.cpp:817] Agent terminating
[       OK ] Endpoint/SlaveEndpointTest.UnauthorizedRequest/2 (12 ms)
[ RUN      ] Endpoint/SlaveEndpointTest.NoAuthorizer/0
I0602 23:34:34.425683 31362 containerizer.cpp:230] Using isolation: posix/cpu,posix/mem,filesystem/posix,network/cni,environment_secret
W0602 23:34:34.426026 31362 backend.cpp:76] Failed to create 'aufs' backend: AufsBackend requires
root privileges
W0602 23:34:34.426071 31362 backend.cpp:76] Failed to create 'bind' backend: BindBackend requires
root privileges
I0602 23:34:34.426093 31362 provisioner.cpp:255] Using default backend 'copy'
I0602 23:34:34.426740 31362 cluster.cpp:448] Creating default 'local' authorizer
I0602 23:34:34.427361 31383 slave.cpp:248] Mesos agent started on (752)@172.17.0.4:41193
I0602 23:34:34.427381 31383 slave.cpp:249] Flags at startup: --acls="" --appc_simple_discovery_uri_prefix="http://"
--appc_store_dir="/tmp/Endpoint_SlaveEndpointTest_NoAuthorizer_0_7gxKX5/store/appc" --authenticate_http_readonly="true"
--authenticate_http_readwrite="true" --authenticatee="crammd5" --authentication_backoff_factor="1secs"
--authorizer="local" --cgroups_cpu_enable_pids_and_tids_count="false" --cgroups_enable_cfs="false"
--cgroups_hierarchy="/sys/fs/cgroup" --cgroups_limit_swap="false" --cgroups_root="mesos" --container_disk_watch_interval="15secs"
--containerizers="mesos" --credential="/tmp/Endpoint_SlaveEndpointTest_NoAuthorizer_0_7gxKX5/credential"
--default_role="*" --disk_watch_interval="1mins" --docker="docker" --docker_kill_orphans="true"
--docker_registry="https://registry-1.docker.io" --docker_remove_delay="6hrs" --docker_socket="/var/run/docker.sock"
--docker_stop_timeout="0ns" --docker_store_dir="/tmp/Endpoint_SlaveEndpointTest_NoAuthorizer_0_7gxKX5/store/docker"
--docker_volume_checkpoint_dir="/var/run/mesos/isolators/docker/volume" --enforce_container_disk_quota="false"
--executor_registration_timeout="1mins" --executor_reregistration_timeout="2secs" --executor_shutdown_grace_period="5secs"
--fetcher_cache_dir="/tmp/Endpoint_SlaveEndpointTest_NoAuthorizer_0_7gxKX5/fetch" --fetcher_cache_size="2GB"
--frameworks_home="" --gc_delay="1weeks" --gc_disk_headroom="0.1" --hadoop_home="" --help="false"
--hostname_lookup="true" --http_command_executor="false" --http_credentials="/tmp/Endpoint_SlaveEndpointTest_NoAuthorizer_0_7gxKX5/http_credentials"
--http_heartbeat_interval="30secs" --initialize_driver_logging="true" --isolation="posix/cpu,posix/mem"
--launcher="posix" --launcher_dir="/mesos/build/src" --logbufsecs="0" --logging_level="INFO"
--max_completed_executors_per_framework="150" --oversubscribed_resources_interval="15secs"
--perf_duration="10secs" --perf_interval="1mins" --port="5051" --qos_correction_interval_min="0ns"
--quiet="false" --recover="reconnect" --recovery_timeout="15mins" --registration_backoff_factor="10ms"
--resources="cpus:2;gpus:0;mem:1024;disk:1024;ports:[31000-32000]" --revocable_cpu_low_priority="true"
--runtime_dir="/tmp/Endpoint_SlaveEndpointTest_NoAuthorizer_0_7gxKX5" --sandbox_directory="/mnt/mesos/sandbox"
--strict="true" --switch_user="true" --systemd_enable_support="true" --systemd_runtime_directory="/run/systemd/system"
--version="false" --work_dir="/tmp/Endpoint_SlaveEndpointTest_NoAuthorizer_0_rcY8r8"
I0602 23:34:34.427647 31383 credentials.hpp:86] Loading credential for authentication from
'/tmp/Endpoint_SlaveEndpointTest_NoAuthorizer_0_7gxKX5/credential'
I0602 23:34:34.427762 31383 slave.cpp:281] Agent using credential for: test-principal
I0602 23:34:34.427775 31383 credentials.hpp:37] Loading credentials for authentication from
'/tmp/Endpoint_SlaveEndpointTest_NoAuthorizer_0_7gxKX5/http_credentials'
I0602 23:34:34.427911 31383 http.cpp:975] Creating default 'basic' HTTP authenticator for
realm 'mesos-agent-readonly'
I0602 23:34:34.427980 31383 http.cpp:975] Creating default 'basic' HTTP authenticator for
realm 'mesos-agent-readwrite'
I0602 23:34:34.428472 31383 slave.cpp:552] Agent resources: cpus(*):2; mem(*):1024; disk(*):1024;
ports(*):[31000-32000]
I0602 23:34:34.428499 31383 slave.cpp:560] Agent attributes: [  ]
I0602 23:34:34.428503 31383 slave.cpp:565] Agent hostname: 6e2d2b656e14
I0602 23:34:34.428567 31374 status_update_manager.cpp:177] Pausing sending status updates
I0602 23:34:34.429226 31383 state.cpp:62] Recovering state from '/tmp/Endpoint_SlaveEndpointTest_NoAuthorizer_0_rcY8r8/meta'
I0602 23:34:34.429611 31380 status_update_manager.cpp:203] Recovering status update manager
I0602 23:34:34.429713 31371 containerizer.cpp:582] Recovering containerizer
I0602 23:34:34.430266 31385 provisioner.cpp:416] Provisioner recovery complete
I0602 23:34:34.430414 31385 slave.cpp:6119] Finished recovery
I0602 23:34:34.430799 31385 slave.cpp:6301] Querying resource estimator for oversubscribable
resources
I0602 23:34:34.430977 31385 slave.cpp:6315] Received oversubscribable resources {} from the
resource estimator
I0602 23:34:34.431769 31371 process.cpp:3778] Handling HTTP event for process 'slave(752)'
with path: '/slave(752)/monitor/statistics'
I0602 23:34:34.432185 31382 http.cpp:1115] HTTP GET for /slave(752)/monitor/statistics from
172.17.0.4:33800
I0602 23:34:34.432234 31382 http.cpp:936] Authorizing principal 'test-principal' to GET the
'/monitor/statistics' endpoint
I0602 23:34:34.433497 31371 slave.cpp:817] Agent terminating
[       OK ] Endpoint/SlaveEndpointTest.NoAuthorizer/0 (23 ms)
[ RUN      ] Endpoint/SlaveEndpointTest.NoAuthorizer/1
I0602 23:34:34.449005 31362 containerizer.cpp:230] Using isolation: posix/cpu,posix/mem,filesystem/posix,network/cni,environment_secret
W0602 23:34:34.449338 31362 backend.cpp:76] Failed to create 'aufs' backend: AufsBackend requires
root privileges
W0602 23:34:34.449383 31362 backend.cpp:76] Failed to create 'bind' backend: BindBackend requires
root privileges
I0602 23:34:34.449404 31362 provisioner.cpp:255] Using default backend 'copy'
I0602 23:34:34.450037 31362 cluster.cpp:448] Creating default 'local' authorizer
I0602 23:34:34.450539 31372 slave.cpp:248] Mesos agent started on (753)@172.17.0.4:41193
I0602 23:34:34.450557 31372 slave.cpp:249] Flags at startup: --acls="" --appc_simple_discovery_uri_prefix="http://"
--appc_store_dir="/tmp/Endpoint_SlaveEndpointTest_NoAuthorizer_1_fStsbW/store/appc" --authenticate_http_readonly="true"
--authenticate_http_readwrite="true" --authenticatee="crammd5" --authentication_backoff_factor="1secs"
--authorizer="local" --cgroups_cpu_enable_pids_and_tids_count="false" --cgroups_enable_cfs="false"
--cgroups_hierarchy="/sys/fs/cgroup" --cgroups_limit_swap="false" --cgroups_root="mesos" --container_disk_watch_interval="15secs"
--containerizers="mesos" --credential="/tmp/Endpoint_SlaveEndpointTest_NoAuthorizer_1_fStsbW/credential"
--default_role="*" --disk_watch_interval="1mins" --docker="docker" --docker_kill_orphans="true"
--docker_registry="https://registry-1.docker.io" --docker_remove_delay="6hrs" --docker_socket="/var/run/docker.sock"
--docker_stop_timeout="0ns" --docker_store_dir="/tmp/Endpoint_SlaveEndpointTest_NoAuthorizer_1_fStsbW/store/docker"
--docker_volume_checkpoint_dir="/var/run/mesos/isolators/docker/volume" --enforce_container_disk_quota="false"
--executor_registration_timeout="1mins" --executor_reregistration_timeout="2secs" --executor_shutdown_grace_period="5secs"
--fetcher_cache_dir="/tmp/Endpoint_SlaveEndpointTest_NoAuthorizer_1_fStsbW/fetch" --fetcher_cache_size="2GB"
--frameworks_home="" --gc_delay="1weeks" --gc_disk_headroom="0.1" --hadoop_home="" --help="false"
--hostname_lookup="true" --http_command_executor="false" --http_credentials="/tmp/Endpoint_SlaveEndpointTest_NoAuthorizer_1_fStsbW/http_credentials"
--http_heartbeat_interval="30secs" --initialize_driver_logging="true" --isolation="posix/cpu,posix/mem"
--launcher="posix" --launcher_dir="/mesos/build/src" --logbufsecs="0" --logging_level="INFO"
--max_completed_executors_per_framework="150" --oversubscribed_resources_interval="15secs"
--perf_duration="10secs" --perf_interval="1mins" --port="5051" --qos_correction_interval_min="0ns"
--quiet="false" --recover="reconnect" --recovery_timeout="15mins" --registration_backoff_factor="10ms"
--resources="cpus:2;gpus:0;mem:1024;disk:1024;ports:[31000-32000]" --revocable_cpu_low_priority="true"
--runtime_dir="/tmp/Endpoint_SlaveEndpointTest_NoAuthorizer_1_fStsbW" --sandbox_directory="/mnt/mesos/sandbox"
--strict="true" --switch_user="true" --systemd_enable_support="true" --systemd_runtime_directory="/run/systemd/system"
--version="false" --work_dir="/tmp/Endpoint_SlaveEndpointTest_NoAuthorizer_1_uu9lCY"
I0602 23:34:34.450786 31372 credentials.hpp:86] Loading credential for authentication from
'/tmp/Endpoint_SlaveEndpointTest_NoAuthorizer_1_fStsbW/credential'
I0602 23:34:34.450893 31372 slave.cpp:281] Agent using credential for: test-principal
I0602 23:34:34.450907 31372 credentials.hpp:37] Loading credentials for authentication from
'/tmp/Endpoint_SlaveEndpointTest_NoAuthorizer_1_fStsbW/http_credentials'
I0602 23:34:34.451020 31372 http.cpp:975] Creating default 'basic' HTTP authenticator for
realm 'mesos-agent-readonly'
I0602 23:34:34.451103 31372 http.cpp:975] Creating default 'basic' HTTP authenticator for
realm 'mesos-agent-readwrite'
I0602 23:34:34.451534 31372 slave.cpp:552] Agent resources: cpus(*):2; mem(*):1024; disk(*):1024;
ports(*):[31000-32000]
I0602 23:34:34.451565 31372 slave.cpp:560] Agent attributes: [  ]
I0602 23:34:34.451570 31372 slave.cpp:565] Agent hostname: 6e2d2b656e14
I0602 23:34:34.451658 31365 status_update_manager.cpp:177] Pausing sending status updates
I0602 23:34:34.452021 31364 state.cpp:62] Recovering state from '/tmp/Endpoint_SlaveEndpointTest_NoAuthorizer_1_uu9lCY/meta'
I0602 23:34:34.452205 31364 status_update_manager.cpp:203] Recovering status update manager
I0602 23:34:34.452265 31364 containerizer.cpp:582] Recovering containerizer
I0602 23:34:34.452710 31364 provisioner.cpp:416] Provisioner recovery complete
I0602 23:34:34.452843 31364 slave.cpp:6119] Finished recovery
I0602 23:34:34.453277 31364 slave.cpp:6301] Querying resource estimator for oversubscribable
resources
I0602 23:34:34.453423 31363 slave.cpp:6315] Received oversubscribable resources {} from the
resource estimator
I0602 23:34:34.454313 31369 process.cpp:3778] Handling HTTP event for process 'slave(753)'
with path: '/slave(753)/monitor/statistics.json'
I0602 23:34:34.454814 31373 http.cpp:1115] HTTP GET for /slave(753)/monitor/statistics.json
from 172.17.0.4:33804
I0602 23:34:34.454860 31373 http.cpp:936] Authorizing principal 'test-principal' to GET the
'/monitor/statistics.json' endpoint
I0602 23:34:34.456166 31375 slave.cpp:817] Agent terminating
[       OK ] Endpoint/SlaveEndpointTest.NoAuthorizer/1 (12 ms)
[ RUN      ] Endpoint/SlaveEndpointTest.NoAuthorizer/2
I0602 23:34:34.461024 31362 containerizer.cpp:230] Using isolation: posix/cpu,posix/mem,filesystem/posix,network/cni,environment_secret
W0602 23:34:34.461338 31362 backend.cpp:76] Failed to create 'aufs' backend: AufsBackend requires
root privileges
W0602 23:34:34.461372 31362 backend.cpp:76] Failed to create 'bind' backend: BindBackend requires
root privileges
I0602 23:34:34.461390 31362 provisioner.cpp:255] Using default backend 'copy'
I0602 23:34:34.461998 31362 cluster.cpp:448] Creating default 'local' authorizer
I0602 23:34:34.462471 31370 slave.cpp:248] Mesos agent started on (754)@172.17.0.4:41193
I0602 23:34:34.462489 31370 slave.cpp:249] Flags at startup: --acls="" --appc_simple_discovery_uri_prefix="http://"
--appc_store_dir="/tmp/Endpoint_SlaveEndpointTest_NoAuthorizer_2_6BTSxM/store/appc" --authenticate_http_readonly="true"
--authenticate_http_readwrite="true" --authenticatee="crammd5" --authentication_backoff_factor="1secs"
--authorizer="local" --cgroups_cpu_enable_pids_and_tids_count="false" --cgroups_enable_cfs="false"
--cgroups_hierarchy="/sys/fs/cgroup" --cgroups_limit_swap="false" --cgroups_root="mesos" --container_disk_watch_interval="15secs"
--containerizers="mesos" --credential="/tmp/Endpoint_SlaveEndpointTest_NoAuthorizer_2_6BTSxM/credential"
--default_role="*" --disk_watch_interval="1mins" --docker="docker" --docker_kill_orphans="true"
--docker_registry="https://registry-1.docker.io" --docker_remove_delay="6hrs" --docker_socket="/var/run/docker.sock"
--docker_stop_timeout="0ns" --docker_store_dir="/tmp/Endpoint_SlaveEndpointTest_NoAuthorizer_2_6BTSxM/store/docker"
--docker_volume_checkpoint_dir="/var/run/mesos/isolators/docker/volume" --enforce_container_disk_quota="false"
--executor_registration_timeout="1mins" --executor_reregistration_timeout="2secs" --executor_shutdown_grace_period="5secs"
--fetcher_cache_dir="/tmp/Endpoint_SlaveEndpointTest_NoAuthorizer_2_6BTSxM/fetch" --fetcher_cache_size="2GB"
--frameworks_home="" --gc_delay="1weeks" --gc_disk_headroom="0.1" --hadoop_home="" --help="false"
--hostname_lookup="true" --http_command_executor="false" --http_credentials="/tmp/Endpoint_SlaveEndpointTest_NoAuthorizer_2_6BTSxM/http_credentials"
--http_heartbeat_interval="30secs" --initialize_driver_logging="true" --isolation="posix/cpu,posix/mem"
--launcher="posix" --launcher_dir="/mesos/build/src" --logbufsecs="0" --logging_level="INFO"
--max_completed_executors_per_framework="150" --oversubscribed_resources_interval="15secs"
--perf_duration="10secs" --perf_interval="1mins" --port="5051" --qos_correction_interval_min="0ns"
--quiet="false" --recover="reconnect" --recovery_timeout="15mins" --registration_backoff_factor="10ms"
--resources="cpus:2;gpus:0;mem:1024;disk:1024;ports:[31000-32000]" --revocable_cpu_low_priority="true"
--runtime_dir="/tmp/Endpoint_SlaveEndpointTest_NoAuthorizer_2_6BTSxM" --sandbox_directory="/mnt/mesos/sandbox"
--strict="true" --switch_user="true" --systemd_enable_support="true" --systemd_runtime_directory="/run/systemd/system"
--version="false" --work_dir="/tmp/Endpoint_SlaveEndpointTest_NoAuthorizer_2_xABZWO"
I0602 23:34:34.462759 31370 credentials.hpp:86] Loading credential for authentication from
'/tmp/Endpoint_SlaveEndpointTest_NoAuthorizer_2_6BTSxM/credential'
I0602 23:34:34.462867 31370 slave.cpp:281] Agent using credential for: test-principal
I0602 23:34:34.462879 31370 credentials.hpp:37] Loading credentials for authentication from
'/tmp/Endpoint_SlaveEndpointTest_NoAuthorizer_2_6BTSxM/http_credentials'
I0602 23:34:34.462982 31370 http.cpp:975] Creating default 'basic' HTTP authenticator for
realm 'mesos-agent-readonly'
I0602 23:34:34.463029 31370 http.cpp:975] Creating default 'basic' HTTP authenticator for
realm 'mesos-agent-readwrite'
I0602 23:34:34.463433 31370 slave.cpp:552] Agent resources: cpus(*):2; mem(*):1024; disk(*):1024;
ports(*):[31000-32000]
I0602 23:34:34.463464 31370 slave.cpp:560] Agent attributes: [  ]
I0602 23:34:34.463469 31370 slave.cpp:565] Agent hostname: 6e2d2b656e14
I0602 23:34:34.463558 31366 status_update_manager.cpp:177] Pausing sending status updates
I0602 23:34:34.463971 31383 state.cpp:62] Recovering state from '/tmp/Endpoint_SlaveEndpointTest_NoAuthorizer_2_xABZWO/meta'
I0602 23:34:34.464110 31374 status_update_manager.cpp:203] Recovering status update manager
I0602 23:34:34.464216 31381 containerizer.cpp:582] Recovering containerizer
I0602 23:34:34.464725 31381 provisioner.cpp:416] Provisioner recovery complete
I0602 23:34:34.464879 31381 slave.cpp:6119] Finished recovery
I0602 23:34:34.465303 31381 slave.cpp:6301] Querying resource estimator for oversubscribable
resources
I0602 23:34:34.465390 31386 slave.cpp:6315] Received oversubscribable resources {} from the
resource estimator
I0602 23:34:34.466192 31379 process.cpp:3778] Handling HTTP event for process 'slave(754)'
with path: '/slave(754)/containers'
I0602 23:34:34.466645 31381 http.cpp:1115] HTTP GET for /slave(754)/containers from 172.17.0.4:33806
I0602 23:34:34.466725 31381 http.cpp:936] Authorizing principal 'test-principal' to GET the
'/containers' endpoint
I0602 23:34:34.468093 31374 slave.cpp:817] Agent terminating
[       OK ] Endpoint/SlaveEndpointTest.NoAuthorizer/2 (12 ms)
[----------] 9 tests from Endpoint/SlaveEndpointTest (138 ms total)

[----------] Global test environment tear-down
[==========] 1533 tests from 168 test cases ran. (242960 ms total)
[  PASSED  ] 1532 tests.
[  FAILED  ] 1 test, listed below:
[  FAILED  ] OversubscriptionTest.RescindRevocableOfferWithIncreasedRevocable

 1 FAILED TEST
  YOU HAVE 22 DISABLED TESTS

E0602 23:34:34.515668 31387 process.cpp:968] Failed to accept socket: future discarded
make[3]: *** [CMakeFiles/check] Error 1
make[3]: Leaving directory `/mesos/build'
make[2]: *** [CMakeFiles/check.dir/all] Error 2
make[2]: Leaving directory `/mesos/build'
make[1]: *** [CMakeFiles/check.dir/rule] Error 2
make[1]: Leaving directory `/mesos/build'
make: *** [check] Error 2
+ docker rmi mesos-1496442769-22954
Untagged: mesos-1496442769-22954:latest
Deleted: sha256:9ecb94cca065bf9c505d4a020e2d992de2845b76eb1319dae85df30164e6e2b0
Deleted: sha256:9cb9bc7af89f38a12206eab1c63f51460ceaf2c6a8621c550137d6b4f254b682
Deleted: sha256:22a0d0d9106e89fc18ecb0ea8043dded3c16a4777317956dc05c651010716fe2
Deleted: sha256:cb5c853805ca5420a29312a1a4adc3f827f133b6019f5cc49a3bb31e4fc702a0
Deleted: sha256:66dd74c818786517b7598cda4617aaf9f29e89702db5d966652d944748304119
Deleted: sha256:28e9762350bb7c13a2bdc352f82996f489e919ed05cf84a785c5ad7eebcb7e22
Deleted: sha256:c8c792379fbb0ab188f0cf11e01ec738ca41319f09b6effe5a9f0b85e8eef397
Deleted: sha256:994226ae452970d87cb3856d1ee95360bea1a914d09241cbd1ec484d7bdc8a8b
Deleted: sha256:bdd8d334c06faa36e3774a649d27bf1fcb408f62cd66720b9be50b7a97a2228d
Deleted: sha256:20904b964f01f1f5b5aeb1faf1474c15c4cf4341e4fe892caf92297a33ced460
Deleted: sha256:a1cacd0850153955ab16942f36fe0c78cdf943d2b9e37727b9328166da2ef256
Deleted: sha256:545004b7bd4a1ccddcd9fc7b3cfb223bc852de7a0bdd93841be879597eed4ad0
Deleted: sha256:24804563a8d7d5fb5b05147641d01b5bdda3ef6c59bd68b2629b9960f3e8df37
Deleted: sha256:d495a30d0bfc33d810870f863a794c21c87fa7d5b709aad5060daa4ca52a074e
Deleted: sha256:d2da06ed8c75c86556424afe5abc999a3069d609088e7edbd71597836ea9f557
Deleted: sha256:e1a0c5929559dcd2c945fcb80f835a96fea1a20258f7c3dd68b7ef88b09920c2
Deleted: sha256:29dbf849ebbff71fce01acbce232a16b589c93d61226b8df61e277fb74135b8c
Deleted: sha256:33c85af5e989617ad8bcaef16672cf53c70ad15eda9c46f7d25f7cd7704e93b3
Deleted: sha256:f4f810e9fa53e226d9ba090cda8b03eaabf1c89b83c6b60a2298b3fbcfbf0af3
Deleted: sha256:b6412e84d61a812215021205d377db6e7084910acc84b8ba27154d2e2de8fdac
Deleted: sha256:219c03efc61b4d83ec815d2f1f62441e0537a567323bbdb12369483ff21100c7
Deleted: sha256:57aaabb5996faf3dfbfe297491ded0626af72bf29492fc2268b9723e3e6c6c1e
Deleted: sha256:4c34f8e9819b6710464c60205ac04ce9571354708f876a6b202745695d87ee90
Deleted: sha256:932778cba1ae9f1d099b53ecb81912c6885e81f4ac8cc4efb34a94f81449c01b
Deleted: sha256:74b760f5c5c290a4d8523249fee8bdd0d5cd35ee76a2e82a7e1dc90cba4daa77
Build step 'Execute shell' marked build as failure
Not sending mail to unregistered user neil.conway@gmail.com

Mime
View raw message