mesos-builds mailing list archives

Site index · List index
Message view « Date » · « Thread »
Top « Date » · « Thread »
From Apache Jenkins Server <jenk...@builds.apache.org>
Subject Build failed in Jenkins: Mesos-Buildbot » autotools,gcc,--verbose,GLOG_v=1 MESOS_VERBOSE=1,centos:7,(ubuntu)&&(!ubuntu-us1)&&(!ubuntu-eu2) #3793
Date Wed, 14 Jun 2017 01:52:25 GMT
See <https://builds.apache.org/job/Mesos-Buildbot/BUILDTOOL=autotools,COMPILER=gcc,CONFIGURATION=--verbose,ENVIRONMENT=GLOG_v=1%20MESOS_VERBOSE=1,OS=centos%3A7,label_exp=(ubuntu)&&(!ubuntu-us1)&&(!ubuntu-eu2)/3793/display/redirect?page=changes>

Changes:

[mcypark] Introduced method `Resources::allocatableTo` to aggregate reservations.

[mcypark] Enabled allocator to handle hierarchical reservation.

[mcypark] Added a test for hierarchical reservation.

[mcypark] Updated a test subtly dependent on implementation-defined behavior.

[mpark] Added `HIERARCHICAL_ROLE` agent capability.

------------------------------------------
[...truncated 28.20 MB...]
I0614 01:52:18.896236  5922 slave.cpp:248] Mesos agent started on (758)@172.17.0.2:33029
I0614 01:52:18.896260  5922 slave.cpp:249] Flags at startup: --acls="" --appc_simple_discovery_uri_prefix="http://"
--appc_store_dir="/tmp/Endpoint_SlaveEndpointTest_AuthorizedRequest_2_PCHRSo/store/appc" --authenticate_http_readonly="true"
--authenticate_http_readwrite="true" --authenticatee="crammd5" --authentication_backoff_factor="1secs"
--authorizer="local" --cgroups_cpu_enable_pids_and_tids_count="false" --cgroups_enable_cfs="false"
--cgroups_hierarchy="/sys/fs/cgroup" --cgroups_limit_swap="false" --cgroups_root="mesos" --container_disk_watch_interval="15secs"
--containerizers="mesos" --credential="/tmp/Endpoint_SlaveEndpointTest_AuthorizedRequest_2_PCHRSo/credential"
--default_role="*" --disk_watch_interval="1mins" --docker="docker" --docker_kill_orphans="true"
--docker_registry="https://registry-1.docker.io" --docker_remove_delay="6hrs" --docker_socket="/var/run/docker.sock"
--docker_stop_timeout="0ns" --docker_store_dir="/tmp/Endpoint_SlaveEndpointTest_AuthorizedRequest_2_PCHRSo/store/docker"
--docker_volume_checkpoint_dir="/var/run/mesos/isolators/docker/volume" --enforce_container_disk_quota="false"
--executor_registration_timeout="1mins" --executor_reregistration_timeout="2secs" --executor_shutdown_grace_period="5secs"
--fetcher_cache_dir="/tmp/Endpoint_SlaveEndpointTest_AuthorizedRequest_2_PCHRSo/fetch" --fetcher_cache_size="2GB"
--frameworks_home="" --gc_delay="1weeks" --gc_disk_headroom="0.1" --hadoop_home="" --help="false"
--hostname_lookup="true" --http_command_executor="false" --http_credentials="/tmp/Endpoint_SlaveEndpointTest_AuthorizedRequest_2_PCHRSo/http_credentials"
--http_heartbeat_interval="30secs" --initialize_driver_logging="true" --isolation="posix/cpu,posix/mem"
--launcher="posix" --launcher_dir="/mesos/mesos-1.4.0/_build/src" --logbufsecs="0" --logging_level="INFO"
--max_completed_executors_per_framework="150" --oversubscribed_resources_interval="15secs"
--perf_duration="10secs" --perf_interval="1mins" --port="5051" --qos_correction_interval_min="0ns"
--quiet="false" --recover="reconnect" --recovery_timeout="15mins" --registration_backoff_factor="10ms"
--resources="cpus:2;gpus:0;mem:1024;disk:1024;ports:[31000-32000]" --revocable_cpu_low_priority="true"
--runtime_dir="/tmp/Endpoint_SlaveEndpointTest_AuthorizedRequest_2_PCHRSo" --sandbox_directory="/mnt/mesos/sandbox"
--strict="true" --switch_user="true" --systemd_enable_support="true" --systemd_runtime_directory="/run/systemd/system"
--version="false" --work_dir="/tmp/Endpoint_SlaveEndpointTest_AuthorizedRequest_2_O5nDYO"
I0614 01:52:18.896692  5922 credentials.hpp:86] Loading credential for authentication from
'/tmp/Endpoint_SlaveEndpointTest_AuthorizedRequest_2_PCHRSo/credential'
I0614 01:52:18.896870  5922 slave.cpp:281] Agent using credential for: test-principal
I0614 01:52:18.896891  5922 credentials.hpp:37] Loading credentials for authentication from
'/tmp/Endpoint_SlaveEndpointTest_AuthorizedRequest_2_PCHRSo/http_credentials'
I0614 01:52:18.897244  5922 http.cpp:975] Creating default 'basic' HTTP authenticator for
realm 'mesos-agent-readonly'
I0614 01:52:18.897455  5922 http.cpp:975] Creating default 'basic' HTTP authenticator for
realm 'mesos-agent-readwrite'
I0614 01:52:18.899065  5922 slave.cpp:552] Agent resources: cpus(*):2; mem(*):1024; disk(*):1024;
ports(*):[31000-32000]
I0614 01:52:18.899140  5922 slave.cpp:560] Agent attributes: [  ]
I0614 01:52:18.899153  5922 slave.cpp:565] Agent hostname: f70bf3cde0bc
I0614 01:52:18.899291  5943 status_update_manager.cpp:177] Pausing sending status updates
I0614 01:52:18.900769  5943 state.cpp:62] Recovering state from '/tmp/Endpoint_SlaveEndpointTest_AuthorizedRequest_2_O5nDYO/meta'
I0614 01:52:18.901051  5936 status_update_manager.cpp:203] Recovering status update manager
I0614 01:52:18.901262  5931 containerizer.cpp:582] Recovering containerizer
I0614 01:52:18.902717  5922 provisioner.cpp:416] Provisioner recovery complete
I0614 01:52:18.903312  5921 slave.cpp:6127] Finished recovery
I0614 01:52:18.903805  5921 slave.cpp:6309] Querying resource estimator for oversubscribable
resources
I0614 01:52:18.904216  5924 slave.cpp:6323] Received oversubscribable resources {} from the
resource estimator
I0614 01:52:18.906818  5928 process.cpp:3778] Handling HTTP event for process 'slave(758)'
with path: '/slave(758)/containers'
I0614 01:52:18.908304  5921 http.cpp:1115] HTTP GET for /slave(758)/containers from 172.17.0.2:34914
I0614 01:52:18.908375  5921 http.cpp:936] Authorizing principal 'test-principal' to GET the
'/containers' endpoint
I0614 01:52:18.912834  5930 slave.cpp:817] Agent terminating
[       OK ] Endpoint/SlaveEndpointTest.AuthorizedRequest/2 (34 ms)
[ RUN      ] Endpoint/SlaveEndpointTest.UnauthorizedRequest/0
I0614 01:52:18.924479  5901 containerizer.cpp:230] Using isolation: posix/cpu,posix/mem,filesystem/posix,network/cni,environment_secret
W0614 01:52:18.924980  5901 backend.cpp:76] Failed to create 'aufs' backend: AufsBackend requires
root privileges
W0614 01:52:18.925077  5901 backend.cpp:76] Failed to create 'bind' backend: BindBackend requires
root privileges
I0614 01:52:18.925109  5901 provisioner.cpp:255] Using default backend 'copy'
I0614 01:52:18.928800  5925 slave.cpp:248] Mesos agent started on (759)@172.17.0.2:33029
I0614 01:52:18.928833  5925 slave.cpp:249] Flags at startup: --acls="" --appc_simple_discovery_uri_prefix="http://"
--appc_store_dir="/tmp/Endpoint_SlaveEndpointTest_UnauthorizedRequest_0_fafVMI/store/appc"
--authenticate_http_readonly="true" --authenticate_http_readwrite="true" --authenticatee="crammd5"
--authentication_backoff_factor="1secs" --authorizer="local" --cgroups_cpu_enable_pids_and_tids_count="false"
--cgroups_enable_cfs="false" --cgroups_hierarchy="/sys/fs/cgroup" --cgroups_limit_swap="false"
--cgroups_root="mesos" --container_disk_watch_interval="15secs" --containerizers="mesos" --credential="/tmp/Endpoint_SlaveEndpointTest_UnauthorizedRequest_0_fafVMI/credential"
--default_role="*" --disk_watch_interval="1mins" --docker="docker" --docker_kill_orphans="true"
--docker_registry="https://registry-1.docker.io" --docker_remove_delay="6hrs" --docker_socket="/var/run/docker.sock"
--docker_stop_timeout="0ns" --docker_store_dir="/tmp/Endpoint_SlaveEndpointTest_UnauthorizedRequest_0_fafVMI/store/docker"
--docker_volume_checkpoint_dir="/var/run/mesos/isolators/docker/volume" --enforce_container_disk_quota="false"
--executor_registration_timeout="1mins" --executor_reregistration_timeout="2secs" --executor_shutdown_grace_period="5secs"
--fetcher_cache_dir="/tmp/Endpoint_SlaveEndpointTest_UnauthorizedRequest_0_fafVMI/fetch" --fetcher_cache_size="2GB"
--frameworks_home="" --gc_delay="1weeks" --gc_disk_headroom="0.1" --hadoop_home="" --help="false"
--hostname_lookup="true" --http_command_executor="false" --http_credentials="/tmp/Endpoint_SlaveEndpointTest_UnauthorizedRequest_0_fafVMI/http_credentials"
--http_heartbeat_interval="30secs" --initialize_driver_logging="true" --isolation="posix/cpu,posix/mem"
--launcher="posix" --launcher_dir="/mesos/mesos-1.4.0/_build/src" --logbufsecs="0" --logging_level="INFO"
--max_completed_executors_per_framework="150" --oversubscribed_resources_interval="15secs"
--perf_duration="10secs" --perf_interval="1mins" --port="5051" --qos_correction_interval_min="0ns"
--quiet="false" --recover="reconnect" --recovery_timeout="15mins" --registration_backoff_factor="10ms"
--resources="cpus:2;gpus:0;mem:1024;disk:1024;ports:[31000-32000]" --revocable_cpu_low_priority="true"
--runtime_dir="/tmp/Endpoint_SlaveEndpointTest_UnauthorizedRequest_0_fafVMI" --sandbox_directory="/mnt/mesos/sandbox"
--strict="true" --switch_user="true" --systemd_enable_support="true" --systemd_runtime_directory="/run/systemd/system"
--version="false" --work_dir="/tmp/Endpoint_SlaveEndpointTest_UnauthorizedRequest_0_ORpEN8"
I0614 01:52:18.929303  5925 credentials.hpp:86] Loading credential for authentication from
'/tmp/Endpoint_SlaveEndpointTest_UnauthorizedRequest_0_fafVMI/credential'
I0614 01:52:18.929504  5925 slave.cpp:281] Agent using credential for: test-principal
I0614 01:52:18.929525  5925 credentials.hpp:37] Loading credentials for authentication from
'/tmp/Endpoint_SlaveEndpointTest_UnauthorizedRequest_0_fafVMI/http_credentials'
I0614 01:52:18.929810  5925 http.cpp:975] Creating default 'basic' HTTP authenticator for
realm 'mesos-agent-readonly'
I0614 01:52:18.930043  5925 http.cpp:975] Creating default 'basic' HTTP authenticator for
realm 'mesos-agent-readwrite'
I0614 01:52:18.931814  5925 slave.cpp:552] Agent resources: cpus(*):2; mem(*):1024; disk(*):1024;
ports(*):[31000-32000]
I0614 01:52:18.931893  5925 slave.cpp:560] Agent attributes: [  ]
I0614 01:52:18.931905  5925 slave.cpp:565] Agent hostname: f70bf3cde0bc
I0614 01:52:18.932055  5931 status_update_manager.cpp:177] Pausing sending status updates
I0614 01:52:18.933392  5920 state.cpp:62] Recovering state from '/tmp/Endpoint_SlaveEndpointTest_UnauthorizedRequest_0_ORpEN8/meta'
I0614 01:52:18.933728  5922 status_update_manager.cpp:203] Recovering status update manager
I0614 01:52:18.934177  5925 containerizer.cpp:582] Recovering containerizer
I0614 01:52:18.935920  5932 provisioner.cpp:416] Provisioner recovery complete
I0614 01:52:18.936360  5923 slave.cpp:6127] Finished recovery
I0614 01:52:18.936867  5923 slave.cpp:6309] Querying resource estimator for oversubscribable
resources
I0614 01:52:18.937290  5924 slave.cpp:6323] Received oversubscribable resources {} from the
resource estimator
I0614 01:52:18.940330  5927 process.cpp:3778] Handling HTTP event for process 'slave(759)'
with path: '/slave(759)/monitor/statistics'
I0614 01:52:18.942148  5934 http.cpp:1115] HTTP GET for /slave(759)/monitor/statistics from
172.17.0.2:34916
I0614 01:52:18.942241  5934 http.cpp:936] Authorizing principal 'test-principal' to GET the
'/monitor/statistics' endpoint
I0614 01:52:18.946209  5929 slave.cpp:817] Agent terminating
[       OK ] Endpoint/SlaveEndpointTest.UnauthorizedRequest/0 (33 ms)
[ RUN      ] Endpoint/SlaveEndpointTest.UnauthorizedRequest/1
I0614 01:52:18.960912  5901 containerizer.cpp:230] Using isolation: posix/cpu,posix/mem,filesystem/posix,network/cni,environment_secret
W0614 01:52:18.961827  5901 backend.cpp:76] Failed to create 'aufs' backend: AufsBackend requires
root privileges
W0614 01:52:18.961979  5901 backend.cpp:76] Failed to create 'bind' backend: BindBackend requires
root privileges
I0614 01:52:18.962024  5901 provisioner.cpp:255] Using default backend 'copy'
I0614 01:52:18.966473  5931 slave.cpp:248] Mesos agent started on (760)@172.17.0.2:33029
I0614 01:52:18.966500  5931 slave.cpp:249] Flags at startup: --acls="" --appc_simple_discovery_uri_prefix="http://"
--appc_store_dir="/tmp/Endpoint_SlaveEndpointTest_UnauthorizedRequest_1_Pkrh12/store/appc"
--authenticate_http_readonly="true" --authenticate_http_readwrite="true" --authenticatee="crammd5"
--authentication_backoff_factor="1secs" --authorizer="local" --cgroups_cpu_enable_pids_and_tids_count="false"
--cgroups_enable_cfs="false" --cgroups_hierarchy="/sys/fs/cgroup" --cgroups_limit_swap="false"
--cgroups_root="mesos" --container_disk_watch_interval="15secs" --containerizers="mesos" --credential="/tmp/Endpoint_SlaveEndpointTest_UnauthorizedRequest_1_Pkrh12/credential"
--default_role="*" --disk_watch_interval="1mins" --docker="docker" --docker_kill_orphans="true"
--docker_registry="https://registry-1.docker.io" --docker_remove_delay="6hrs" --docker_socket="/var/run/docker.sock"
--docker_stop_timeout="0ns" --docker_store_dir="/tmp/Endpoint_SlaveEndpointTest_UnauthorizedRequest_1_Pkrh12/store/docker"
--docker_volume_checkpoint_dir="/var/run/mesos/isolators/docker/volume" --enforce_container_disk_quota="false"
--executor_registration_timeout="1mins" --executor_reregistration_timeout="2secs" --executor_shutdown_grace_period="5secs"
--fetcher_cache_dir="/tmp/Endpoint_SlaveEndpointTest_UnauthorizedRequest_1_Pkrh12/fetch" --fetcher_cache_size="2GB"
--frameworks_home="" --gc_delay="1weeks" --gc_disk_headroom="0.1" --hadoop_home="" --help="false"
--hostname_lookup="true" --http_command_executor="false" --http_credentials="/tmp/Endpoint_SlaveEndpointTest_UnauthorizedRequest_1_Pkrh12/http_credentials"
--http_heartbeat_interval="30secs" --initialize_driver_logging="true" --isolation="posix/cpu,posix/mem"
--launcher="posix" --launcher_dir="/mesos/mesos-1.4.0/_build/src" --logbufsecs="0" --logging_level="INFO"
--max_completed_executors_per_framework="150" --oversubscribed_resources_interval="15secs"
--perf_duration="10secs" --perf_interval="1mins" --port="5051" --qos_correction_interval_min="0ns"
--quiet="false" --recover="reconnect" --recovery_timeout="15mins" --registration_backoff_factor="10ms"
--resources="cpus:2;gpus:0;mem:1024;disk:1024;ports:[31000-32000]" --revocable_cpu_low_priority="true"
--runtime_dir="/tmp/Endpoint_SlaveEndpointTest_UnauthorizedRequest_1_Pkrh12" --sandbox_directory="/mnt/mesos/sandbox"
--strict="true" --switch_user="true" --systemd_enable_support="true" --systemd_runtime_directory="/run/systemd/system"
--version="false" --work_dir="/tmp/Endpoint_SlaveEndpointTest_UnauthorizedRequest_1_A6ROWs"
I0614 01:52:18.966912  5931 credentials.hpp:86] Loading credential for authentication from
'/tmp/Endpoint_SlaveEndpointTest_UnauthorizedRequest_1_Pkrh12/credential'
I0614 01:52:18.967103  5931 slave.cpp:281] Agent using credential for: test-principal
I0614 01:52:18.967124  5931 credentials.hpp:37] Loading credentials for authentication from
'/tmp/Endpoint_SlaveEndpointTest_UnauthorizedRequest_1_Pkrh12/http_credentials'
I0614 01:52:18.967384  5931 http.cpp:975] Creating default 'basic' HTTP authenticator for
realm 'mesos-agent-readonly'
I0614 01:52:18.967581  5931 http.cpp:975] Creating default 'basic' HTTP authenticator for
realm 'mesos-agent-readwrite'
I0614 01:52:18.969038  5931 slave.cpp:552] Agent resources: cpus(*):2; mem(*):1024; disk(*):1024;
ports(*):[31000-32000]
I0614 01:52:18.969118  5931 slave.cpp:560] Agent attributes: [  ]
I0614 01:52:18.969131  5931 slave.cpp:565] Agent hostname: f70bf3cde0bc
I0614 01:52:18.969280  5943 status_update_manager.cpp:177] Pausing sending status updates
I0614 01:52:18.970902  5941 state.cpp:62] Recovering state from '/tmp/Endpoint_SlaveEndpointTest_UnauthorizedRequest_1_A6ROWs/meta'
I0614 01:52:18.971282  5927 status_update_manager.cpp:203] Recovering status update manager
I0614 01:52:18.971694  5942 containerizer.cpp:582] Recovering containerizer
I0614 01:52:18.973338  5927 provisioner.cpp:416] Provisioner recovery complete
I0614 01:52:18.973758  5930 slave.cpp:6127] Finished recovery
I0614 01:52:18.975155  5930 slave.cpp:6309] Querying resource estimator for oversubscribable
resources
I0614 01:52:18.975575  5920 slave.cpp:6323] Received oversubscribable resources {} from the
resource estimator
I0614 01:52:18.978781  5935 process.cpp:3778] Handling HTTP event for process 'slave(760)'
with path: '/slave(760)/monitor/statistics.json'
I0614 01:52:18.980324  5920 http.cpp:1115] HTTP GET for /slave(760)/monitor/statistics.json
from 172.17.0.2:34918
I0614 01:52:18.980406  5920 http.cpp:936] Authorizing principal 'test-principal' to GET the
'/monitor/statistics.json' endpoint
I0614 01:52:18.982897  5930 slave.cpp:817] Agent terminating
[       OK ] Endpoint/SlaveEndpointTest.UnauthorizedRequest/1 (35 ms)
[ RUN      ] Endpoint/SlaveEndpointTest.UnauthorizedRequest/2
I0614 01:52:18.993609  5901 containerizer.cpp:230] Using isolation: posix/cpu,posix/mem,filesystem/posix,network/cni,environment_secret
W0614 01:52:18.994135  5901 backend.cpp:76] Failed to create 'aufs' backend: AufsBackend requires
root privileges
W0614 01:52:18.994241  5901 backend.cpp:76] Failed to create 'bind' backend: BindBackend requires
root privileges
I0614 01:52:18.994278  5901 provisioner.cpp:255] Using default backend 'copy'
I0614 01:52:18.997678  5929 slave.cpp:248] Mesos agent started on (761)@172.17.0.2:33029
I0614 01:52:18.997699  5929 slave.cpp:249] Flags at startup: --acls="" --appc_simple_discovery_uri_prefix="http://"
--appc_store_dir="/tmp/Endpoint_SlaveEndpointTest_UnauthorizedRequest_2_5jtHAn/store/appc"
--authenticate_http_readonly="true" --authenticate_http_readwrite="true" --authenticatee="crammd5"
--authentication_backoff_factor="1secs" --authorizer="local" --cgroups_cpu_enable_pids_and_tids_count="false"
--cgroups_enable_cfs="false" --cgroups_hierarchy="/sys/fs/cgroup" --cgroups_limit_swap="false"
--cgroups_root="mesos" --container_disk_watch_interval="15secs" --containerizers="mesos" --credential="/tmp/Endpoint_SlaveEndpointTest_UnauthorizedRequest_2_5jtHAn/credential"
--default_role="*" --disk_watch_interval="1mins" --docker="docker" --docker_kill_orphans="true"
--docker_registry="https://registry-1.docker.io" --docker_remove_delay="6hrs" --docker_socket="/var/run/docker.sock"
--docker_stop_timeout="0ns" --docker_store_dir="/tmp/Endpoint_SlaveEndpointTest_UnauthorizedRequest_2_5jtHAn/store/docker"
--docker_volume_checkpoint_dir="/var/run/mesos/isolators/docker/volume" --enforce_container_disk_quota="false"
--executor_registration_timeout="1mins" --executor_reregistration_timeout="2secs" --executor_shutdown_grace_period="5secs"
--fetcher_cache_dir="/tmp/Endpoint_SlaveEndpointTest_UnauthorizedRequest_2_5jtHAn/fetch" --fetcher_cache_size="2GB"
--frameworks_home="" --gc_delay="1weeks" --gc_disk_headroom="0.1" --hadoop_home="" --help="false"
--hostname_lookup="true" --http_command_executor="false" --http_credentials="/tmp/Endpoint_SlaveEndpointTest_UnauthorizedRequest_2_5jtHAn/http_credentials"
--http_heartbeat_interval="30secs" --initialize_driver_logging="true" --isolation="posix/cpu,posix/mem"
--launcher="posix" --launcher_dir="/mesos/mesos-1.4.0/_build/src" --logbufsecs="0" --logging_level="INFO"
--max_completed_executors_per_framework="150" --oversubscribed_resources_interval="15secs"
--perf_duration="10secs" --perf_interval="1mins" --port="5051" --qos_correction_interval_min="0ns"
--quiet="false" --recover="reconnect" --recovery_timeout="15mins" --registration_backoff_factor="10ms"
--resources="cpus:2;gpus:0;mem:1024;disk:1024;ports:[31000-32000]" --revocable_cpu_low_priority="true"
--runtime_dir="/tmp/Endpoint_SlaveEndpointTest_UnauthorizedRequest_2_5jtHAn" --sandbox_directory="/mnt/mesos/sandbox"
--strict="true" --switch_user="true" --systemd_enable_support="true" --systemd_runtime_directory="/run/systemd/system"
--version="false" --work_dir="/tmp/Endpoint_SlaveEndpointTest_UnauthorizedRequest_2_wqn8qN"
I0614 01:52:18.998098  5929 credentials.hpp:86] Loading credential for authentication from
'/tmp/Endpoint_SlaveEndpointTest_UnauthorizedRequest_2_5jtHAn/credential'
I0614 01:52:18.998253  5929 slave.cpp:281] Agent using credential for: test-principal
I0614 01:52:18.998273  5929 credentials.hpp:37] Loading credentials for authentication from
'/tmp/Endpoint_SlaveEndpointTest_UnauthorizedRequest_2_5jtHAn/http_credentials'
I0614 01:52:18.998507  5929 http.cpp:975] Creating default 'basic' HTTP authenticator for
realm 'mesos-agent-readonly'
I0614 01:52:18.998657  5929 http.cpp:975] Creating default 'basic' HTTP authenticator for
realm 'mesos-agent-readwrite'
I0614 01:52:19.000075  5929 slave.cpp:552] Agent resources: cpus(*):2; mem(*):1024; disk(*):1024;
ports(*):[31000-32000]
I0614 01:52:19.000151  5929 slave.cpp:560] Agent attributes: [  ]
I0614 01:52:19.000165  5929 slave.cpp:565] Agent hostname: f70bf3cde0bc
I0614 01:52:19.000319  5924 status_update_manager.cpp:177] Pausing sending status updates
I0614 01:52:19.001691  5932 state.cpp:62] Recovering state from '/tmp/Endpoint_SlaveEndpointTest_UnauthorizedRequest_2_wqn8qN/meta'
I0614 01:52:19.001966  5927 status_update_manager.cpp:203] Recovering status update manager
I0614 01:52:19.002285  5932 containerizer.cpp:582] Recovering containerizer
I0614 01:52:19.004096  5943 provisioner.cpp:416] Provisioner recovery complete
I0614 01:52:19.004474  5928 slave.cpp:6127] Finished recovery
I0614 01:52:19.004962  5928 slave.cpp:6309] Querying resource estimator for oversubscribable
resources
I0614 01:52:19.005282  5943 slave.cpp:6323] Received oversubscribable resources {} from the
resource estimator
I0614 01:52:19.007848  5925 process.cpp:3778] Handling HTTP event for process 'slave(761)'
with path: '/slave(761)/containers'
I0614 01:52:19.009217  5933 http.cpp:1115] HTTP GET for /slave(761)/containers from 172.17.0.2:34920
I0614 01:52:19.009299  5933 http.cpp:936] Authorizing principal 'test-principal' to GET the
'/containers' endpoint
I0614 01:52:19.012215  5941 slave.cpp:817] Agent terminating
[       OK ] Endpoint/SlaveEndpointTest.UnauthorizedRequest/2 (30 ms)
[ RUN      ] Endpoint/SlaveEndpointTest.NoAuthorizer/0
I0614 01:52:19.023450  5901 containerizer.cpp:230] Using isolation: posix/cpu,posix/mem,filesystem/posix,network/cni,environment_secret
W0614 01:52:19.023973  5901 backend.cpp:76] Failed to create 'aufs' backend: AufsBackend requires
root privileges
W0614 01:52:19.024070  5901 backend.cpp:76] Failed to create 'bind' backend: BindBackend requires
root privileges
I0614 01:52:19.024101  5901 provisioner.cpp:255] Using default backend 'copy'
I0614 01:52:19.025931  5901 cluster.cpp:448] Creating default 'local' authorizer
I0614 01:52:19.027539  5932 slave.cpp:248] Mesos agent started on (762)@172.17.0.2:33029
I0614 01:52:19.027559  5932 slave.cpp:249] Flags at startup: --acls="" --appc_simple_discovery_uri_prefix="http://"
--appc_store_dir="/tmp/Endpoint_SlaveEndpointTest_NoAuthorizer_0_9vyXrI/store/appc" --authenticate_http_readonly="true"
--authenticate_http_readwrite="true" --authenticatee="crammd5" --authentication_backoff_factor="1secs"
--authorizer="local" --cgroups_cpu_enable_pids_and_tids_count="false" --cgroups_enable_cfs="false"
--cgroups_hierarchy="/sys/fs/cgroup" --cgroups_limit_swap="false" --cgroups_root="mesos" --container_disk_watch_interval="15secs"
--containerizers="mesos" --credential="/tmp/Endpoint_SlaveEndpointTest_NoAuthorizer_0_9vyXrI/credential"
--default_role="*" --disk_watch_interval="1mins" --docker="docker" --docker_kill_orphans="true"
--docker_registry="https://registry-1.docker.io" --docker_remove_delay="6hrs" --docker_socket="/var/run/docker.sock"
--docker_stop_timeout="0ns" --docker_store_dir="/tmp/Endpoint_SlaveEndpointTest_NoAuthorizer_0_9vyXrI/store/docker"
--docker_volume_checkpoint_dir="/var/run/mesos/isolators/docker/volume" --enforce_container_disk_quota="false"
--executor_registration_timeout="1mins" --executor_reregistration_timeout="2secs" --executor_shutdown_grace_period="5secs"
--fetcher_cache_dir="/tmp/Endpoint_SlaveEndpointTest_NoAuthorizer_0_9vyXrI/fetch" --fetcher_cache_size="2GB"
--frameworks_home="" --gc_delay="1weeks" --gc_disk_headroom="0.1" --hadoop_home="" --help="false"
--hostname_lookup="true" --http_command_executor="false" --http_credentials="/tmp/Endpoint_SlaveEndpointTest_NoAuthorizer_0_9vyXrI/http_credentials"
--http_heartbeat_interval="30secs" --initialize_driver_logging="true" --isolation="posix/cpu,posix/mem"
--launcher="posix" --launcher_dir="/mesos/mesos-1.4.0/_build/src" --logbufsecs="0" --logging_level="INFO"
--max_completed_executors_per_framework="150" --oversubscribed_resources_interval="15secs"
--perf_duration="10secs" --perf_interval="1mins" --port="5051" --qos_correction_interval_min="0ns"
--quiet="false" --recover="reconnect" --recovery_timeout="15mins" --registration_backoff_factor="10ms"
--resources="cpus:2;gpus:0;mem:1024;disk:1024;ports:[31000-32000]" --revocable_cpu_low_priority="true"
--runtime_dir="/tmp/Endpoint_SlaveEndpointTest_NoAuthorizer_0_9vyXrI" --sandbox_directory="/mnt/mesos/sandbox"
--strict="true" --switch_user="true" --systemd_enable_support="true" --systemd_runtime_directory="/run/systemd/system"
--version="false" --work_dir="/tmp/Endpoint_SlaveEndpointTest_NoAuthorizer_0_8JBYd8"
I0614 01:52:19.027911  5932 credentials.hpp:86] Loading credential for authentication from
'/tmp/Endpoint_SlaveEndpointTest_NoAuthorizer_0_9vyXrI/credential'
I0614 01:52:19.028056  5932 slave.cpp:281] Agent using credential for: test-principal
I0614 01:52:19.028080  5932 credentials.hpp:37] Loading credentials for authentication from
'/tmp/Endpoint_SlaveEndpointTest_NoAuthorizer_0_9vyXrI/http_credentials'
I0614 01:52:19.028317  5932 http.cpp:975] Creating default 'basic' HTTP authenticator for
realm 'mesos-agent-readonly'
I0614 01:52:19.028486  5932 http.cpp:975] Creating default 'basic' HTTP authenticator for
realm 'mesos-agent-readwrite'
I0614 01:52:19.029712  5932 slave.cpp:552] Agent resources: cpus(*):2; mem(*):1024; disk(*):1024;
ports(*):[31000-32000]
I0614 01:52:19.029786  5932 slave.cpp:560] Agent attributes: [  ]
I0614 01:52:19.029798  5932 slave.cpp:565] Agent hostname: f70bf3cde0bc
I0614 01:52:19.029958  5931 status_update_manager.cpp:177] Pausing sending status updates
I0614 01:52:19.031281  5937 state.cpp:62] Recovering state from '/tmp/Endpoint_SlaveEndpointTest_NoAuthorizer_0_8JBYd8/meta'
I0614 01:52:19.031659  5941 status_update_manager.cpp:203] Recovering status update manager
I0614 01:52:19.031936  5927 containerizer.cpp:582] Recovering containerizer
I0614 01:52:19.033540  5941 provisioner.cpp:416] Provisioner recovery complete
I0614 01:52:19.033968  5939 slave.cpp:6127] Finished recovery
I0614 01:52:19.034615  5939 slave.cpp:6309] Querying resource estimator for oversubscribable
resources
I0614 01:52:19.034919  5925 slave.cpp:6323] Received oversubscribable resources {} from the
resource estimator
I0614 01:52:19.037657  5924 process.cpp:3778] Handling HTTP event for process 'slave(762)'
with path: '/slave(762)/monitor/statistics'
I0614 01:52:19.039083  5940 http.cpp:1115] HTTP GET for /slave(762)/monitor/statistics from
172.17.0.2:34922
I0614 01:52:19.039147  5940 http.cpp:936] Authorizing principal 'test-principal' to GET the
'/monitor/statistics' endpoint
I0614 01:52:19.042732  5925 slave.cpp:817] Agent terminating
[       OK ] Endpoint/SlaveEndpointTest.NoAuthorizer/0 (30 ms)
[ RUN      ] Endpoint/SlaveEndpointTest.NoAuthorizer/1
I0614 01:52:19.054836  5901 containerizer.cpp:230] Using isolation: posix/cpu,posix/mem,filesystem/posix,network/cni,environment_secret
W0614 01:52:19.055522  5901 backend.cpp:76] Failed to create 'aufs' backend: AufsBackend requires
root privileges
W0614 01:52:19.055657  5901 backend.cpp:76] Failed to create 'bind' backend: BindBackend requires
root privileges
I0614 01:52:19.055706  5901 provisioner.cpp:255] Using default backend 'copy'
I0614 01:52:19.057837  5901 cluster.cpp:448] Creating default 'local' authorizer
I0614 01:52:19.059902  5931 slave.cpp:248] Mesos agent started on (763)@172.17.0.2:33029
I0614 01:52:19.059937  5931 slave.cpp:249] Flags at startup: --acls="" --appc_simple_discovery_uri_prefix="http://"
--appc_store_dir="/tmp/Endpoint_SlaveEndpointTest_NoAuthorizer_1_B1AlB3/store/appc" --authenticate_http_readonly="true"
--authenticate_http_readwrite="true" --authenticatee="crammd5" --authentication_backoff_factor="1secs"
--authorizer="local" --cgroups_cpu_enable_pids_and_tids_count="false" --cgroups_enable_cfs="false"
--cgroups_hierarchy="/sys/fs/cgroup" --cgroups_limit_swap="false" --cgroups_root="mesos" --container_disk_watch_interval="15secs"
--containerizers="mesos" --credential="/tmp/Endpoint_SlaveEndpointTest_NoAuthorizer_1_B1AlB3/credential"
--default_role="*" --disk_watch_interval="1mins" --docker="docker" --docker_kill_orphans="true"
--docker_registry="https://registry-1.docker.io" --docker_remove_delay="6hrs" --docker_socket="/var/run/docker.sock"
--docker_stop_timeout="0ns" --docker_store_dir="/tmp/Endpoint_SlaveEndpointTest_NoAuthorizer_1_B1AlB3/store/docker"
--docker_volume_checkpoint_dir="/var/run/mesos/isolators/docker/volume" --enforce_container_disk_quota="false"
--executor_registration_timeout="1mins" --executor_reregistration_timeout="2secs" --executor_shutdown_grace_period="5secs"
--fetcher_cache_dir="/tmp/Endpoint_SlaveEndpointTest_NoAuthorizer_1_B1AlB3/fetch" --fetcher_cache_size="2GB"
--frameworks_home="" --gc_delay="1weeks" --gc_disk_headroom="0.1" --hadoop_home="" --help="false"
--hostname_lookup="true" --http_command_executor="false" --http_credentials="/tmp/Endpoint_SlaveEndpointTest_NoAuthorizer_1_B1AlB3/http_credentials"
--http_heartbeat_interval="30secs" --initialize_driver_logging="true" --isolation="posix/cpu,posix/mem"
--launcher="posix" --launcher_dir="/mesos/mesos-1.4.0/_build/src" --logbufsecs="0" --logging_level="INFO"
--max_completed_executors_per_framework="150" --oversubscribed_resources_interval="15secs"
--perf_duration="10secs" --perf_interval="1mins" --port="5051" --qos_correction_interval_min="0ns"
--quiet="false" --recover="reconnect" --recovery_timeout="15mins" --registration_backoff_factor="10ms"
--resources="cpus:2;gpus:0;mem:1024;disk:1024;ports:[31000-32000]" --revocable_cpu_low_priority="true"
--runtime_dir="/tmp/Endpoint_SlaveEndpointTest_NoAuthorizer_1_B1AlB3" --sandbox_directory="/mnt/mesos/sandbox"
--strict="true" --switch_user="true" --systemd_enable_support="true" --systemd_runtime_directory="/run/systemd/system"
--version="false" --work_dir="/tmp/Endpoint_SlaveEndpointTest_NoAuthorizer_1_aFdMit"
I0614 01:52:19.060488  5931 credentials.hpp:86] Loading credential for authentication from
'/tmp/Endpoint_SlaveEndpointTest_NoAuthorizer_1_B1AlB3/credential'
I0614 01:52:19.060747  5931 slave.cpp:281] Agent using credential for: test-principal
I0614 01:52:19.060773  5931 credentials.hpp:37] Loading credentials for authentication from
'/tmp/Endpoint_SlaveEndpointTest_NoAuthorizer_1_B1AlB3/http_credentials'
I0614 01:52:19.061096  5931 http.cpp:975] Creating default 'basic' HTTP authenticator for
realm 'mesos-agent-readonly'
I0614 01:52:19.061280  5931 http.cpp:975] Creating default 'basic' HTTP authenticator for
realm 'mesos-agent-readwrite'
I0614 01:52:19.062878  5931 slave.cpp:552] Agent resources: cpus(*):2; mem(*):1024; disk(*):1024;
ports(*):[31000-32000]
I0614 01:52:19.062980  5931 slave.cpp:560] Agent attributes: [  ]
I0614 01:52:19.062997  5931 slave.cpp:565] Agent hostname: f70bf3cde0bc
I0614 01:52:19.063635  5920 status_update_manager.cpp:177] Pausing sending status updates
I0614 01:52:19.064951  5932 state.cpp:62] Recovering state from '/tmp/Endpoint_SlaveEndpointTest_NoAuthorizer_1_aFdMit/meta'
I0614 01:52:19.065438  5936 status_update_manager.cpp:203] Recovering status update manager
I0614 01:52:19.065682  5928 containerizer.cpp:582] Recovering containerizer
I0614 01:52:19.067854  5920 provisioner.cpp:416] Provisioner recovery complete
I0614 01:52:19.068495  5925 slave.cpp:6127] Finished recovery
I0614 01:52:19.069169  5925 slave.cpp:6309] Querying resource estimator for oversubscribable
resources
I0614 01:52:19.069701  5925 slave.cpp:6323] Received oversubscribable resources {} from the
resource estimator
I0614 01:52:19.073006  5942 process.cpp:3778] Handling HTTP event for process 'slave(763)'
with path: '/slave(763)/monitor/statistics.json'
I0614 01:52:19.074560  5934 http.cpp:1115] HTTP GET for /slave(763)/monitor/statistics.json
from 172.17.0.2:34924
I0614 01:52:19.074647  5934 http.cpp:936] Authorizing principal 'test-principal' to GET the
'/monitor/statistics.json' endpoint
I0614 01:52:19.078814  5923 slave.cpp:817] Agent terminating
[       OK ] Endpoint/SlaveEndpointTest.NoAuthorizer/1 (37 ms)
[ RUN      ] Endpoint/SlaveEndpointTest.NoAuthorizer/2
I0614 01:52:19.094789  5901 containerizer.cpp:230] Using isolation: posix/cpu,posix/mem,filesystem/posix,network/cni,environment_secret
W0614 01:52:19.095707  5901 backend.cpp:76] Failed to create 'aufs' backend: AufsBackend requires
root privileges
W0614 01:52:19.095857  5901 backend.cpp:76] Failed to create 'bind' backend: BindBackend requires
root privileges
I0614 01:52:19.095906  5901 provisioner.cpp:255] Using default backend 'copy'
I0614 01:52:19.098516  5901 cluster.cpp:448] Creating default 'local' authorizer
I0614 01:52:19.101004  5940 slave.cpp:248] Mesos agent started on (764)@172.17.0.2:33029
I0614 01:52:19.101037  5940 slave.cpp:249] Flags at startup: --acls="" --appc_simple_discovery_uri_prefix="http://"
--appc_store_dir="/tmp/Endpoint_SlaveEndpointTest_NoAuthorizer_2_De2W6o/store/appc" --authenticate_http_readonly="true"
--authenticate_http_readwrite="true" --authenticatee="crammd5" --authentication_backoff_factor="1secs"
--authorizer="local" --cgroups_cpu_enable_pids_and_tids_count="false" --cgroups_enable_cfs="false"
--cgroups_hierarchy="/sys/fs/cgroup" --cgroups_limit_swap="false" --cgroups_root="mesos" --container_disk_watch_interval="15secs"
--containerizers="mesos" --credential="/tmp/Endpoint_SlaveEndpointTest_NoAuthorizer_2_De2W6o/credential"
--default_role="*" --disk_watch_interval="1mins" --docker="docker" --docker_kill_orphans="true"
--docker_registry="https://registry-1.docker.io" --docker_remove_delay="6hrs" --docker_socket="/var/run/docker.sock"
--docker_stop_timeout="0ns" --docker_store_dir="/tmp/Endpoint_SlaveEndpointTest_NoAuthorizer_2_De2W6o/store/docker"
--docker_volume_checkpoint_dir="/var/run/mesos/isolators/docker/volume" --enforce_container_disk_quota="false"
--executor_registration_timeout="1mins" --executor_reregistration_timeout="2secs" --executor_shutdown_grace_period="5secs"
--fetcher_cache_dir="/tmp/Endpoint_SlaveEndpointTest_NoAuthorizer_2_De2W6o/fetch" --fetcher_cache_size="2GB"
--frameworks_home="" --gc_delay="1weeks" --gc_disk_headroom="0.1" --hadoop_home="" --help="false"
--hostname_lookup="true" --http_command_executor="false" --http_credentials="/tmp/Endpoint_SlaveEndpointTest_NoAuthorizer_2_De2W6o/http_credentials"
--http_heartbeat_interval="30secs" --initialize_driver_logging="true" --isolation="posix/cpu,posix/mem"
--launcher="posix" --launcher_dir="/mesos/mesos-1.4.0/_build/src" --logbufsecs="0" --logging_level="INFO"
--max_completed_executors_per_framework="150" --oversubscribed_resources_interval="15secs"
--perf_duration="10secs" --perf_interval="1mins" --port="5051" --qos_correction_interval_min="0ns"
--quiet="false" --recover="reconnect" --recovery_timeout="15mins" --registration_backoff_factor="10ms"
--resources="cpus:2;gpus:0;mem:1024;disk:1024;ports:[31000-32000]" --revocable_cpu_low_priority="true"
--runtime_dir="/tmp/Endpoint_SlaveEndpointTest_NoAuthorizer_2_De2W6o" --sandbox_directory="/mnt/mesos/sandbox"
--strict="true" --switch_user="true" --systemd_enable_support="true" --systemd_runtime_directory="/run/systemd/system"
--version="false" --work_dir="/tmp/Endpoint_SlaveEndpointTest_NoAuthorizer_2_ossDIO"
I0614 01:52:19.101639  5940 credentials.hpp:86] Loading credential for authentication from
'/tmp/Endpoint_SlaveEndpointTest_NoAuthorizer_2_De2W6o/credential'
I0614 01:52:19.101944  5940 slave.cpp:281] Agent using credential for: test-principal
I0614 01:52:19.101972  5940 credentials.hpp:37] Loading credentials for authentication from
'/tmp/Endpoint_SlaveEndpointTest_NoAuthorizer_2_De2W6o/http_credentials'
I0614 01:52:19.102321  5940 http.cpp:975] Creating default 'basic' HTTP authenticator for
realm 'mesos-agent-readonly'
I0614 01:52:19.102542  5940 http.cpp:975] Creating default 'basic' HTTP authenticator for
realm 'mesos-agent-readwrite'
I0614 01:52:19.104847  5940 slave.cpp:552] Agent resources: cpus(*):2; mem(*):1024; disk(*):1024;
ports(*):[31000-32000]
I0614 01:52:19.104959  5940 slave.cpp:560] Agent attributes: [  ]
I0614 01:52:19.104979  5940 slave.cpp:565] Agent hostname: f70bf3cde0bc
I0614 01:52:19.107446  5940 status_update_manager.cpp:177] Pausing sending status updates
I0614 01:52:19.108319  5940 state.cpp:62] Recovering state from '/tmp/Endpoint_SlaveEndpointTest_NoAuthorizer_2_ossDIO/meta'
I0614 01:52:19.108781  5923 status_update_manager.cpp:203] Recovering status update manager
I0614 01:52:19.109259  5926 containerizer.cpp:582] Recovering containerizer
I0614 01:52:19.111443  5935 provisioner.cpp:416] Provisioner recovery complete
I0614 01:52:19.111870  5936 slave.cpp:6127] Finished recovery
I0614 01:52:19.112462  5936 slave.cpp:6309] Querying resource estimator for oversubscribable
resources
I0614 01:52:19.112817  5929 slave.cpp:6323] Received oversubscribable resources {} from the
resource estimator
I0614 01:52:19.116168  5931 process.cpp:3778] Handling HTTP event for process 'slave(764)'
with path: '/slave(764)/containers'
I0614 01:52:19.117846  5943 http.cpp:1115] HTTP GET for /slave(764)/containers from 172.17.0.2:34926
I0614 01:52:19.117935  5943 http.cpp:936] Authorizing principal 'test-principal' to GET the
'/containers' endpoint
I0614 01:52:19.121508  5942 slave.cpp:817] Agent terminating
[       OK ] Endpoint/SlaveEndpointTest.NoAuthorizer/2 (41 ms)
[----------] 9 tests from Endpoint/SlaveEndpointTest (307 ms total)

[----------] Global test environment tear-down
[==========] 1591 tests from 176 test cases ran. (611001 ms total)
[  PASSED  ] 1586 tests.
[  FAILED  ] 5 tests, listed below:
[  FAILED  ] CommandExecutorCheckTest.CommandCheckDeliveredAndReconciled
[  FAILED  ] DefaultExecutorCheckTest.CommandCheckDeliveredAndReconciled
[  FAILED  ] DefaultExecutorCheckTest.CommandCheckStatusChange
[  FAILED  ] DefaultExecutorCheckTest.CommandCheckSeesParentsEnv
[  FAILED  ] DefaultExecutorCheckTest.CommandCheckSharesWorkDirWithTask

 5 FAILED TESTS
  YOU HAVE 19 DISABLED TESTS

E0614 01:52:19.193384  5944 process.cpp:968] Failed to accept socket: future discarded
make[4]: *** [check-local] Error 1
make[4]: Leaving directory `/mesos/mesos-1.4.0/_build/src'
make[3]: *** [check-am] Error 2
make[3]: Leaving directory `/mesos/mesos-1.4.0/_build/src'
make[2]: *** [check] Error 2
make[2]: Leaving directory `/mesos/mesos-1.4.0/_build/src'
make[1]: *** [check-recursive] Error 1
make[1]: Leaving directory `/mesos/mesos-1.4.0/_build'
make: *** [distcheck] Error 1
+ docker rmi mesos-1497402502-26307
Untagged: mesos-1497402502-26307:latest
Deleted: sha256:4edeb265a4c57d0c5c14c384b5ae007beb926a1f36dca5831f0292d93a56dc41
Deleted: sha256:f68d19456f4a1e94eda4c0d4b755514cd4074b77606b3bb77a30a6c5eb02cb94
Deleted: sha256:0b081f0897a325869991bc94b01230d185e7d553756e305ab981506363fe7ae5
Deleted: sha256:e034337066cc74e9a322dcc580df6db553f4bc1e6f547955a2395bbf8e3fe663
Deleted: sha256:2d9350b1ce599af5603a39e7c1ecd5cc0637295ac13ade74fe7ba83cff12ad19
Deleted: sha256:dc2e2f58cf51cef9336f650e76536b6d96b023e3e999f132f181786464c65be6
Deleted: sha256:3b8716242db55e7f5cab1865321a34e46219e095f2ff56fa15ea2dbb31cb1938
Deleted: sha256:1a7ad04960e3eeaa67f402181899ccf1cd0ca2cc1d778754b37f0c729d08aa2e
Deleted: sha256:8fbcd6da1475bc4fdf27d4dd0f5b3d34ca3d436d40b3568d51e84751e5616915
Deleted: sha256:db46f5519a72cc1b6aaa5910290aea4942030401b5cabc0c4d7a0e5687355601
Deleted: sha256:fe23cddd3ff726e0a5201b743a8d0e6e7d99ca8be8b7bee023721e60f097405a
Deleted: sha256:c60ac26aa7664f0b0a4d5d106503103698ab86dee54fe4a5960779ded7eb6ec3
Deleted: sha256:2f6a487e1cd1882df93f2856cfd12278e4753a6692ce5b9345167052e8f2b1e9
Deleted: sha256:c718df906fdd84f3a3dc4379ec5e19807126943deb66c6b4728242b150f19367
Deleted: sha256:c064965e46629efc214a2a30ba18d3d90c65632341a48f7f9e32a98ac197ced8
Deleted: sha256:3832b3b3f5577d525dfd77503c89d2f7cbe1d2bb9d72a36ec0a3c4692fba22d9
Deleted: sha256:d8ec2579f7b62cbd3d8e58e4e7c20064ab8c36a6140b9f5832ba8b8eea0e4a4d
Deleted: sha256:cf608364bd00e3a44a78a06b5e0cac2994be3795086440a657110286f37bf34c
Deleted: sha256:4f850bbd3b4a4b06c82c8e01e50f8ba901e0641d3a1655bacf7369602fe13514
Deleted: sha256:561c484793e1193eb32930f5c25e8ce352842f6f57e70ccee41d069fafda5e99
Deleted: sha256:1eaa8849eb451a4e74145a38029f5d75719d9b97835c46ab3d35697d0546ad36
Deleted: sha256:76c1b8f88fc2d03837561a7c70d893145f50fd61b642473b8417646e07fe300c
Deleted: sha256:3d390ed555d3a5d5e48cf93f7aeb50bad4504fc349d43573d9c05bec9bed8e17
Deleted: sha256:88b500d72f552e052fec2423549cc43afbb3e7ac8f12b6a2f6b71e173ff60a4b
Deleted: sha256:042607fb8e41d2c26c674f1b6f0e983e7c25cb1f27482949a6d6643b2f7bf3a8
Build step 'Execute shell' marked build as failure
Not sending mail to unregistered user neil.conway@gmail.com
Not sending mail to unregistered user mcypark@gmail.com

Mime
View raw message