mesos-builds mailing list archives

Site index · List index
Message view « Date » · « Thread »
Top « Date » · « Thread »
From Apache Jenkins Server <jenk...@builds.apache.org>
Subject Build failed in Jenkins: Mesos-Reviewbot #18339
Date Sun, 11 Jun 2017 07:05:33 GMT
See <https://builds.apache.org/job/Mesos-Reviewbot/18339/display/redirect>

------------------------------------------
[...truncated 28.19 MB...]
I0611 07:05:26.245000  4584 containerizer.cpp:230] Using isolation: posix/cpu,posix/mem,filesystem/posix,network/cni,environment_secret
W0611 07:05:26.245779  4584 backend.cpp:76] Failed to create 'overlay' backend: OverlayBackend
requires root privileges
W0611 07:05:26.245952  4584 backend.cpp:76] Failed to create 'bind' backend: BindBackend requires
root privileges
I0611 07:05:26.245996  4584 provisioner.cpp:255] Using default backend 'copy'
I0611 07:05:26.250799  4603 slave.cpp:248] Mesos agent started on (756)@172.17.0.2:43795
I0611 07:05:26.250838  4603 slave.cpp:249] Flags at startup: --acls="" --appc_simple_discovery_uri_prefix="http://"
--appc_store_dir="/tmp/Endpoint_SlaveEndpointTest_AuthorizedRequest_2_UUD1qa/store/appc" --authenticate_http_readonly="true"
--authenticate_http_readwrite="true" --authenticatee="crammd5" --authentication_backoff_factor="1secs"
--authorizer="local" --cgroups_cpu_enable_pids_and_tids_count="false" --cgroups_enable_cfs="false"
--cgroups_hierarchy="/sys/fs/cgroup" --cgroups_limit_swap="false" --cgroups_root="mesos" --container_disk_watch_interval="15secs"
--containerizers="mesos" --credential="/tmp/Endpoint_SlaveEndpointTest_AuthorizedRequest_2_UUD1qa/credential"
--default_role="*" --disk_watch_interval="1mins" --docker="docker" --docker_kill_orphans="true"
--docker_registry="https://registry-1.docker.io" --docker_remove_delay="6hrs" --docker_socket="/var/run/docker.sock"
--docker_stop_timeout="0ns" --docker_store_dir="/tmp/Endpoint_SlaveEndpointTest_AuthorizedRequest_2_UUD1qa/store/docker"
--docker_volume_checkpoint_dir="/var/run/mesos/isolators/docker/volume" --enforce_container_disk_quota="false"
--executor_registration_timeout="1mins" --executor_reregistration_timeout="2secs" --executor_shutdown_grace_period="5secs"
--fetcher_cache_dir="/tmp/Endpoint_SlaveEndpointTest_AuthorizedRequest_2_UUD1qa/fetch" --fetcher_cache_size="2GB"
--frameworks_home="" --gc_delay="1weeks" --gc_disk_headroom="0.1" --hadoop_home="" --help="false"
--hostname_lookup="true" --http_command_executor="false" --http_credentials="/tmp/Endpoint_SlaveEndpointTest_AuthorizedRequest_2_UUD1qa/http_credentials"
--http_heartbeat_interval="30secs" --initialize_driver_logging="true" --isolation="posix/cpu,posix/mem"
--launcher="posix" --launcher_dir="/mesos/mesos-1.4.0/_build/src" --logbufsecs="0" --logging_level="INFO"
--max_completed_executors_per_framework="150" --oversubscribed_resources_interval="15secs"
--perf_duration="10secs" --perf_interval="1mins" --port="5051" --qos_correction_interval_min="0ns"
--quiet="false" --recover="reconnect" --recovery_timeout="15mins" --registration_backoff_factor="10ms"
--resources="cpus:2;gpus:0;mem:1024;disk:1024;ports:[31000-32000]" --revocable_cpu_low_priority="true"
--runtime_dir="/tmp/Endpoint_SlaveEndpointTest_AuthorizedRequest_2_UUD1qa" --sandbox_directory="/mnt/mesos/sandbox"
--strict="true" --switch_user="true" --systemd_enable_support="true" --systemd_runtime_directory="/run/systemd/system"
--version="false" --work_dir="/tmp/Endpoint_SlaveEndpointTest_AuthorizedRequest_2_2iSwM0"
I0611 07:05:26.251555  4603 credentials.hpp:86] Loading credential for authentication from
'/tmp/Endpoint_SlaveEndpointTest_AuthorizedRequest_2_UUD1qa/credential'
I0611 07:05:26.251818  4603 slave.cpp:281] Agent using credential for: test-principal
I0611 07:05:26.251849  4603 credentials.hpp:37] Loading credentials for authentication from
'/tmp/Endpoint_SlaveEndpointTest_AuthorizedRequest_2_UUD1qa/http_credentials'
I0611 07:05:26.252249  4603 http.cpp:975] Creating default 'basic' HTTP authenticator for
realm 'mesos-agent-readonly'
I0611 07:05:26.252755  4603 http.cpp:975] Creating default 'basic' HTTP authenticator for
realm 'mesos-agent-readwrite'
I0611 07:05:26.254878  4603 slave.cpp:552] Agent resources: cpus(*):2; mem(*):1024; disk(*):1024;
ports(*):[31000-32000]
I0611 07:05:26.255022  4603 slave.cpp:560] Agent attributes: [  ]
I0611 07:05:26.255043  4603 slave.cpp:565] Agent hostname: 80cf14126dae
I0611 07:05:26.255309  4607 status_update_manager.cpp:177] Pausing sending status updates
I0611 07:05:26.257275  4607 state.cpp:62] Recovering state from '/tmp/Endpoint_SlaveEndpointTest_AuthorizedRequest_2_2iSwM0/meta'
I0611 07:05:26.257760  4610 status_update_manager.cpp:203] Recovering status update manager
I0611 07:05:26.258328  4606 containerizer.cpp:582] Recovering containerizer
I0611 07:05:26.260601  4606 provisioner.cpp:416] Provisioner recovery complete
I0611 07:05:26.261243  4605 slave.cpp:6127] Finished recovery
I0611 07:05:26.261958  4605 slave.cpp:6309] Querying resource estimator for oversubscribable
resources
I0611 07:05:26.262533  4606 slave.cpp:6323] Received oversubscribable resources {} from the
resource estimator
I0611 07:05:26.266573  4608 process.cpp:3778] Handling HTTP event for process 'slave(756)'
with path: '/slave(756)/containers'
I0611 07:05:26.269001  4610 http.cpp:1115] HTTP GET for /slave(756)/containers from 172.17.0.2:38606
I0611 07:05:26.269126  4610 http.cpp:936] Authorizing principal 'test-principal' to GET the
'/containers' endpoint
I0611 07:05:26.273885  4604 slave.cpp:817] Agent terminating
[       OK ] Endpoint/SlaveEndpointTest.AuthorizedRequest/2 (44 ms)
[ RUN      ] Endpoint/SlaveEndpointTest.UnauthorizedRequest/0
I0611 07:05:26.289136  4584 containerizer.cpp:230] Using isolation: posix/cpu,posix/mem,filesystem/posix,network/cni,environment_secret
W0611 07:05:26.289918  4584 backend.cpp:76] Failed to create 'overlay' backend: OverlayBackend
requires root privileges
W0611 07:05:26.290091  4584 backend.cpp:76] Failed to create 'bind' backend: BindBackend requires
root privileges
I0611 07:05:26.290135  4584 provisioner.cpp:255] Using default backend 'copy'
I0611 07:05:26.295161  4604 slave.cpp:248] Mesos agent started on (757)@172.17.0.2:43795
I0611 07:05:26.295202  4604 slave.cpp:249] Flags at startup: --acls="" --appc_simple_discovery_uri_prefix="http://"
--appc_store_dir="/tmp/Endpoint_SlaveEndpointTest_UnauthorizedRequest_0_Uc9irN/store/appc"
--authenticate_http_readonly="true" --authenticate_http_readwrite="true" --authenticatee="crammd5"
--authentication_backoff_factor="1secs" --authorizer="local" --cgroups_cpu_enable_pids_and_tids_count="false"
--cgroups_enable_cfs="false" --cgroups_hierarchy="/sys/fs/cgroup" --cgroups_limit_swap="false"
--cgroups_root="mesos" --container_disk_watch_interval="15secs" --containerizers="mesos" --credential="/tmp/Endpoint_SlaveEndpointTest_UnauthorizedRequest_0_Uc9irN/credential"
--default_role="*" --disk_watch_interval="1mins" --docker="docker" --docker_kill_orphans="true"
--docker_registry="https://registry-1.docker.io" --docker_remove_delay="6hrs" --docker_socket="/var/run/docker.sock"
--docker_stop_timeout="0ns" --docker_store_dir="/tmp/Endpoint_SlaveEndpointTest_UnauthorizedRequest_0_Uc9irN/store/docker"
--docker_volume_checkpoint_dir="/var/run/mesos/isolators/docker/volume" --enforce_container_disk_quota="false"
--executor_registration_timeout="1mins" --executor_reregistration_timeout="2secs" --executor_shutdown_grace_period="5secs"
--fetcher_cache_dir="/tmp/Endpoint_SlaveEndpointTest_UnauthorizedRequest_0_Uc9irN/fetch" --fetcher_cache_size="2GB"
--frameworks_home="" --gc_delay="1weeks" --gc_disk_headroom="0.1" --hadoop_home="" --help="false"
--hostname_lookup="true" --http_command_executor="false" --http_credentials="/tmp/Endpoint_SlaveEndpointTest_UnauthorizedRequest_0_Uc9irN/http_credentials"
--http_heartbeat_interval="30secs" --initialize_driver_logging="true" --isolation="posix/cpu,posix/mem"
--launcher="posix" --launcher_dir="/mesos/mesos-1.4.0/_build/src" --logbufsecs="0" --logging_level="INFO"
--max_completed_executors_per_framework="150" --oversubscribed_resources_interval="15secs"
--perf_duration="10secs" --perf_interval="1mins" --port="5051" --qos_correction_interval_min="0ns"
--quiet="false" --recover="reconnect" --recovery_timeout="15mins" --registration_backoff_factor="10ms"
--resources="cpus:2;gpus:0;mem:1024;disk:1024;ports:[31000-32000]" --revocable_cpu_low_priority="true"
--runtime_dir="/tmp/Endpoint_SlaveEndpointTest_UnauthorizedRequest_0_Uc9irN" --sandbox_directory="/mnt/mesos/sandbox"
--strict="true" --switch_user="true" --systemd_enable_support="true" --systemd_runtime_directory="/run/systemd/system"
--version="false" --work_dir="/tmp/Endpoint_SlaveEndpointTest_UnauthorizedRequest_0_WRvFFD"
I0611 07:05:26.296120  4604 credentials.hpp:86] Loading credential for authentication from
'/tmp/Endpoint_SlaveEndpointTest_UnauthorizedRequest_0_Uc9irN/credential'
I0611 07:05:26.296491  4604 slave.cpp:281] Agent using credential for: test-principal
I0611 07:05:26.296519  4604 credentials.hpp:37] Loading credentials for authentication from
'/tmp/Endpoint_SlaveEndpointTest_UnauthorizedRequest_0_Uc9irN/http_credentials'
I0611 07:05:26.296938  4604 http.cpp:975] Creating default 'basic' HTTP authenticator for
realm 'mesos-agent-readonly'
I0611 07:05:26.297253  4604 http.cpp:975] Creating default 'basic' HTTP authenticator for
realm 'mesos-agent-readwrite'
I0611 07:05:26.299445  4604 slave.cpp:552] Agent resources: cpus(*):2; mem(*):1024; disk(*):1024;
ports(*):[31000-32000]
I0611 07:05:26.299587  4604 slave.cpp:560] Agent attributes: [  ]
I0611 07:05:26.299609  4604 slave.cpp:565] Agent hostname: 80cf14126dae
I0611 07:05:26.299845  4609 status_update_manager.cpp:177] Pausing sending status updates
I0611 07:05:26.301836  4606 state.cpp:62] Recovering state from '/tmp/Endpoint_SlaveEndpointTest_UnauthorizedRequest_0_WRvFFD/meta'
I0611 07:05:26.302271  4607 status_update_manager.cpp:203] Recovering status update manager
I0611 07:05:26.302517  4607 containerizer.cpp:582] Recovering containerizer
I0611 07:05:26.304541  4610 provisioner.cpp:416] Provisioner recovery complete
I0611 07:05:26.305487  4604 slave.cpp:6127] Finished recovery
I0611 07:05:26.306196  4604 slave.cpp:6309] Querying resource estimator for oversubscribable
resources
I0611 07:05:26.306782  4607 slave.cpp:6323] Received oversubscribable resources {} from the
resource estimator
I0611 07:05:26.310693  4606 process.cpp:3778] Handling HTTP event for process 'slave(757)'
with path: '/slave(757)/monitor/statistics'
I0611 07:05:26.312554  4610 http.cpp:1115] HTTP GET for /slave(757)/monitor/statistics from
172.17.0.2:38608
I0611 07:05:26.313045  4610 http.cpp:936] Authorizing principal 'test-principal' to GET the
'/monitor/statistics' endpoint
I0611 07:05:26.316691  4609 slave.cpp:817] Agent terminating
[       OK ] Endpoint/SlaveEndpointTest.UnauthorizedRequest/0 (42 ms)
[ RUN      ] Endpoint/SlaveEndpointTest.UnauthorizedRequest/1
I0611 07:05:26.331559  4584 containerizer.cpp:230] Using isolation: posix/cpu,posix/mem,filesystem/posix,network/cni,environment_secret
W0611 07:05:26.332365  4584 backend.cpp:76] Failed to create 'overlay' backend: OverlayBackend
requires root privileges
W0611 07:05:26.332545  4584 backend.cpp:76] Failed to create 'bind' backend: BindBackend requires
root privileges
I0611 07:05:26.332588  4584 provisioner.cpp:255] Using default backend 'copy'
I0611 07:05:26.337575  4603 slave.cpp:248] Mesos agent started on (758)@172.17.0.2:43795
I0611 07:05:26.337618  4603 slave.cpp:249] Flags at startup: --acls="" --appc_simple_discovery_uri_prefix="http://"
--appc_store_dir="/tmp/Endpoint_SlaveEndpointTest_UnauthorizedRequest_1_gKYpTq/store/appc"
--authenticate_http_readonly="true" --authenticate_http_readwrite="true" --authenticatee="crammd5"
--authentication_backoff_factor="1secs" --authorizer="local" --cgroups_cpu_enable_pids_and_tids_count="false"
--cgroups_enable_cfs="false" --cgroups_hierarchy="/sys/fs/cgroup" --cgroups_limit_swap="false"
--cgroups_root="mesos" --container_disk_watch_interval="15secs" --containerizers="mesos" --credential="/tmp/Endpoint_SlaveEndpointTest_UnauthorizedRequest_1_gKYpTq/credential"
--default_role="*" --disk_watch_interval="1mins" --docker="docker" --docker_kill_orphans="true"
--docker_registry="https://registry-1.docker.io" --docker_remove_delay="6hrs" --docker_socket="/var/run/docker.sock"
--docker_stop_timeout="0ns" --docker_store_dir="/tmp/Endpoint_SlaveEndpointTest_UnauthorizedRequest_1_gKYpTq/store/docker"
--docker_volume_checkpoint_dir="/var/run/mesos/isolators/docker/volume" --enforce_container_disk_quota="false"
--executor_registration_timeout="1mins" --executor_reregistration_timeout="2secs" --executor_shutdown_grace_period="5secs"
--fetcher_cache_dir="/tmp/Endpoint_SlaveEndpointTest_UnauthorizedRequest_1_gKYpTq/fetch" --fetcher_cache_size="2GB"
--frameworks_home="" --gc_delay="1weeks" --gc_disk_headroom="0.1" --hadoop_home="" --help="false"
--hostname_lookup="true" --http_command_executor="false" --http_credentials="/tmp/Endpoint_SlaveEndpointTest_UnauthorizedRequest_1_gKYpTq/http_credentials"
--http_heartbeat_interval="30secs" --initialize_driver_logging="true" --isolation="posix/cpu,posix/mem"
--launcher="posix" --launcher_dir="/mesos/mesos-1.4.0/_build/src" --logbufsecs="0" --logging_level="INFO"
--max_completed_executors_per_framework="150" --oversubscribed_resources_interval="15secs"
--perf_duration="10secs" --perf_interval="1mins" --port="5051" --qos_correction_interval_min="0ns"
--quiet="false" --recover="reconnect" --recovery_timeout="15mins" --registration_backoff_factor="10ms"
--resources="cpus:2;gpus:0;mem:1024;disk:1024;ports:[31000-32000]" --revocable_cpu_low_priority="true"
--runtime_dir="/tmp/Endpoint_SlaveEndpointTest_UnauthorizedRequest_1_gKYpTq" --sandbox_directory="/mnt/mesos/sandbox"
--strict="true" --switch_user="true" --systemd_enable_support="true" --systemd_runtime_directory="/run/systemd/system"
--version="false" --work_dir="/tmp/Endpoint_SlaveEndpointTest_UnauthorizedRequest_1_qnET0g"
I0611 07:05:26.338346  4603 credentials.hpp:86] Loading credential for authentication from
'/tmp/Endpoint_SlaveEndpointTest_UnauthorizedRequest_1_gKYpTq/credential'
I0611 07:05:26.338609  4603 slave.cpp:281] Agent using credential for: test-principal
I0611 07:05:26.338644  4603 credentials.hpp:37] Loading credentials for authentication from
'/tmp/Endpoint_SlaveEndpointTest_UnauthorizedRequest_1_gKYpTq/http_credentials'
I0611 07:05:26.339043  4603 http.cpp:975] Creating default 'basic' HTTP authenticator for
realm 'mesos-agent-readonly'
I0611 07:05:26.339280  4603 http.cpp:975] Creating default 'basic' HTTP authenticator for
realm 'mesos-agent-readwrite'
I0611 07:05:26.341398  4603 slave.cpp:552] Agent resources: cpus(*):2; mem(*):1024; disk(*):1024;
ports(*):[31000-32000]
I0611 07:05:26.341540  4603 slave.cpp:560] Agent attributes: [  ]
I0611 07:05:26.341559  4603 slave.cpp:565] Agent hostname: 80cf14126dae
I0611 07:05:26.342003  4610 status_update_manager.cpp:177] Pausing sending status updates
I0611 07:05:26.343744  4603 state.cpp:62] Recovering state from '/tmp/Endpoint_SlaveEndpointTest_UnauthorizedRequest_1_qnET0g/meta'
I0611 07:05:26.344324  4609 status_update_manager.cpp:203] Recovering status update manager
I0611 07:05:26.344787  4603 containerizer.cpp:582] Recovering containerizer
I0611 07:05:26.346873  4610 provisioner.cpp:416] Provisioner recovery complete
I0611 07:05:26.347822  4609 slave.cpp:6127] Finished recovery
I0611 07:05:26.348443  4609 slave.cpp:6309] Querying resource estimator for oversubscribable
resources
I0611 07:05:26.348942  4606 slave.cpp:6323] Received oversubscribable resources {} from the
resource estimator
I0611 07:05:26.352798  4603 process.cpp:3778] Handling HTTP event for process 'slave(758)'
with path: '/slave(758)/monitor/statistics.json'
I0611 07:05:26.354760  4603 http.cpp:1115] HTTP GET for /slave(758)/monitor/statistics.json
from 172.17.0.2:38610
I0611 07:05:26.354878  4603 http.cpp:936] Authorizing principal 'test-principal' to GET the
'/monitor/statistics.json' endpoint
I0611 07:05:26.358261  4604 slave.cpp:817] Agent terminating
[       OK ] Endpoint/SlaveEndpointTest.UnauthorizedRequest/1 (41 ms)
[ RUN      ] Endpoint/SlaveEndpointTest.UnauthorizedRequest/2
I0611 07:05:26.373348  4584 containerizer.cpp:230] Using isolation: posix/cpu,posix/mem,filesystem/posix,network/cni,environment_secret
W0611 07:05:26.374205  4584 backend.cpp:76] Failed to create 'overlay' backend: OverlayBackend
requires root privileges
W0611 07:05:26.374382  4584 backend.cpp:76] Failed to create 'bind' backend: BindBackend requires
root privileges
I0611 07:05:26.374428  4584 provisioner.cpp:255] Using default backend 'copy'
I0611 07:05:26.380655  4608 slave.cpp:248] Mesos agent started on (759)@172.17.0.2:43795
I0611 07:05:26.380694  4608 slave.cpp:249] Flags at startup: --acls="" --appc_simple_discovery_uri_prefix="http://"
--appc_store_dir="/tmp/Endpoint_SlaveEndpointTest_UnauthorizedRequest_2_sEAEM4/store/appc"
--authenticate_http_readonly="true" --authenticate_http_readwrite="true" --authenticatee="crammd5"
--authentication_backoff_factor="1secs" --authorizer="local" --cgroups_cpu_enable_pids_and_tids_count="false"
--cgroups_enable_cfs="false" --cgroups_hierarchy="/sys/fs/cgroup" --cgroups_limit_swap="false"
--cgroups_root="mesos" --container_disk_watch_interval="15secs" --containerizers="mesos" --credential="/tmp/Endpoint_SlaveEndpointTest_UnauthorizedRequest_2_sEAEM4/credential"
--default_role="*" --disk_watch_interval="1mins" --docker="docker" --docker_kill_orphans="true"
--docker_registry="https://registry-1.docker.io" --docker_remove_delay="6hrs" --docker_socket="/var/run/docker.sock"
--docker_stop_timeout="0ns" --docker_store_dir="/tmp/Endpoint_SlaveEndpointTest_UnauthorizedRequest_2_sEAEM4/store/docker"
--docker_volume_checkpoint_dir="/var/run/mesos/isolators/docker/volume" --enforce_container_disk_quota="false"
--executor_registration_timeout="1mins" --executor_reregistration_timeout="2secs" --executor_shutdown_grace_period="5secs"
--fetcher_cache_dir="/tmp/Endpoint_SlaveEndpointTest_UnauthorizedRequest_2_sEAEM4/fetch" --fetcher_cache_size="2GB"
--frameworks_home="" --gc_delay="1weeks" --gc_disk_headroom="0.1" --hadoop_home="" --help="false"
--hostname_lookup="true" --http_command_executor="false" --http_credentials="/tmp/Endpoint_SlaveEndpointTest_UnauthorizedRequest_2_sEAEM4/http_credentials"
--http_heartbeat_interval="30secs" --initialize_driver_logging="true" --isolation="posix/cpu,posix/mem"
--launcher="posix" --launcher_dir="/mesos/mesos-1.4.0/_build/src" --logbufsecs="0" --logging_level="INFO"
--max_completed_executors_per_framework="150" --oversubscribed_resources_interval="15secs"
--perf_duration="10secs" --perf_interval="1mins" --port="5051" --qos_correction_interval_min="0ns"
--quiet="false" --recover="reconnect" --recovery_timeout="15mins" --registration_backoff_factor="10ms"
--resources="cpus:2;gpus:0;mem:1024;disk:1024;ports:[31000-32000]" --revocable_cpu_low_priority="true"
--runtime_dir="/tmp/Endpoint_SlaveEndpointTest_UnauthorizedRequest_2_sEAEM4" --sandbox_directory="/mnt/mesos/sandbox"
--strict="true" --switch_user="true" --systemd_enable_support="true" --systemd_runtime_directory="/run/systemd/system"
--version="false" --work_dir="/tmp/Endpoint_SlaveEndpointTest_UnauthorizedRequest_2_AcqnNU"
I0611 07:05:26.381618  4608 credentials.hpp:86] Loading credential for authentication from
'/tmp/Endpoint_SlaveEndpointTest_UnauthorizedRequest_2_sEAEM4/credential'
I0611 07:05:26.381933  4608 slave.cpp:281] Agent using credential for: test-principal
I0611 07:05:26.381961  4608 credentials.hpp:37] Loading credentials for authentication from
'/tmp/Endpoint_SlaveEndpointTest_UnauthorizedRequest_2_sEAEM4/http_credentials'
I0611 07:05:26.382364  4608 http.cpp:975] Creating default 'basic' HTTP authenticator for
realm 'mesos-agent-readonly'
I0611 07:05:26.382637  4608 http.cpp:975] Creating default 'basic' HTTP authenticator for
realm 'mesos-agent-readwrite'
I0611 07:05:26.385061  4608 slave.cpp:552] Agent resources: cpus(*):2; mem(*):1024; disk(*):1024;
ports(*):[31000-32000]
I0611 07:05:26.385206  4608 slave.cpp:560] Agent attributes: [  ]
I0611 07:05:26.385228  4608 slave.cpp:565] Agent hostname: 80cf14126dae
I0611 07:05:26.385586  4604 status_update_manager.cpp:177] Pausing sending status updates
I0611 07:05:26.387794  4604 state.cpp:62] Recovering state from '/tmp/Endpoint_SlaveEndpointTest_UnauthorizedRequest_2_AcqnNU/meta'
I0611 07:05:26.388345  4609 status_update_manager.cpp:203] Recovering status update manager
I0611 07:05:26.388787  4610 containerizer.cpp:582] Recovering containerizer
I0611 07:05:26.391088  4606 provisioner.cpp:416] Provisioner recovery complete
I0611 07:05:26.392047  4606 slave.cpp:6127] Finished recovery
I0611 07:05:26.392722  4606 slave.cpp:6309] Querying resource estimator for oversubscribable
resources
I0611 07:05:26.393681  4606 slave.cpp:6323] Received oversubscribable resources {} from the
resource estimator
I0611 07:05:26.397753  4605 process.cpp:3778] Handling HTTP event for process 'slave(759)'
with path: '/slave(759)/containers'
I0611 07:05:26.399778  4604 http.cpp:1115] HTTP GET for /slave(759)/containers from 172.17.0.2:38612
I0611 07:05:26.399896  4604 http.cpp:936] Authorizing principal 'test-principal' to GET the
'/containers' endpoint
I0611 07:05:26.404137  4610 slave.cpp:817] Agent terminating
[       OK ] Endpoint/SlaveEndpointTest.UnauthorizedRequest/2 (46 ms)
[ RUN      ] Endpoint/SlaveEndpointTest.NoAuthorizer/0
I0611 07:05:26.419780  4584 containerizer.cpp:230] Using isolation: posix/cpu,posix/mem,filesystem/posix,network/cni,environment_secret
W0611 07:05:26.420562  4584 backend.cpp:76] Failed to create 'overlay' backend: OverlayBackend
requires root privileges
W0611 07:05:26.420737  4584 backend.cpp:76] Failed to create 'bind' backend: BindBackend requires
root privileges
I0611 07:05:26.420781  4584 provisioner.cpp:255] Using default backend 'copy'
I0611 07:05:26.423197  4584 cluster.cpp:448] Creating default 'local' authorizer
I0611 07:05:26.425979  4609 slave.cpp:248] Mesos agent started on (760)@172.17.0.2:43795
I0611 07:05:26.426023  4609 slave.cpp:249] Flags at startup: --acls="" --appc_simple_discovery_uri_prefix="http://"
--appc_store_dir="/tmp/Endpoint_SlaveEndpointTest_NoAuthorizer_0_UsRp9I/store/appc" --authenticate_http_readonly="true"
--authenticate_http_readwrite="true" --authenticatee="crammd5" --authentication_backoff_factor="1secs"
--authorizer="local" --cgroups_cpu_enable_pids_and_tids_count="false" --cgroups_enable_cfs="false"
--cgroups_hierarchy="/sys/fs/cgroup" --cgroups_limit_swap="false" --cgroups_root="mesos" --container_disk_watch_interval="15secs"
--containerizers="mesos" --credential="/tmp/Endpoint_SlaveEndpointTest_NoAuthorizer_0_UsRp9I/credential"
--default_role="*" --disk_watch_interval="1mins" --docker="docker" --docker_kill_orphans="true"
--docker_registry="https://registry-1.docker.io" --docker_remove_delay="6hrs" --docker_socket="/var/run/docker.sock"
--docker_stop_timeout="0ns" --docker_store_dir="/tmp/Endpoint_SlaveEndpointTest_NoAuthorizer_0_UsRp9I/store/docker"
--docker_volume_checkpoint_dir="/var/run/mesos/isolators/docker/volume" --enforce_container_disk_quota="false"
--executor_registration_timeout="1mins" --executor_reregistration_timeout="2secs" --executor_shutdown_grace_period="5secs"
--fetcher_cache_dir="/tmp/Endpoint_SlaveEndpointTest_NoAuthorizer_0_UsRp9I/fetch" --fetcher_cache_size="2GB"
--frameworks_home="" --gc_delay="1weeks" --gc_disk_headroom="0.1" --hadoop_home="" --help="false"
--hostname_lookup="true" --http_command_executor="false" --http_credentials="/tmp/Endpoint_SlaveEndpointTest_NoAuthorizer_0_UsRp9I/http_credentials"
--http_heartbeat_interval="30secs" --initialize_driver_logging="true" --isolation="posix/cpu,posix/mem"
--launcher="posix" --launcher_dir="/mesos/mesos-1.4.0/_build/src" --logbufsecs="0" --logging_level="INFO"
--max_completed_executors_per_framework="150" --oversubscribed_resources_interval="15secs"
--perf_duration="10secs" --perf_interval="1mins" --port="5051" --qos_correction_interval_min="0ns"
--quiet="false" --recover="reconnect" --recovery_timeout="15mins" --registration_backoff_factor="10ms"
--resources="cpus:2;gpus:0;mem:1024;disk:1024;ports:[31000-32000]" --revocable_cpu_low_priority="true"
--runtime_dir="/tmp/Endpoint_SlaveEndpointTest_NoAuthorizer_0_UsRp9I" --sandbox_directory="/mnt/mesos/sandbox"
--strict="true" --switch_user="true" --systemd_enable_support="true" --systemd_runtime_directory="/run/systemd/system"
--version="false" --work_dir="/tmp/Endpoint_SlaveEndpointTest_NoAuthorizer_0_ISfG2y"
I0611 07:05:26.426812  4609 credentials.hpp:86] Loading credential for authentication from
'/tmp/Endpoint_SlaveEndpointTest_NoAuthorizer_0_UsRp9I/credential'
I0611 07:05:26.427255  4609 slave.cpp:281] Agent using credential for: test-principal
I0611 07:05:26.427289  4609 credentials.hpp:37] Loading credentials for authentication from
'/tmp/Endpoint_SlaveEndpointTest_NoAuthorizer_0_UsRp9I/http_credentials'
I0611 07:05:26.427743  4609 http.cpp:975] Creating default 'basic' HTTP authenticator for
realm 'mesos-agent-readonly'
I0611 07:05:26.428072  4609 http.cpp:975] Creating default 'basic' HTTP authenticator for
realm 'mesos-agent-readwrite'
I0611 07:05:26.430229  4609 slave.cpp:552] Agent resources: cpus(*):2; mem(*):1024; disk(*):1024;
ports(*):[31000-32000]
I0611 07:05:26.430371  4609 slave.cpp:560] Agent attributes: [  ]
I0611 07:05:26.430393  4609 slave.cpp:565] Agent hostname: 80cf14126dae
I0611 07:05:26.430748  4607 status_update_manager.cpp:177] Pausing sending status updates
I0611 07:05:26.432679  4605 state.cpp:62] Recovering state from '/tmp/Endpoint_SlaveEndpointTest_NoAuthorizer_0_ISfG2y/meta'
I0611 07:05:26.433240  4610 status_update_manager.cpp:203] Recovering status update manager
I0611 07:05:26.433780  4610 containerizer.cpp:582] Recovering containerizer
I0611 07:05:26.436194  4604 provisioner.cpp:416] Provisioner recovery complete
I0611 07:05:26.436817  4605 slave.cpp:6127] Finished recovery
I0611 07:05:26.437461  4605 slave.cpp:6309] Querying resource estimator for oversubscribable
resources
I0611 07:05:26.438077  4605 slave.cpp:6323] Received oversubscribable resources {} from the
resource estimator
I0611 07:05:26.442055  4610 process.cpp:3778] Handling HTTP event for process 'slave(760)'
with path: '/slave(760)/monitor/statistics'
I0611 07:05:26.444389  4604 http.cpp:1115] HTTP GET for /slave(760)/monitor/statistics from
172.17.0.2:38614
I0611 07:05:26.444512  4604 http.cpp:936] Authorizing principal 'test-principal' to GET the
'/monitor/statistics' endpoint
I0611 07:05:26.449049  4608 slave.cpp:817] Agent terminating
[       OK ] Endpoint/SlaveEndpointTest.NoAuthorizer/0 (45 ms)
[ RUN      ] Endpoint/SlaveEndpointTest.NoAuthorizer/1
I0611 07:05:26.464613  4584 containerizer.cpp:230] Using isolation: posix/cpu,posix/mem,filesystem/posix,network/cni,environment_secret
W0611 07:05:26.465390  4584 backend.cpp:76] Failed to create 'overlay' backend: OverlayBackend
requires root privileges
W0611 07:05:26.465559  4584 backend.cpp:76] Failed to create 'bind' backend: BindBackend requires
root privileges
I0611 07:05:26.465605  4584 provisioner.cpp:255] Using default backend 'copy'
I0611 07:05:26.468011  4584 cluster.cpp:448] Creating default 'local' authorizer
I0611 07:05:26.470634  4609 slave.cpp:248] Mesos agent started on (761)@172.17.0.2:43795
I0611 07:05:26.470674  4609 slave.cpp:249] Flags at startup: --acls="" --appc_simple_discovery_uri_prefix="http://"
--appc_store_dir="/tmp/Endpoint_SlaveEndpointTest_NoAuthorizer_1_kGz9Yn/store/appc" --authenticate_http_readonly="true"
--authenticate_http_readwrite="true" --authenticatee="crammd5" --authentication_backoff_factor="1secs"
--authorizer="local" --cgroups_cpu_enable_pids_and_tids_count="false" --cgroups_enable_cfs="false"
--cgroups_hierarchy="/sys/fs/cgroup" --cgroups_limit_swap="false" --cgroups_root="mesos" --container_disk_watch_interval="15secs"
--containerizers="mesos" --credential="/tmp/Endpoint_SlaveEndpointTest_NoAuthorizer_1_kGz9Yn/credential"
--default_role="*" --disk_watch_interval="1mins" --docker="docker" --docker_kill_orphans="true"
--docker_registry="https://registry-1.docker.io" --docker_remove_delay="6hrs" --docker_socket="/var/run/docker.sock"
--docker_stop_timeout="0ns" --docker_store_dir="/tmp/Endpoint_SlaveEndpointTest_NoAuthorizer_1_kGz9Yn/store/docker"
--docker_volume_checkpoint_dir="/var/run/mesos/isolators/docker/volume" --enforce_container_disk_quota="false"
--executor_registration_timeout="1mins" --executor_reregistration_timeout="2secs" --executor_shutdown_grace_period="5secs"
--fetcher_cache_dir="/tmp/Endpoint_SlaveEndpointTest_NoAuthorizer_1_kGz9Yn/fetch" --fetcher_cache_size="2GB"
--frameworks_home="" --gc_delay="1weeks" --gc_disk_headroom="0.1" --hadoop_home="" --help="false"
--hostname_lookup="true" --http_command_executor="false" --http_credentials="/tmp/Endpoint_SlaveEndpointTest_NoAuthorizer_1_kGz9Yn/http_credentials"
--http_heartbeat_interval="30secs" --initialize_driver_logging="true" --isolation="posix/cpu,posix/mem"
--launcher="posix" --launcher_dir="/mesos/mesos-1.4.0/_build/src" --logbufsecs="0" --logging_level="INFO"
--max_completed_executors_per_framework="150" --oversubscribed_resources_interval="15secs"
--perf_duration="10secs" --perf_interval="1mins" --port="5051" --qos_correction_interval_min="0ns"
--quiet="false" --recover="reconnect" --recovery_timeout="15mins" --registration_backoff_factor="10ms"
--resources="cpus:2;gpus:0;mem:1024;disk:1024;ports:[31000-32000]" --revocable_cpu_low_priority="true"
--runtime_dir="/tmp/Endpoint_SlaveEndpointTest_NoAuthorizer_1_kGz9Yn" --sandbox_directory="/mnt/mesos/sandbox"
--strict="true" --switch_user="true" --systemd_enable_support="true" --systemd_runtime_directory="/run/systemd/system"
--version="false" --work_dir="/tmp/Endpoint_SlaveEndpointTest_NoAuthorizer_1_cgmbLd"
I0611 07:05:26.471523  4609 credentials.hpp:86] Loading credential for authentication from
'/tmp/Endpoint_SlaveEndpointTest_NoAuthorizer_1_kGz9Yn/credential'
I0611 07:05:26.471952  4609 slave.cpp:281] Agent using credential for: test-principal
I0611 07:05:26.471988  4609 credentials.hpp:37] Loading credentials for authentication from
'/tmp/Endpoint_SlaveEndpointTest_NoAuthorizer_1_kGz9Yn/http_credentials'
I0611 07:05:26.472498  4609 http.cpp:975] Creating default 'basic' HTTP authenticator for
realm 'mesos-agent-readonly'
I0611 07:05:26.472843  4609 http.cpp:975] Creating default 'basic' HTTP authenticator for
realm 'mesos-agent-readwrite'
I0611 07:05:26.475184  4609 slave.cpp:552] Agent resources: cpus(*):2; mem(*):1024; disk(*):1024;
ports(*):[31000-32000]
I0611 07:05:26.475327  4609 slave.cpp:560] Agent attributes: [  ]
I0611 07:05:26.475349  4609 slave.cpp:565] Agent hostname: 80cf14126dae
I0611 07:05:26.475744  4604 status_update_manager.cpp:177] Pausing sending status updates
I0611 07:05:26.477690  4610 state.cpp:62] Recovering state from '/tmp/Endpoint_SlaveEndpointTest_NoAuthorizer_1_cgmbLd/meta'
I0611 07:05:26.478464  4604 status_update_manager.cpp:203] Recovering status update manager
I0611 07:05:26.478801  4604 containerizer.cpp:582] Recovering containerizer
I0611 07:05:26.480947  4606 provisioner.cpp:416] Provisioner recovery complete
I0611 07:05:26.481645  4610 slave.cpp:6127] Finished recovery
I0611 07:05:26.482556  4610 slave.cpp:6309] Querying resource estimator for oversubscribable
resources
I0611 07:05:26.483250  4610 slave.cpp:6323] Received oversubscribable resources {} from the
resource estimator
I0611 07:05:26.487432  4609 process.cpp:3778] Handling HTTP event for process 'slave(761)'
with path: '/slave(761)/monitor/statistics.json'
I0611 07:05:26.489526  4607 http.cpp:1115] HTTP GET for /slave(761)/monitor/statistics.json
from 172.17.0.2:38616
I0611 07:05:26.489644  4607 http.cpp:936] Authorizing principal 'test-principal' to GET the
'/monitor/statistics.json' endpoint
I0611 07:05:26.495306  4608 slave.cpp:817] Agent terminating
[       OK ] Endpoint/SlaveEndpointTest.NoAuthorizer/1 (47 ms)
[ RUN      ] Endpoint/SlaveEndpointTest.NoAuthorizer/2
I0611 07:05:26.511687  4584 containerizer.cpp:230] Using isolation: posix/cpu,posix/mem,filesystem/posix,network/cni,environment_secret
W0611 07:05:26.512454  4584 backend.cpp:76] Failed to create 'overlay' backend: OverlayBackend
requires root privileges
W0611 07:05:26.512626  4584 backend.cpp:76] Failed to create 'bind' backend: BindBackend requires
root privileges
I0611 07:05:26.512670  4584 provisioner.cpp:255] Using default backend 'copy'
I0611 07:05:26.515211  4584 cluster.cpp:448] Creating default 'local' authorizer
I0611 07:05:26.518154  4608 slave.cpp:248] Mesos agent started on (762)@172.17.0.2:43795
I0611 07:05:26.518194  4608 slave.cpp:249] Flags at startup: --acls="" --appc_simple_discovery_uri_prefix="http://"
--appc_store_dir="/tmp/Endpoint_SlaveEndpointTest_NoAuthorizer_2_GDc8i3/store/appc" --authenticate_http_readonly="true"
--authenticate_http_readwrite="true" --authenticatee="crammd5" --authentication_backoff_factor="1secs"
--authorizer="local" --cgroups_cpu_enable_pids_and_tids_count="false" --cgroups_enable_cfs="false"
--cgroups_hierarchy="/sys/fs/cgroup" --cgroups_limit_swap="false" --cgroups_root="mesos" --container_disk_watch_interval="15secs"
--containerizers="mesos" --credential="/tmp/Endpoint_SlaveEndpointTest_NoAuthorizer_2_GDc8i3/credential"
--default_role="*" --disk_watch_interval="1mins" --docker="docker" --docker_kill_orphans="true"
--docker_registry="https://registry-1.docker.io" --docker_remove_delay="6hrs" --docker_socket="/var/run/docker.sock"
--docker_stop_timeout="0ns" --docker_store_dir="/tmp/Endpoint_SlaveEndpointTest_NoAuthorizer_2_GDc8i3/store/docker"
--docker_volume_checkpoint_dir="/var/run/mesos/isolators/docker/volume" --enforce_container_disk_quota="false"
--executor_registration_timeout="1mins" --executor_reregistration_timeout="2secs" --executor_shutdown_grace_period="5secs"
--fetcher_cache_dir="/tmp/Endpoint_SlaveEndpointTest_NoAuthorizer_2_GDc8i3/fetch" --fetcher_cache_size="2GB"
--frameworks_home="" --gc_delay="1weeks" --gc_disk_headroom="0.1" --hadoop_home="" --help="false"
--hostname_lookup="true" --http_command_executor="false" --http_credentials="/tmp/Endpoint_SlaveEndpointTest_NoAuthorizer_2_GDc8i3/http_credentials"
--http_heartbeat_interval="30secs" --initialize_driver_logging="true" --isolation="posix/cpu,posix/mem"
--launcher="posix" --launcher_dir="/mesos/mesos-1.4.0/_build/src" --logbufsecs="0" --logging_level="INFO"
--max_completed_executors_per_framework="150" --oversubscribed_resources_interval="15secs"
--perf_duration="10secs" --perf_interval="1mins" --port="5051" --qos_correction_interval_min="0ns"
--quiet="false" --recover="reconnect" --recovery_timeout="15mins" --registration_backoff_factor="10ms"
--resources="cpus:2;gpus:0;mem:1024;disk:1024;ports:[31000-32000]" --revocable_cpu_low_priority="true"
--runtime_dir="/tmp/Endpoint_SlaveEndpointTest_NoAuthorizer_2_GDc8i3" --sandbox_directory="/mnt/mesos/sandbox"
--strict="true" --switch_user="true" --systemd_enable_support="true" --systemd_runtime_directory="/run/systemd/system"
--version="false" --work_dir="/tmp/Endpoint_SlaveEndpointTest_NoAuthorizer_2_ckCvXS"
I0611 07:05:26.518935  4608 credentials.hpp:86] Loading credential for authentication from
'/tmp/Endpoint_SlaveEndpointTest_NoAuthorizer_2_GDc8i3/credential'
I0611 07:05:26.519412  4608 slave.cpp:281] Agent using credential for: test-principal
I0611 07:05:26.519445  4608 credentials.hpp:37] Loading credentials for authentication from
'/tmp/Endpoint_SlaveEndpointTest_NoAuthorizer_2_GDc8i3/http_credentials'
I0611 07:05:26.519876  4608 http.cpp:975] Creating default 'basic' HTTP authenticator for
realm 'mesos-agent-readonly'
I0611 07:05:26.520141  4608 http.cpp:975] Creating default 'basic' HTTP authenticator for
realm 'mesos-agent-readwrite'
I0611 07:05:26.522411  4608 slave.cpp:552] Agent resources: cpus(*):2; mem(*):1024; disk(*):1024;
ports(*):[31000-32000]
I0611 07:05:26.522553  4608 slave.cpp:560] Agent attributes: [  ]
I0611 07:05:26.522572  4608 slave.cpp:565] Agent hostname: 80cf14126dae
I0611 07:05:26.523929  4609 status_update_manager.cpp:177] Pausing sending status updates
I0611 07:05:26.526029  4606 state.cpp:62] Recovering state from '/tmp/Endpoint_SlaveEndpointTest_NoAuthorizer_2_ckCvXS/meta'
I0611 07:05:26.526582  4609 status_update_manager.cpp:203] Recovering status update manager
I0611 07:05:26.526856  4605 containerizer.cpp:582] Recovering containerizer
I0611 07:05:26.528956  4603 provisioner.cpp:416] Provisioner recovery complete
I0611 07:05:26.529681  4603 slave.cpp:6127] Finished recovery
I0611 07:05:26.530396  4603 slave.cpp:6309] Querying resource estimator for oversubscribable
resources
I0611 07:05:26.530818  4603 slave.cpp:6323] Received oversubscribable resources {} from the
resource estimator
I0611 07:05:26.534678  4605 process.cpp:3778] Handling HTTP event for process 'slave(762)'
with path: '/slave(762)/containers'
I0611 07:05:26.537123  4605 http.cpp:1115] HTTP GET for /slave(762)/containers from 172.17.0.2:38618
I0611 07:05:26.537341  4605 http.cpp:936] Authorizing principal 'test-principal' to GET the
'/containers' endpoint
I0611 07:05:26.542387  4608 slave.cpp:817] Agent terminating
[       OK ] Endpoint/SlaveEndpointTest.NoAuthorizer/2 (46 ms)
[----------] 9 tests from Endpoint/SlaveEndpointTest (404 ms total)

[----------] Global test environment tear-down
[==========] 1589 tests from 176 test cases ran. (703581 ms total)
[  PASSED  ] 1585 tests.
[  FAILED  ] 4 tests, listed below:
[  FAILED  ] DefaultExecutorCheckTest.CommandCheckDeliveredAndReconciled
[  FAILED  ] DefaultExecutorCheckTest.CommandCheckStatusChange
[  FAILED  ] DefaultExecutorCheckTest.CommandCheckSeesParentsEnv
[  FAILED  ] DefaultExecutorCheckTest.CommandCheckSharesWorkDirWithTask

 4 FAILED TESTS
  YOU HAVE 22 DISABLED TESTS

E0611 07:05:26.682811  4611 process.cpp:968] Failed to accept socket: future discarded
make[4]: *** [check-local] Error 1
make[4]: Leaving directory `/mesos/mesos-1.4.0/_build/src'
make[3]: *** [check-am] Error 2
make[3]: Leaving directory `/mesos/mesos-1.4.0/_build/src'
make[2]: *** [check] Error 2
make[2]: Leaving directory `/mesos/mesos-1.4.0/_build/src'
make[1]: *** [check-recursive] Error 1
make[1]: Leaving directory `/mesos/mesos-1.4.0/_build'
make: *** [distcheck] Error 1
+ docker rmi mesos-1497159259-24016
Untagged: mesos-1497159259-24016:latest
Deleted: sha256:4092dbe5545274504f3e24d0c593955f6d33ef7c0fdcf6bd1172cd40729cc5f8
Deleted: sha256:c23340d20ab7ca5962e9e2abe8724af710a97bdfc85fe87171bbff555e20130d
Deleted: sha256:1d819eaea1cdf037dfaa62cacb89fc20a3185282d3250c841e4ea3cbac7be861
Deleted: sha256:d135b7a28ef5f68b4f5d186f23ce9f0a43294b545fd654767badcb5095c09858
Deleted: sha256:4df5a6a84a31ddd1f4cf29206b5defaa70580a66a829fb1f7657f44845515066
Deleted: sha256:bbdbd463caa531f8009ead71805fd4b807d73cb54c2c15d95f9eb0cb1a61cf99
Deleted: sha256:14a0eef82aea963da25104dbd1496164e5bdb6974baaf89b0895681354fa730b
Deleted: sha256:3f9cfe816d3e2793e1568537f81e55cc80b9f420c2874a7089428f3973309d9e
Deleted: sha256:e79b683881410b0718badb1abe54cd7431eaa31ceabc053b0a7d40de8dc988c2
Deleted: sha256:bee84655d87c12333b2c7d7330bb3e6ce40a136450112e62c0ed95ed931779d8
Deleted: sha256:2e8df5231a5ba280226880fcd6c5891187d920e48d21178db7bc784f5a5bbea7
Deleted: sha256:b036cab46ad43e59380939fba8d16ecbf96eeb917ea7854dfbfc1c50ebfbc93f
Deleted: sha256:a0aeb448344c8891bc2c6b4495dfbf888037a2dd556c9e01155dcd339a7e5221
Deleted: sha256:4b656d4fe1fa7a319263b36814cb060dd6be59a779f8b517c55c1dc3e711bf51
Deleted: sha256:8b78561229c49ab480944983323b6858c6e55697f2836fc43e075da0ceb5e2d2
Deleted: sha256:b72e51a2ad3bb7ba037383b3ae4f91c4be5eb76c03fa9d961f01a92efeaac7b0
Deleted: sha256:56744cdec7e01bf665f5cd8dca92f2fe34e754e04d364469355fe327806deeb1
Deleted: sha256:2bd763f4c5c9f88b22c633681093434e1cceaa34d4c839479c309e674ef38940
Deleted: sha256:94e93ee88055f5437a225fe5db00fb9b803c7b661e973334f833295a0ecc3768
Deleted: sha256:18feec589134741256cd376fcd4547a1ad2c010ece59a033b8f433fc04a56bba
Deleted: sha256:5cb68d12124dc7071765610ca2327bab35f022d792848f21ccf8225be1422a8c
Deleted: sha256:ea47e70e3df3ae4ccfea0b607dc71311325c35f972eb2c57e62716dfa3c20a7a
Deleted: sha256:125a56349a3d4bfd3f0c022147151f62ece9028b588ea192be6b6512b10677bb
Deleted: sha256:7cbab3a902ae2ce9b81dc2b1e890dd2d509ba350fefe9693ab827bd41e99a272
Build step 'Execute shell' marked build as failure

Mime
View raw message