mesos-builds mailing list archives

Site index · List index
Message view « Date » · « Thread »
Top « Date » · « Thread »
From Apache Jenkins Server <jenk...@builds.apache.org>
Subject Build failed in Jenkins: Mesos-Buildbot » autotools,clang,--verbose --enable-libevent --enable-ssl,GLOG_v=1 MESOS_VERBOSE=1,ubuntu:14.04,(ubuntu)&&(!ubuntu-us1)&&(!ubuntu-eu2) #3772
Date Wed, 07 Jun 2017 13:00:25 GMT
See <https://builds.apache.org/job/Mesos-Buildbot/BUILDTOOL=autotools,COMPILER=clang,CONFIGURATION=--verbose%20--enable-libevent%20--enable-ssl,ENVIRONMENT=GLOG_v=1%20MESOS_VERBOSE=1,OS=ubuntu%3A14.04,label_exp=(ubuntu)&&(!ubuntu-us1)&&(!ubuntu-eu2)/3772/display/redirect?page=changes>

Changes:

[mpark] Removed custom C++ style guide recommendation regarding lambda captures.

------------------------------------------
[...truncated 29.21 MB...]
I0607 13:00:18.488943 26635 slave.cpp:6323] Received oversubscribable resources {} from the
resource estimator
I0607 13:00:18.491407 26640 process.cpp:3778] Handling HTTP event for process 'slave(762)'
with path: '/slave(762)/containers'
I0607 13:00:18.493644 26631 http.cpp:1115] HTTP GET for /slave(762)/containers from 172.17.0.4:37710
I0607 13:00:18.493717 26631 http.cpp:936] Authorizing principal 'test-principal' to GET the
'/containers' endpoint
I0607 13:00:18.497581 26637 slave.cpp:817] Agent terminating
[       OK ] Endpoint/SlaveEndpointTest.AuthorizedRequest/2 (42 ms)
[ RUN      ] Endpoint/SlaveEndpointTest.UnauthorizedRequest/0
I0607 13:00:18.508759  5992 containerizer.cpp:230] Using isolation: posix/cpu,posix/mem,filesystem/posix,network/cni,environment_secret
W0607 13:00:18.509342  5992 backend.cpp:76] Failed to create 'aufs' backend: AufsBackend requires
root privileges
W0607 13:00:18.509452  5992 backend.cpp:76] Failed to create 'bind' backend: BindBackend requires
root privileges
I0607 13:00:18.509501  5992 provisioner.cpp:255] Using default backend 'copy'
I0607 13:00:18.512917 26633 slave.cpp:248] Mesos agent started on (763)@172.17.0.4:38880
I0607 13:00:18.513208 26633 slave.cpp:249] Flags at startup: --acls="" --appc_simple_discovery_uri_prefix="http://"
--appc_store_dir="/tmp/Endpoint_SlaveEndpointTest_UnauthorizedRequest_0_hOStIr/store/appc"
--authenticate_http_executors="true" --authenticate_http_readonly="true" --authenticate_http_readwrite="true"
--authenticatee="crammd5" --authentication_backoff_factor="1secs" --authorizer="local" --cgroups_cpu_enable_pids_and_tids_count="false"
--cgroups_enable_cfs="false" --cgroups_hierarchy="/sys/fs/cgroup" --cgroups_limit_swap="false"
--cgroups_root="mesos" --container_disk_watch_interval="15secs" --containerizers="mesos" --credential="/tmp/Endpoint_SlaveEndpointTest_UnauthorizedRequest_0_hOStIr/credential"
--default_role="*" --disk_watch_interval="1mins" --docker="docker" --docker_kill_orphans="true"
--docker_registry="https://registry-1.docker.io" --docker_remove_delay="6hrs" --docker_socket="/var/run/docker.sock"
--docker_stop_timeout="0ns" --docker_store_dir="/tmp/Endpoint_SlaveEndpointTest_UnauthorizedRequest_0_hOStIr/store/docker"
--docker_volume_checkpoint_dir="/var/run/mesos/isolators/docker/volume" --enforce_container_disk_quota="false"
--executor_registration_timeout="1mins" --executor_reregistration_timeout="2secs" --executor_secret_key="/tmp/Endpoint_SlaveEndpointTest_UnauthorizedRequest_0_hOStIr/executor_secret_key"
--executor_shutdown_grace_period="5secs" --fetcher_cache_dir="/tmp/Endpoint_SlaveEndpointTest_UnauthorizedRequest_0_hOStIr/fetch"
--fetcher_cache_size="2GB" --frameworks_home="" --gc_delay="1weeks" --gc_disk_headroom="0.1"
--hadoop_home="" --help="false" --hostname_lookup="true" --http_command_executor="false" --http_credentials="/tmp/Endpoint_SlaveEndpointTest_UnauthorizedRequest_0_hOStIr/http_credentials"
--http_heartbeat_interval="30secs" --initialize_driver_logging="true" --isolation="posix/cpu,posix/mem"
--launcher="posix" --launcher_dir="/mesos/mesos-1.4.0/_build/src" --logbufsecs="0" --logging_level="INFO"
--max_completed_executors_per_framework="150" --oversubscribed_resources_interval="15secs"
--perf_duration="10secs" --perf_interval="1mins" --port="5051" --qos_correction_interval_min="0ns"
--quiet="false" --recover="reconnect" --recovery_timeout="15mins" --registration_backoff_factor="10ms"
--resources="cpus:2;gpus:0;mem:1024;disk:1024;ports:[31000-32000]" --revocable_cpu_low_priority="true"
--runtime_dir="/tmp/Endpoint_SlaveEndpointTest_UnauthorizedRequest_0_hOStIr" --sandbox_directory="/mnt/mesos/sandbox"
--strict="true" --switch_user="true" --systemd_enable_support="true" --systemd_runtime_directory="/run/systemd/system"
--version="false" --work_dir="/tmp/Endpoint_SlaveEndpointTest_UnauthorizedRequest_0_yFdCQc"
I0607 13:00:18.513666 26633 credentials.hpp:86] Loading credential for authentication from
'/tmp/Endpoint_SlaveEndpointTest_UnauthorizedRequest_0_hOStIr/credential'
I0607 13:00:18.513955 26633 slave.cpp:281] Agent using credential for: test-principal
I0607 13:00:18.513981 26633 credentials.hpp:37] Loading credentials for authentication from
'/tmp/Endpoint_SlaveEndpointTest_UnauthorizedRequest_0_hOStIr/http_credentials'
I0607 13:00:18.514369 26633 http.cpp:975] Creating default 'basic' HTTP authenticator for
realm 'mesos-agent-executor'
I0607 13:00:18.514515 26633 http.cpp:996] Creating default 'jwt' HTTP authenticator for realm
'mesos-agent-executor'
I0607 13:00:18.514864 26633 http.cpp:975] Creating default 'basic' HTTP authenticator for
realm 'mesos-agent-readonly'
I0607 13:00:18.515136 26633 http.cpp:996] Creating default 'jwt' HTTP authenticator for realm
'mesos-agent-readonly'
I0607 13:00:18.515347 26633 http.cpp:975] Creating default 'basic' HTTP authenticator for
realm 'mesos-agent-readwrite'
I0607 13:00:18.515482 26633 http.cpp:996] Creating default 'jwt' HTTP authenticator for realm
'mesos-agent-readwrite'
I0607 13:00:18.516875 26633 slave.cpp:552] Agent resources: cpus(*):2; mem(*):1024; disk(*):1024;
ports(*):[31000-32000]
I0607 13:00:18.516952 26633 slave.cpp:560] Agent attributes: [  ]
I0607 13:00:18.516973 26633 slave.cpp:565] Agent hostname: 731b72888ad6
I0607 13:00:18.517151 26621 status_update_manager.cpp:177] Pausing sending status updates
I0607 13:00:18.518573 26635 state.cpp:62] Recovering state from '/tmp/Endpoint_SlaveEndpointTest_UnauthorizedRequest_0_yFdCQc/meta'
I0607 13:00:18.518847 26627 status_update_manager.cpp:203] Recovering status update manager
I0607 13:00:18.519080 26628 containerizer.cpp:582] Recovering containerizer
I0607 13:00:18.520570 26626 provisioner.cpp:416] Provisioner recovery complete
I0607 13:00:18.520874 26627 slave.cpp:6127] Finished recovery
I0607 13:00:18.521497 26627 slave.cpp:6309] Querying resource estimator for oversubscribable
resources
I0607 13:00:18.521781 26631 slave.cpp:6323] Received oversubscribable resources {} from the
resource estimator
I0607 13:00:18.524125 26627 process.cpp:3778] Handling HTTP event for process 'slave(763)'
with path: '/slave(763)/monitor/statistics'
I0607 13:00:18.525830 26625 http.cpp:1115] HTTP GET for /slave(763)/monitor/statistics from
172.17.0.4:37718
I0607 13:00:18.525909 26625 http.cpp:936] Authorizing principal 'test-principal' to GET the
'/monitor/statistics' endpoint
I0607 13:00:18.529531 26635 slave.cpp:817] Agent terminating
[       OK ] Endpoint/SlaveEndpointTest.UnauthorizedRequest/0 (32 ms)
[ RUN      ] Endpoint/SlaveEndpointTest.UnauthorizedRequest/1
I0607 13:00:18.540439  5992 containerizer.cpp:230] Using isolation: posix/cpu,posix/mem,filesystem/posix,network/cni,environment_secret
W0607 13:00:18.541105  5992 backend.cpp:76] Failed to create 'aufs' backend: AufsBackend requires
root privileges
W0607 13:00:18.541247  5992 backend.cpp:76] Failed to create 'bind' backend: BindBackend requires
root privileges
I0607 13:00:18.541296  5992 provisioner.cpp:255] Using default backend 'copy'
I0607 13:00:18.544782 26625 slave.cpp:248] Mesos agent started on (764)@172.17.0.4:38880
I0607 13:00:18.545037 26625 slave.cpp:249] Flags at startup: --acls="" --appc_simple_discovery_uri_prefix="http://"
--appc_store_dir="/tmp/Endpoint_SlaveEndpointTest_UnauthorizedRequest_1_QGo4rp/store/appc"
--authenticate_http_executors="true" --authenticate_http_readonly="true" --authenticate_http_readwrite="true"
--authenticatee="crammd5" --authentication_backoff_factor="1secs" --authorizer="local" --cgroups_cpu_enable_pids_and_tids_count="false"
--cgroups_enable_cfs="false" --cgroups_hierarchy="/sys/fs/cgroup" --cgroups_limit_swap="false"
--cgroups_root="mesos" --container_disk_watch_interval="15secs" --containerizers="mesos" --credential="/tmp/Endpoint_SlaveEndpointTest_UnauthorizedRequest_1_QGo4rp/credential"
--default_role="*" --disk_watch_interval="1mins" --docker="docker" --docker_kill_orphans="true"
--docker_registry="https://registry-1.docker.io" --docker_remove_delay="6hrs" --docker_socket="/var/run/docker.sock"
--docker_stop_timeout="0ns" --docker_store_dir="/tmp/Endpoint_SlaveEndpointTest_UnauthorizedRequest_1_QGo4rp/store/docker"
--docker_volume_checkpoint_dir="/var/run/mesos/isolators/docker/volume" --enforce_container_disk_quota="false"
--executor_registration_timeout="1mins" --executor_reregistration_timeout="2secs" --executor_secret_key="/tmp/Endpoint_SlaveEndpointTest_UnauthorizedRequest_1_QGo4rp/executor_secret_key"
--executor_shutdown_grace_period="5secs" --fetcher_cache_dir="/tmp/Endpoint_SlaveEndpointTest_UnauthorizedRequest_1_QGo4rp/fetch"
--fetcher_cache_size="2GB" --frameworks_home="" --gc_delay="1weeks" --gc_disk_headroom="0.1"
--hadoop_home="" --help="false" --hostname_lookup="true" --http_command_executor="false" --http_credentials="/tmp/Endpoint_SlaveEndpointTest_UnauthorizedRequest_1_QGo4rp/http_credentials"
--http_heartbeat_interval="30secs" --initialize_driver_logging="true" --isolation="posix/cpu,posix/mem"
--launcher="posix" --launcher_dir="/mesos/mesos-1.4.0/_build/src" --logbufsecs="0" --logging_level="INFO"
--max_completed_executors_per_framework="150" --oversubscribed_resources_interval="15secs"
--perf_duration="10secs" --perf_interval="1mins" --port="5051" --qos_correction_interval_min="0ns"
--quiet="false" --recover="reconnect" --recovery_timeout="15mins" --registration_backoff_factor="10ms"
--resources="cpus:2;gpus:0;mem:1024;disk:1024;ports:[31000-32000]" --revocable_cpu_low_priority="true"
--runtime_dir="/tmp/Endpoint_SlaveEndpointTest_UnauthorizedRequest_1_QGo4rp" --sandbox_directory="/mnt/mesos/sandbox"
--strict="true" --switch_user="true" --systemd_enable_support="true" --systemd_runtime_directory="/run/systemd/system"
--version="false" --work_dir="/tmp/Endpoint_SlaveEndpointTest_UnauthorizedRequest_1_TGUsva"
I0607 13:00:18.545485 26625 credentials.hpp:86] Loading credential for authentication from
'/tmp/Endpoint_SlaveEndpointTest_UnauthorizedRequest_1_QGo4rp/credential'
I0607 13:00:18.545722 26625 slave.cpp:281] Agent using credential for: test-principal
I0607 13:00:18.545748 26625 credentials.hpp:37] Loading credentials for authentication from
'/tmp/Endpoint_SlaveEndpointTest_UnauthorizedRequest_1_QGo4rp/http_credentials'
I0607 13:00:18.546051 26625 http.cpp:975] Creating default 'basic' HTTP authenticator for
realm 'mesos-agent-executor'
I0607 13:00:18.546212 26625 http.cpp:996] Creating default 'jwt' HTTP authenticator for realm
'mesos-agent-executor'
I0607 13:00:18.546450 26625 http.cpp:975] Creating default 'basic' HTTP authenticator for
realm 'mesos-agent-readonly'
I0607 13:00:18.546598 26625 http.cpp:996] Creating default 'jwt' HTTP authenticator for realm
'mesos-agent-readonly'
I0607 13:00:18.546844 26625 http.cpp:975] Creating default 'basic' HTTP authenticator for
realm 'mesos-agent-readwrite'
I0607 13:00:18.547189 26625 http.cpp:996] Creating default 'jwt' HTTP authenticator for realm
'mesos-agent-readwrite'
I0607 13:00:18.548614 26625 slave.cpp:552] Agent resources: cpus(*):2; mem(*):1024; disk(*):1024;
ports(*):[31000-32000]
I0607 13:00:18.548691 26625 slave.cpp:560] Agent attributes: [  ]
I0607 13:00:18.548713 26625 slave.cpp:565] Agent hostname: 731b72888ad6
I0607 13:00:18.548851 26624 status_update_manager.cpp:177] Pausing sending status updates
I0607 13:00:18.550432 26625 state.cpp:62] Recovering state from '/tmp/Endpoint_SlaveEndpointTest_UnauthorizedRequest_1_TGUsva/meta'
I0607 13:00:18.550724 26624 status_update_manager.cpp:203] Recovering status update manager
I0607 13:00:18.550895 26624 containerizer.cpp:582] Recovering containerizer
I0607 13:00:18.552330 26629 provisioner.cpp:416] Provisioner recovery complete
I0607 13:00:18.557476 26638 slave.cpp:6127] Finished recovery
I0607 13:00:18.558187 26638 slave.cpp:6309] Querying resource estimator for oversubscribable
resources
I0607 13:00:18.558538 26632 slave.cpp:6323] Received oversubscribable resources {} from the
resource estimator
I0607 13:00:18.561125 26637 process.cpp:3778] Handling HTTP event for process 'slave(764)'
with path: '/slave(764)/monitor/statistics.json'
I0607 13:00:18.562882 26637 http.cpp:1115] HTTP GET for /slave(764)/monitor/statistics.json
from 172.17.0.4:37720
I0607 13:00:18.562963 26637 http.cpp:936] Authorizing principal 'test-principal' to GET the
'/monitor/statistics.json' endpoint
I0607 13:00:18.565066 26631 slave.cpp:817] Agent terminating
[       OK ] Endpoint/SlaveEndpointTest.UnauthorizedRequest/1 (36 ms)
[ RUN      ] Endpoint/SlaveEndpointTest.UnauthorizedRequest/2
I0607 13:00:18.577816  5992 containerizer.cpp:230] Using isolation: posix/cpu,posix/mem,filesystem/posix,network/cni,environment_secret
W0607 13:00:18.578518  5992 backend.cpp:76] Failed to create 'aufs' backend: AufsBackend requires
root privileges
W0607 13:00:18.578647  5992 backend.cpp:76] Failed to create 'bind' backend: BindBackend requires
root privileges
I0607 13:00:18.578688  5992 provisioner.cpp:255] Using default backend 'copy'
I0607 13:00:18.582561 26630 slave.cpp:248] Mesos agent started on (765)@172.17.0.4:38880
I0607 13:00:18.582991 26630 slave.cpp:249] Flags at startup: --acls="" --appc_simple_discovery_uri_prefix="http://"
--appc_store_dir="/tmp/Endpoint_SlaveEndpointTest_UnauthorizedRequest_2_3aVtxn/store/appc"
--authenticate_http_executors="true" --authenticate_http_readonly="true" --authenticate_http_readwrite="true"
--authenticatee="crammd5" --authentication_backoff_factor="1secs" --authorizer="local" --cgroups_cpu_enable_pids_and_tids_count="false"
--cgroups_enable_cfs="false" --cgroups_hierarchy="/sys/fs/cgroup" --cgroups_limit_swap="false"
--cgroups_root="mesos" --container_disk_watch_interval="15secs" --containerizers="mesos" --credential="/tmp/Endpoint_SlaveEndpointTest_UnauthorizedRequest_2_3aVtxn/credential"
--default_role="*" --disk_watch_interval="1mins" --docker="docker" --docker_kill_orphans="true"
--docker_registry="https://registry-1.docker.io" --docker_remove_delay="6hrs" --docker_socket="/var/run/docker.sock"
--docker_stop_timeout="0ns" --docker_store_dir="/tmp/Endpoint_SlaveEndpointTest_UnauthorizedRequest_2_3aVtxn/store/docker"
--docker_volume_checkpoint_dir="/var/run/mesos/isolators/docker/volume" --enforce_container_disk_quota="false"
--executor_registration_timeout="1mins" --executor_reregistration_timeout="2secs" --executor_secret_key="/tmp/Endpoint_SlaveEndpointTest_UnauthorizedRequest_2_3aVtxn/executor_secret_key"
--executor_shutdown_grace_period="5secs" --fetcher_cache_dir="/tmp/Endpoint_SlaveEndpointTest_UnauthorizedRequest_2_3aVtxn/fetch"
--fetcher_cache_size="2GB" --frameworks_home="" --gc_delay="1weeks" --gc_disk_headroom="0.1"
--hadoop_home="" --help="false" --hostname_lookup="true" --http_command_executor="false" --http_credentials="/tmp/Endpoint_SlaveEndpointTest_UnauthorizedRequest_2_3aVtxn/http_credentials"
--http_heartbeat_interval="30secs" --initialize_driver_logging="true" --isolation="posix/cpu,posix/mem"
--launcher="posix" --launcher_dir="/mesos/mesos-1.4.0/_build/src" --logbufsecs="0" --logging_level="INFO"
--max_completed_executors_per_framework="150" --oversubscribed_resources_interval="15secs"
--perf_duration="10secs" --perf_interval="1mins" --port="5051" --qos_correction_interval_min="0ns"
--quiet="false" --recover="reconnect" --recovery_timeout="15mins" --registration_backoff_factor="10ms"
--resources="cpus:2;gpus:0;mem:1024;disk:1024;ports:[31000-32000]" --revocable_cpu_low_priority="true"
--runtime_dir="/tmp/Endpoint_SlaveEndpointTest_UnauthorizedRequest_2_3aVtxn" --sandbox_directory="/mnt/mesos/sandbox"
--strict="true" --switch_user="true" --systemd_enable_support="true" --systemd_runtime_directory="/run/systemd/system"
--version="false" --work_dir="/tmp/Endpoint_SlaveEndpointTest_UnauthorizedRequest_2_1lepv8"
I0607 13:00:18.583544 26630 credentials.hpp:86] Loading credential for authentication from
'/tmp/Endpoint_SlaveEndpointTest_UnauthorizedRequest_2_3aVtxn/credential'
I0607 13:00:18.583789 26630 slave.cpp:281] Agent using credential for: test-principal
I0607 13:00:18.583815 26630 credentials.hpp:37] Loading credentials for authentication from
'/tmp/Endpoint_SlaveEndpointTest_UnauthorizedRequest_2_3aVtxn/http_credentials'
I0607 13:00:18.584123 26630 http.cpp:975] Creating default 'basic' HTTP authenticator for
realm 'mesos-agent-executor'
I0607 13:00:18.584267 26630 http.cpp:996] Creating default 'jwt' HTTP authenticator for realm
'mesos-agent-executor'
I0607 13:00:18.584511 26630 http.cpp:975] Creating default 'basic' HTTP authenticator for
realm 'mesos-agent-readonly'
I0607 13:00:18.584625 26630 http.cpp:996] Creating default 'jwt' HTTP authenticator for realm
'mesos-agent-readonly'
I0607 13:00:18.585031 26630 http.cpp:975] Creating default 'basic' HTTP authenticator for
realm 'mesos-agent-readwrite'
I0607 13:00:18.585316 26630 http.cpp:996] Creating default 'jwt' HTTP authenticator for realm
'mesos-agent-readwrite'
I0607 13:00:18.586949 26630 slave.cpp:552] Agent resources: cpus(*):2; mem(*):1024; disk(*):1024;
ports(*):[31000-32000]
I0607 13:00:18.587047 26630 slave.cpp:560] Agent attributes: [  ]
I0607 13:00:18.587064 26630 slave.cpp:565] Agent hostname: 731b72888ad6
I0607 13:00:18.587221 26624 status_update_manager.cpp:177] Pausing sending status updates
I0607 13:00:18.588795 26618 state.cpp:62] Recovering state from '/tmp/Endpoint_SlaveEndpointTest_UnauthorizedRequest_2_1lepv8/meta'
I0607 13:00:18.589272 26619 status_update_manager.cpp:203] Recovering status update manager
I0607 13:00:18.589555 26630 containerizer.cpp:582] Recovering containerizer
I0607 13:00:18.591439 26637 provisioner.cpp:416] Provisioner recovery complete
I0607 13:00:18.591950 26633 slave.cpp:6127] Finished recovery
I0607 13:00:18.592720 26633 slave.cpp:6309] Querying resource estimator for oversubscribable
resources
I0607 13:00:18.593029 26619 slave.cpp:6323] Received oversubscribable resources {} from the
resource estimator
I0607 13:00:18.595546 26617 process.cpp:3778] Handling HTTP event for process 'slave(765)'
with path: '/slave(765)/containers'
I0607 13:00:18.597782 26634 http.cpp:1115] HTTP GET for /slave(765)/containers from 172.17.0.4:37724
I0607 13:00:18.597877 26634 http.cpp:936] Authorizing principal 'test-principal' to GET the
'/containers' endpoint
I0607 13:00:18.600086 26631 slave.cpp:817] Agent terminating
[       OK ] Endpoint/SlaveEndpointTest.UnauthorizedRequest/2 (33 ms)
[ RUN      ] Endpoint/SlaveEndpointTest.NoAuthorizer/0
I0607 13:00:18.611555  5992 containerizer.cpp:230] Using isolation: posix/cpu,posix/mem,filesystem/posix,network/cni,environment_secret
W0607 13:00:18.612139  5992 backend.cpp:76] Failed to create 'aufs' backend: AufsBackend requires
root privileges
W0607 13:00:18.612269  5992 backend.cpp:76] Failed to create 'bind' backend: BindBackend requires
root privileges
I0607 13:00:18.612319  5992 provisioner.cpp:255] Using default backend 'copy'
I0607 13:00:18.614190  5992 cluster.cpp:448] Creating default 'local' authorizer
I0607 13:00:18.615725 26628 slave.cpp:248] Mesos agent started on (766)@172.17.0.4:38880
I0607 13:00:18.615768 26628 slave.cpp:249] Flags at startup: --acls="" --appc_simple_discovery_uri_prefix="http://"
--appc_store_dir="/tmp/Endpoint_SlaveEndpointTest_NoAuthorizer_0_RusdXl/store/appc" --authenticate_http_executors="true"
--authenticate_http_readonly="true" --authenticate_http_readwrite="true" --authenticatee="crammd5"
--authentication_backoff_factor="1secs" --authorizer="local" --cgroups_cpu_enable_pids_and_tids_count="false"
--cgroups_enable_cfs="false" --cgroups_hierarchy="/sys/fs/cgroup" --cgroups_limit_swap="false"
--cgroups_root="mesos" --container_disk_watch_interval="15secs" --containerizers="mesos" --credential="/tmp/Endpoint_SlaveEndpointTest_NoAuthorizer_0_RusdXl/credential"
--default_role="*" --disk_watch_interval="1mins" --docker="docker" --docker_kill_orphans="true"
--docker_registry="https://registry-1.docker.io" --docker_remove_delay="6hrs" --docker_socket="/var/run/docker.sock"
--docker_stop_timeout="0ns" --docker_store_dir="/tmp/Endpoint_SlaveEndpointTest_NoAuthorizer_0_RusdXl/store/docker"
--docker_volume_checkpoint_dir="/var/run/mesos/isolators/docker/volume" --enforce_container_disk_quota="false"
--executor_registration_timeout="1mins" --executor_reregistration_timeout="2secs" --executor_secret_key="/tmp/Endpoint_SlaveEndpointTest_NoAuthorizer_0_RusdXl/executor_secret_key"
--executor_shutdown_grace_period="5secs" --fetcher_cache_dir="/tmp/Endpoint_SlaveEndpointTest_NoAuthorizer_0_RusdXl/fetch"
--fetcher_cache_size="2GB" --frameworks_home="" --gc_delay="1weeks" --gc_disk_headroom="0.1"
--hadoop_home="" --help="false" --hostname_lookup="true" --http_command_executor="false" --http_credentials="/tmp/Endpoint_SlaveEndpointTest_NoAuthorizer_0_RusdXl/http_credentials"
--http_heartbeat_interval="30secs" --initialize_driver_logging="true" --isolation="posix/cpu,posix/mem"
--launcher="posix" --launcher_dir="/mesos/mesos-1.4.0/_build/src" --logbufsecs="0" --logging_level="INFO"
--max_completed_executors_per_framework="150" --oversubscribed_resources_interval="15secs"
--perf_duration="10secs" --perf_interval="1mins" --port="5051" --qos_correction_interval_min="0ns"
--quiet="false" --recover="reconnect" --recovery_timeout="15mins" --registration_backoff_factor="10ms"
--resources="cpus:2;gpus:0;mem:1024;disk:1024;ports:[31000-32000]" --revocable_cpu_low_priority="true"
--runtime_dir="/tmp/Endpoint_SlaveEndpointTest_NoAuthorizer_0_RusdXl" --sandbox_directory="/mnt/mesos/sandbox"
--strict="true" --switch_user="true" --systemd_enable_support="true" --systemd_runtime_directory="/run/systemd/system"
--version="false" --work_dir="/tmp/Endpoint_SlaveEndpointTest_NoAuthorizer_0_4At6P6"
I0607 13:00:18.616240 26628 credentials.hpp:86] Loading credential for authentication from
'/tmp/Endpoint_SlaveEndpointTest_NoAuthorizer_0_RusdXl/credential'
I0607 13:00:18.616464 26628 slave.cpp:281] Agent using credential for: test-principal
I0607 13:00:18.616488 26628 credentials.hpp:37] Loading credentials for authentication from
'/tmp/Endpoint_SlaveEndpointTest_NoAuthorizer_0_RusdXl/http_credentials'
I0607 13:00:18.616802 26628 http.cpp:975] Creating default 'basic' HTTP authenticator for
realm 'mesos-agent-executor'
I0607 13:00:18.616932 26628 http.cpp:996] Creating default 'jwt' HTTP authenticator for realm
'mesos-agent-executor'
I0607 13:00:18.617172 26628 http.cpp:975] Creating default 'basic' HTTP authenticator for
realm 'mesos-agent-readonly'
I0607 13:00:18.617266 26628 http.cpp:996] Creating default 'jwt' HTTP authenticator for realm
'mesos-agent-readonly'
I0607 13:00:18.617483 26628 http.cpp:975] Creating default 'basic' HTTP authenticator for
realm 'mesos-agent-readwrite'
I0607 13:00:18.617611 26628 http.cpp:996] Creating default 'jwt' HTTP authenticator for realm
'mesos-agent-readwrite'
I0607 13:00:18.618964 26628 slave.cpp:552] Agent resources: cpus(*):2; mem(*):1024; disk(*):1024;
ports(*):[31000-32000]
I0607 13:00:18.619040 26628 slave.cpp:560] Agent attributes: [  ]
I0607 13:00:18.619062 26628 slave.cpp:565] Agent hostname: 731b72888ad6
I0607 13:00:18.619242 26620 status_update_manager.cpp:177] Pausing sending status updates
I0607 13:00:18.620726 26639 state.cpp:62] Recovering state from '/tmp/Endpoint_SlaveEndpointTest_NoAuthorizer_0_4At6P6/meta'
I0607 13:00:18.621026 26618 status_update_manager.cpp:203] Recovering status update manager
I0607 13:00:18.621237 26633 containerizer.cpp:582] Recovering containerizer
I0607 13:00:18.622802 26628 provisioner.cpp:416] Provisioner recovery complete
I0607 13:00:18.623289 26621 slave.cpp:6127] Finished recovery
I0607 13:00:18.623950 26621 slave.cpp:6309] Querying resource estimator for oversubscribable
resources
I0607 13:00:18.624335 26619 slave.cpp:6323] Received oversubscribable resources {} from the
resource estimator
I0607 13:00:18.626907 26635 process.cpp:3778] Handling HTTP event for process 'slave(766)'
with path: '/slave(766)/monitor/statistics'
I0607 13:00:18.628686 26631 http.cpp:1115] HTTP GET for /slave(766)/monitor/statistics from
172.17.0.4:37728
I0607 13:00:18.628768 26631 http.cpp:936] Authorizing principal 'test-principal' to GET the
'/monitor/statistics' endpoint
I0607 13:00:18.632997 26633 slave.cpp:817] Agent terminating
[       OK ] Endpoint/SlaveEndpointTest.NoAuthorizer/0 (32 ms)
[ RUN      ] Endpoint/SlaveEndpointTest.NoAuthorizer/1
I0607 13:00:18.643509  5992 containerizer.cpp:230] Using isolation: posix/cpu,posix/mem,filesystem/posix,network/cni,environment_secret
W0607 13:00:18.643972  5992 backend.cpp:76] Failed to create 'aufs' backend: AufsBackend requires
root privileges
W0607 13:00:18.644075  5992 backend.cpp:76] Failed to create 'bind' backend: BindBackend requires
root privileges
I0607 13:00:18.644110  5992 provisioner.cpp:255] Using default backend 'copy'
I0607 13:00:18.645696  5992 cluster.cpp:448] Creating default 'local' authorizer
I0607 13:00:18.647056 26640 slave.cpp:248] Mesos agent started on (767)@172.17.0.4:38880
I0607 13:00:18.647101 26640 slave.cpp:249] Flags at startup: --acls="" --appc_simple_discovery_uri_prefix="http://"
--appc_store_dir="/tmp/Endpoint_SlaveEndpointTest_NoAuthorizer_1_ykP6Fk/store/appc" --authenticate_http_executors="true"
--authenticate_http_readonly="true" --authenticate_http_readwrite="true" --authenticatee="crammd5"
--authentication_backoff_factor="1secs" --authorizer="local" --cgroups_cpu_enable_pids_and_tids_count="false"
--cgroups_enable_cfs="false" --cgroups_hierarchy="/sys/fs/cgroup" --cgroups_limit_swap="false"
--cgroups_root="mesos" --container_disk_watch_interval="15secs" --containerizers="mesos" --credential="/tmp/Endpoint_SlaveEndpointTest_NoAuthorizer_1_ykP6Fk/credential"
--default_role="*" --disk_watch_interval="1mins" --docker="docker" --docker_kill_orphans="true"
--docker_registry="https://registry-1.docker.io" --docker_remove_delay="6hrs" --docker_socket="/var/run/docker.sock"
--docker_stop_timeout="0ns" --docker_store_dir="/tmp/Endpoint_SlaveEndpointTest_NoAuthorizer_1_ykP6Fk/store/docker"
--docker_volume_checkpoint_dir="/var/run/mesos/isolators/docker/volume" --enforce_container_disk_quota="false"
--executor_registration_timeout="1mins" --executor_reregistration_timeout="2secs" --executor_secret_key="/tmp/Endpoint_SlaveEndpointTest_NoAuthorizer_1_ykP6Fk/executor_secret_key"
--executor_shutdown_grace_period="5secs" --fetcher_cache_dir="/tmp/Endpoint_SlaveEndpointTest_NoAuthorizer_1_ykP6Fk/fetch"
--fetcher_cache_size="2GB" --frameworks_home="" --gc_delay="1weeks" --gc_disk_headroom="0.1"
--hadoop_home="" --help="false" --hostname_lookup="true" --http_command_executor="false" --http_credentials="/tmp/Endpoint_SlaveEndpointTest_NoAuthorizer_1_ykP6Fk/http_credentials"
--http_heartbeat_interval="30secs" --initialize_driver_logging="true" --isolation="posix/cpu,posix/mem"
--launcher="posix" --launcher_dir="/mesos/mesos-1.4.0/_build/src" --logbufsecs="0" --logging_level="INFO"
--max_completed_executors_per_framework="150" --oversubscribed_resources_interval="15secs"
--perf_duration="10secs" --perf_interval="1mins" --port="5051" --qos_correction_interval_min="0ns"
--quiet="false" --recover="reconnect" --recovery_timeout="15mins" --registration_backoff_factor="10ms"
--resources="cpus:2;gpus:0;mem:1024;disk:1024;ports:[31000-32000]" --revocable_cpu_low_priority="true"
--runtime_dir="/tmp/Endpoint_SlaveEndpointTest_NoAuthorizer_1_ykP6Fk" --sandbox_directory="/mnt/mesos/sandbox"
--strict="true" --switch_user="true" --systemd_enable_support="true" --systemd_runtime_directory="/run/systemd/system"
--version="false" --work_dir="/tmp/Endpoint_SlaveEndpointTest_NoAuthorizer_1_CRCau5"
I0607 13:00:18.647436 26640 credentials.hpp:86] Loading credential for authentication from
'/tmp/Endpoint_SlaveEndpointTest_NoAuthorizer_1_ykP6Fk/credential'
I0607 13:00:18.647591 26640 slave.cpp:281] Agent using credential for: test-principal
I0607 13:00:18.647611 26640 credentials.hpp:37] Loading credentials for authentication from
'/tmp/Endpoint_SlaveEndpointTest_NoAuthorizer_1_ykP6Fk/http_credentials'
I0607 13:00:18.647850 26640 http.cpp:975] Creating default 'basic' HTTP authenticator for
realm 'mesos-agent-executor'
I0607 13:00:18.647951 26640 http.cpp:996] Creating default 'jwt' HTTP authenticator for realm
'mesos-agent-executor'
I0607 13:00:18.648200 26640 http.cpp:975] Creating default 'basic' HTTP authenticator for
realm 'mesos-agent-readonly'
I0607 13:00:18.648294 26640 http.cpp:996] Creating default 'jwt' HTTP authenticator for realm
'mesos-agent-readonly'
I0607 13:00:18.648468 26640 http.cpp:975] Creating default 'basic' HTTP authenticator for
realm 'mesos-agent-readwrite'
I0607 13:00:18.648548 26640 http.cpp:996] Creating default 'jwt' HTTP authenticator for realm
'mesos-agent-readwrite'
I0607 13:00:18.649874 26640 slave.cpp:552] Agent resources: cpus(*):2; mem(*):1024; disk(*):1024;
ports(*):[31000-32000]
I0607 13:00:18.649945 26640 slave.cpp:560] Agent attributes: [  ]
I0607 13:00:18.649966 26640 slave.cpp:565] Agent hostname: 731b72888ad6
I0607 13:00:18.650104 26623 status_update_manager.cpp:177] Pausing sending status updates
I0607 13:00:18.651278 26632 state.cpp:62] Recovering state from '/tmp/Endpoint_SlaveEndpointTest_NoAuthorizer_1_CRCau5/meta'
I0607 13:00:18.651674 26625 status_update_manager.cpp:203] Recovering status update manager
I0607 13:00:18.651891 26640 containerizer.cpp:582] Recovering containerizer
I0607 13:00:18.653298 26623 provisioner.cpp:416] Provisioner recovery complete
I0607 13:00:18.653741 26618 slave.cpp:6127] Finished recovery
I0607 13:00:18.654232 26618 slave.cpp:6309] Querying resource estimator for oversubscribable
resources
I0607 13:00:18.654520 26633 slave.cpp:6323] Received oversubscribable resources {} from the
resource estimator
I0607 13:00:18.656394 26625 process.cpp:3778] Handling HTTP event for process 'slave(767)'
with path: '/slave(767)/monitor/statistics.json'
I0607 13:00:18.657840 26627 http.cpp:1115] HTTP GET for /slave(767)/monitor/statistics.json
from 172.17.0.4:37730
I0607 13:00:18.657907 26627 http.cpp:936] Authorizing principal 'test-principal' to GET the
'/monitor/statistics.json' endpoint
I0607 13:00:18.660439 26620 slave.cpp:817] Agent terminating
[       OK ] Endpoint/SlaveEndpointTest.NoAuthorizer/1 (31 ms)
[ RUN      ] Endpoint/SlaveEndpointTest.NoAuthorizer/2
I0607 13:00:18.675079  5992 containerizer.cpp:230] Using isolation: posix/cpu,posix/mem,filesystem/posix,network/cni,environment_secret
W0607 13:00:18.675571  5992 backend.cpp:76] Failed to create 'aufs' backend: AufsBackend requires
root privileges
W0607 13:00:18.675676  5992 backend.cpp:76] Failed to create 'bind' backend: BindBackend requires
root privileges
I0607 13:00:18.675710  5992 provisioner.cpp:255] Using default backend 'copy'
I0607 13:00:18.677471  5992 cluster.cpp:448] Creating default 'local' authorizer
I0607 13:00:18.679044 26634 slave.cpp:248] Mesos agent started on (768)@172.17.0.4:38880
I0607 13:00:18.679086 26634 slave.cpp:249] Flags at startup: --acls="" --appc_simple_discovery_uri_prefix="http://"
--appc_store_dir="/tmp/Endpoint_SlaveEndpointTest_NoAuthorizer_2_KEVzHj/store/appc" --authenticate_http_executors="true"
--authenticate_http_readonly="true" --authenticate_http_readwrite="true" --authenticatee="crammd5"
--authentication_backoff_factor="1secs" --authorizer="local" --cgroups_cpu_enable_pids_and_tids_count="false"
--cgroups_enable_cfs="false" --cgroups_hierarchy="/sys/fs/cgroup" --cgroups_limit_swap="false"
--cgroups_root="mesos" --container_disk_watch_interval="15secs" --containerizers="mesos" --credential="/tmp/Endpoint_SlaveEndpointTest_NoAuthorizer_2_KEVzHj/credential"
--default_role="*" --disk_watch_interval="1mins" --docker="docker" --docker_kill_orphans="true"
--docker_registry="https://registry-1.docker.io" --docker_remove_delay="6hrs" --docker_socket="/var/run/docker.sock"
--docker_stop_timeout="0ns" --docker_store_dir="/tmp/Endpoint_SlaveEndpointTest_NoAuthorizer_2_KEVzHj/store/docker"
--docker_volume_checkpoint_dir="/var/run/mesos/isolators/docker/volume" --enforce_container_disk_quota="false"
--executor_registration_timeout="1mins" --executor_reregistration_timeout="2secs" --executor_secret_key="/tmp/Endpoint_SlaveEndpointTest_NoAuthorizer_2_KEVzHj/executor_secret_key"
--executor_shutdown_grace_period="5secs" --fetcher_cache_dir="/tmp/Endpoint_SlaveEndpointTest_NoAuthorizer_2_KEVzHj/fetch"
--fetcher_cache_size="2GB" --frameworks_home="" --gc_delay="1weeks" --gc_disk_headroom="0.1"
--hadoop_home="" --help="false" --hostname_lookup="true" --http_command_executor="false" --http_credentials="/tmp/Endpoint_SlaveEndpointTest_NoAuthorizer_2_KEVzHj/http_credentials"
--http_heartbeat_interval="30secs" --initialize_driver_logging="true" --isolation="posix/cpu,posix/mem"
--launcher="posix" --launcher_dir="/mesos/mesos-1.4.0/_build/src" --logbufsecs="0" --logging_level="INFO"
--max_completed_executors_per_framework="150" --oversubscribed_resources_interval="15secs"
--perf_duration="10secs" --perf_interval="1mins" --port="5051" --qos_correction_interval_min="0ns"
--quiet="false" --recover="reconnect" --recovery_timeout="15mins" --registration_backoff_factor="10ms"
--resources="cpus:2;gpus:0;mem:1024;disk:1024;ports:[31000-32000]" --revocable_cpu_low_priority="true"
--runtime_dir="/tmp/Endpoint_SlaveEndpointTest_NoAuthorizer_2_KEVzHj" --sandbox_directory="/mnt/mesos/sandbox"
--strict="true" --switch_user="true" --systemd_enable_support="true" --systemd_runtime_directory="/run/systemd/system"
--version="false" --work_dir="/tmp/Endpoint_SlaveEndpointTest_NoAuthorizer_2_P41Wq4"
I0607 13:00:18.679523 26634 credentials.hpp:86] Loading credential for authentication from
'/tmp/Endpoint_SlaveEndpointTest_NoAuthorizer_2_KEVzHj/credential'
I0607 13:00:18.679702 26634 slave.cpp:281] Agent using credential for: test-principal
I0607 13:00:18.679721 26634 credentials.hpp:37] Loading credentials for authentication from
'/tmp/Endpoint_SlaveEndpointTest_NoAuthorizer_2_KEVzHj/http_credentials'
I0607 13:00:18.679997 26634 http.cpp:975] Creating default 'basic' HTTP authenticator for
realm 'mesos-agent-executor'
I0607 13:00:18.680137 26634 http.cpp:996] Creating default 'jwt' HTTP authenticator for realm
'mesos-agent-executor'
I0607 13:00:18.680407 26634 http.cpp:975] Creating default 'basic' HTTP authenticator for
realm 'mesos-agent-readonly'
I0607 13:00:18.680508 26634 http.cpp:996] Creating default 'jwt' HTTP authenticator for realm
'mesos-agent-readonly'
I0607 13:00:18.680683 26634 http.cpp:975] Creating default 'basic' HTTP authenticator for
realm 'mesos-agent-readwrite'
I0607 13:00:18.680887 26634 http.cpp:996] Creating default 'jwt' HTTP authenticator for realm
'mesos-agent-readwrite'
I0607 13:00:18.682350 26634 slave.cpp:552] Agent resources: cpus(*):2; mem(*):1024; disk(*):1024;
ports(*):[31000-32000]
I0607 13:00:18.682417 26634 slave.cpp:560] Agent attributes: [  ]
I0607 13:00:18.682430 26634 slave.cpp:565] Agent hostname: 731b72888ad6
I0607 13:00:18.682552 26623 status_update_manager.cpp:177] Pausing sending status updates
I0607 13:00:18.684088 26636 state.cpp:62] Recovering state from '/tmp/Endpoint_SlaveEndpointTest_NoAuthorizer_2_P41Wq4/meta'
I0607 13:00:18.684545 26627 status_update_manager.cpp:203] Recovering status update manager
I0607 13:00:18.684729 26625 containerizer.cpp:582] Recovering containerizer
I0607 13:00:18.685880 26624 provisioner.cpp:416] Provisioner recovery complete
I0607 13:00:18.686312 26640 slave.cpp:6127] Finished recovery
I0607 13:00:18.686727 26640 slave.cpp:6309] Querying resource estimator for oversubscribable
resources
I0607 13:00:18.686935 26627 slave.cpp:6323] Received oversubscribable resources {} from the
resource estimator
I0607 13:00:18.688313 26638 process.cpp:3778] Handling HTTP event for process 'slave(768)'
with path: '/slave(768)/containers'
I0607 13:00:18.690284 26622 http.cpp:1115] HTTP GET for /slave(768)/containers from 172.17.0.4:37734
I0607 13:00:18.690408 26622 http.cpp:936] Authorizing principal 'test-principal' to GET the
'/containers' endpoint
I0607 13:00:18.705554  5992 slave.cpp:817] Agent terminating
[       OK ] Endpoint/SlaveEndpointTest.NoAuthorizer/2 (46 ms)
[----------] 9 tests from Endpoint/SlaveEndpointTest (316 ms total)

[----------] Global test environment tear-down
[==========] 1596 tests from 178 test cases ran. (532596 ms total)
[  PASSED  ] 1595 tests.
[  FAILED  ] 1 test, listed below:
[  FAILED  ] MasterTest.IgnoreOldAgentReregistration

 1 FAILED TEST
  YOU HAVE 22 DISABLED TESTS

E0607 13:00:18.787227 26641 process.cpp:968] Failed to accept socket: future discarded
make[4]: *** [check-local] Error 1
make[4]: Leaving directory `/mesos/mesos-1.4.0/_build/src'
make[3]: *** [check-am] Error 2
make[3]: Leaving directory `/mesos/mesos-1.4.0/_build/src'
make[2]: *** [check] Error 2
make[2]: Leaving directory `/mesos/mesos-1.4.0/_build/src'
make[1]: *** [check-recursive] Error 1
make[1]: Leaving directory `/mesos/mesos-1.4.0/_build'
make: *** [distcheck] Error 1
+ docker rmi mesos-1496837244-9780
Untagged: mesos-1496837244-9780:latest
Deleted: sha256:154e318705246d742b2ef6fffb55558318af2c50faed2be3c5eab2c18712bc95
Deleted: sha256:d5e6593deb38cdad09b3ff79ec625faf30f5dab10e225858af347606afbb33b9
Deleted: sha256:b5b859e3940312f0f81753796bee61bca896711697422836cdad9a99329010d7
Deleted: sha256:cf3668e7fb692326f24c3fb76982f05afc8cffb171c4ccdc9cf4eac1b3872bc4
Deleted: sha256:21bd43723f2bb6540ebf31a68a2b89760cf01f34ac17068998567f82e056c698
Deleted: sha256:d8fcdbfc25bd52cb8365b6de0d9286f8806444a71e8b2497cf493a2c777fd28a
Deleted: sha256:0dcba751e66b57bb834ad043a6b3dcb6a780f59fcbe32c1e672ef7c9cfb6128c
Deleted: sha256:990e51f9ebb82e61f12b250dbe6d3a1e191a9e94dc5824245dc58f172af11503
Deleted: sha256:0582673df34ac740f7d56a070641377aae4612df13f410356161c85732a6bda3
Deleted: sha256:35a94b923aa330b46271b27e9b645e1dad3aa68218228722cb3ca86e097a030f
Deleted: sha256:1732457d976fa57a83f96380eaea62cffbf4015ed124fa3f64a288d0ba1179d6
Deleted: sha256:8148e14dcbc6ea4c8f95fa456d044bfa354c423ef8c9f47b72e70100f35edca6
Deleted: sha256:6d4df8001f3f9f7055a6b84f0165eeaa67881555942ac7eff02c2c8158a3752b
Deleted: sha256:8d76b97771cd393bcafa82d18fd09173e232e40bd8a62fd32c3f98aa4f2d13e8
Deleted: sha256:36869de04a8653fb678f16d12980d2294aa4d4f65586fbdcdc7d99d67aee116a
Deleted: sha256:4134a5827b413a79732da03c8230486b497c94dc410394b86cafb49846f42d4a
Deleted: sha256:bb622d92ee655fab06bcbb3cf9fc1d06fc46c9c99e2e5e726846286c7c7f7dd6
Deleted: sha256:ebdc6096630199d94b3ebd641b267fe13be3feac1c80994804cf242d7cecaf7d
Deleted: sha256:cb99167c9b5b7666df270159832456caf386175ad58703db9d4a5ad11de2124f
Deleted: sha256:a14173ef5ba98a6b945bf4e59948a10d905935b36dd917252923b6ded5cda746
Deleted: sha256:9babad3f974ebff36047e8c54e4af44e29c842b9814d72a91480174cfe823028
Deleted: sha256:593ea384e64a251df1d13efae9b7ec06aa9b867c2e106f571c83905bd6b3b869
Deleted: sha256:9c7b058c63d6db84ec8b98e0a429988c25dace57c80a83b502313d06d682ad16
Deleted: sha256:5665ca48a9e37b0965e858e5256735b85f293afdcdf9b2151934a61341d746aa
Build step 'Execute shell' marked build as failure

Mime
View raw message