mesos-builds mailing list archives

Site index · List index
Message view « Date » · « Thread »
Top « Date » · « Thread »
From Apache Jenkins Server <jenk...@builds.apache.org>
Subject Build failed in Jenkins: Mesos-Buildbot » autotools,gcc,--verbose,GLOG_v=1 MESOS_VERBOSE=1,ubuntu:14.04,(ubuntu)&&(!ubuntu-us1)&&(!ubuntu-eu2) #3758
Date Fri, 02 Jun 2017 05:18:30 GMT
See <https://builds.apache.org/job/Mesos-Buildbot/BUILDTOOL=autotools,COMPILER=gcc,CONFIGURATION=--verbose,ENVIRONMENT=GLOG_v=1%20MESOS_VERBOSE=1,OS=ubuntu%3A14.04,label_exp=(ubuntu)&&(!ubuntu-us1)&&(!ubuntu-eu2)/3758/display/redirect?page=changes>

Changes:

[vinodkone] Added test for agent ping timeout during agent recovery.

[vinodkone] Added a test to verify the agent flag 'executor_reregistration_timeout'.

[vinodkone] Added a test to verify executor driver message dropping behavior.

[neil.conway] Replaced "!(x == y)" with "x != y" when comparing ExecutorInfos.

[bmahler] Removed 'DO NOT USE' and 'EXPERIMENTAL' comments for multi-role support.

[bmahler] Added parallel test runner to distribution.

[neil.conway] Clarified docs for multi-role frameworks and offers.

[xujyan] Show the resources in the allocator CHECK.

[josephwu] Windows: Disabled SlaveTest.ExecutorReregistrationTimeoutFlag.

[xujyan] Fixed a typo caused compilation error.

------------------------------------------
[...truncated 27.94 MB...]
W0602 05:18:10.956300  4430 backend.cpp:76] Failed to create 'bind' backend: BindBackend requires
root privileges
I0602 05:18:10.956341  4430 provisioner.cpp:255] Using default backend 'copy'
I0602 05:18:10.960157  4451 slave.cpp:248] Mesos agent started on (754)@172.17.0.3:40462
I0602 05:18:10.960453  4451 slave.cpp:249] Flags at startup: --acls="" --appc_simple_discovery_uri_prefix="http://"
--appc_store_dir="/tmp/Endpoint_SlaveEndpointTest_AuthorizedRequest_2_2ckCsW/store/appc" --authenticate_http_readonly="true"
--authenticate_http_readwrite="true" --authenticatee="crammd5" --authentication_backoff_factor="1secs"
--authorizer="local" --cgroups_cpu_enable_pids_and_tids_count="false" --cgroups_enable_cfs="false"
--cgroups_hierarchy="/sys/fs/cgroup" --cgroups_limit_swap="false" --cgroups_root="mesos" --container_disk_watch_interval="15secs"
--containerizers="mesos" --credential="/tmp/Endpoint_SlaveEndpointTest_AuthorizedRequest_2_2ckCsW/credential"
--default_role="*" --disk_watch_interval="1mins" --docker="docker" --docker_kill_orphans="true"
--docker_registry="https://registry-1.docker.io" --docker_remove_delay="6hrs" --docker_socket="/var/run/docker.sock"
--docker_stop_timeout="0ns" --docker_store_dir="/tmp/Endpoint_SlaveEndpointTest_AuthorizedRequest_2_2ckCsW/store/docker"
--docker_volume_checkpoint_dir="/var/run/mesos/isolators/docker/volume" --enforce_container_disk_quota="false"
--executor_registration_timeout="1mins" --executor_reregistration_timeout="2secs" --executor_shutdown_grace_period="5secs"
--fetcher_cache_dir="/tmp/Endpoint_SlaveEndpointTest_AuthorizedRequest_2_2ckCsW/fetch" --fetcher_cache_size="2GB"
--frameworks_home="" --gc_delay="1weeks" --gc_disk_headroom="0.1" --hadoop_home="" --help="false"
--hostname_lookup="true" --http_command_executor="false" --http_credentials="/tmp/Endpoint_SlaveEndpointTest_AuthorizedRequest_2_2ckCsW/http_credentials"
--http_heartbeat_interval="30secs" --initialize_driver_logging="true" --isolation="posix/cpu,posix/mem"
--launcher="posix" --launcher_dir="/mesos/mesos-1.4.0/_build/src" --logbufsecs="0" --logging_level="INFO"
--max_completed_executors_per_framework="150" --oversubscribed_resources_interval="15secs"
--perf_duration="10secs" --perf_interval="1mins" --port="5051" --qos_correction_interval_min="0ns"
--quiet="false" --recover="reconnect" --recovery_timeout="15mins" --registration_backoff_factor="10ms"
--resources="cpus:2;gpus:0;mem:1024;disk:1024;ports:[31000-32000]" --revocable_cpu_low_priority="true"
--runtime_dir="/tmp/Endpoint_SlaveEndpointTest_AuthorizedRequest_2_2ckCsW" --sandbox_directory="/mnt/mesos/sandbox"
--strict="true" --switch_user="true" --systemd_enable_support="true" --systemd_runtime_directory="/run/systemd/system"
--version="false" --work_dir="/tmp/Endpoint_SlaveEndpointTest_AuthorizedRequest_2_XYBOok"
I0602 05:18:10.961613  4451 credentials.hpp:86] Loading credential for authentication from
'/tmp/Endpoint_SlaveEndpointTest_AuthorizedRequest_2_2ckCsW/credential'
I0602 05:18:10.962811  4451 slave.cpp:281] Agent using credential for: test-principal
I0602 05:18:10.963178  4451 credentials.hpp:37] Loading credentials for authentication from
'/tmp/Endpoint_SlaveEndpointTest_AuthorizedRequest_2_2ckCsW/http_credentials'
I0602 05:18:10.963819  4451 http.cpp:975] Creating default 'basic' HTTP authenticator for
realm 'mesos-agent-readonly'
I0602 05:18:10.964298  4451 http.cpp:975] Creating default 'basic' HTTP authenticator for
realm 'mesos-agent-readwrite'
I0602 05:18:10.966792  4451 slave.cpp:552] Agent resources: cpus(*):2; mem(*):1024; disk(*):1024;
ports(*):[31000-32000]
I0602 05:18:10.967156  4451 slave.cpp:560] Agent attributes: [  ]
I0602 05:18:10.967712  4451 slave.cpp:565] Agent hostname: 957d1c1c0e0e
I0602 05:18:10.968302  4456 status_update_manager.cpp:177] Pausing sending status updates
I0602 05:18:10.970937  4450 state.cpp:62] Recovering state from '/tmp/Endpoint_SlaveEndpointTest_AuthorizedRequest_2_XYBOok/meta'
I0602 05:18:10.972247  4455 status_update_manager.cpp:203] Recovering status update manager
I0602 05:18:10.972486  4455 containerizer.cpp:582] Recovering containerizer
I0602 05:18:10.974601  4455 provisioner.cpp:416] Provisioner recovery complete
I0602 05:18:10.975330  4450 slave.cpp:6119] Finished recovery
I0602 05:18:10.976303  4450 slave.cpp:6301] Querying resource estimator for oversubscribable
resources
I0602 05:18:10.977097  4450 slave.cpp:6315] Received oversubscribable resources {} from the
resource estimator
I0602 05:18:10.980826  4449 process.cpp:3778] Handling HTTP event for process 'slave(754)'
with path: '/slave(754)/containers'
I0602 05:18:10.982681  4450 http.cpp:1115] HTTP GET for /slave(754)/containers from 172.17.0.3:60408
I0602 05:18:10.983319  4450 http.cpp:936] Authorizing principal 'test-principal' to GET the
'/containers' endpoint
I0602 05:18:10.990425  4450 slave.cpp:817] Agent terminating
[       OK ] Endpoint/SlaveEndpointTest.AuthorizedRequest/2 (64 ms)
[ RUN      ] Endpoint/SlaveEndpointTest.UnauthorizedRequest/0
I0602 05:18:11.020694  4430 containerizer.cpp:230] Using isolation: posix/cpu,posix/mem,filesystem/posix,network/cni,environment_secret
W0602 05:18:11.021148  4430 backend.cpp:76] Failed to create 'aufs' backend: AufsBackend requires
root privileges
W0602 05:18:11.021307  4430 backend.cpp:76] Failed to create 'bind' backend: BindBackend requires
root privileges
I0602 05:18:11.021345  4430 provisioner.cpp:255] Using default backend 'copy'
I0602 05:18:11.024866  4454 slave.cpp:248] Mesos agent started on (755)@172.17.0.3:40462
I0602 05:18:11.024907  4454 slave.cpp:249] Flags at startup: --acls="" --appc_simple_discovery_uri_prefix="http://"
--appc_store_dir="/tmp/Endpoint_SlaveEndpointTest_UnauthorizedRequest_0_T5tjjp/store/appc"
--authenticate_http_readonly="true" --authenticate_http_readwrite="true" --authenticatee="crammd5"
--authentication_backoff_factor="1secs" --authorizer="local" --cgroups_cpu_enable_pids_and_tids_count="false"
--cgroups_enable_cfs="false" --cgroups_hierarchy="/sys/fs/cgroup" --cgroups_limit_swap="false"
--cgroups_root="mesos" --container_disk_watch_interval="15secs" --containerizers="mesos" --credential="/tmp/Endpoint_SlaveEndpointTest_UnauthorizedRequest_0_T5tjjp/credential"
--default_role="*" --disk_watch_interval="1mins" --docker="docker" --docker_kill_orphans="true"
--docker_registry="https://registry-1.docker.io" --docker_remove_delay="6hrs" --docker_socket="/var/run/docker.sock"
--docker_stop_timeout="0ns" --docker_store_dir="/tmp/Endpoint_SlaveEndpointTest_UnauthorizedRequest_0_T5tjjp/store/docker"
--docker_volume_checkpoint_dir="/var/run/mesos/isolators/docker/volume" --enforce_container_disk_quota="false"
--executor_registration_timeout="1mins" --executor_reregistration_timeout="2secs" --executor_shutdown_grace_period="5secs"
--fetcher_cache_dir="/tmp/Endpoint_SlaveEndpointTest_UnauthorizedRequest_0_T5tjjp/fetch" --fetcher_cache_size="2GB"
--frameworks_home="" --gc_delay="1weeks" --gc_disk_headroom="0.1" --hadoop_home="" --help="false"
--hostname_lookup="true" --http_command_executor="false" --http_credentials="/tmp/Endpoint_SlaveEndpointTest_UnauthorizedRequest_0_T5tjjp/http_credentials"
--http_heartbeat_interval="30secs" --initialize_driver_logging="true" --isolation="posix/cpu,posix/mem"
--launcher="posix" --launcher_dir="/mesos/mesos-1.4.0/_build/src" --logbufsecs="0" --logging_level="INFO"
--max_completed_executors_per_framework="150" --oversubscribed_resources_interval="15secs"
--perf_duration="10secs" --perf_interval="1mins" --port="5051" --qos_correction_interval_min="0ns"
--quiet="false" --recover="reconnect" --recovery_timeout="15mins" --registration_backoff_factor="10ms"
--resources="cpus:2;gpus:0;mem:1024;disk:1024;ports:[31000-32000]" --revocable_cpu_low_priority="true"
--runtime_dir="/tmp/Endpoint_SlaveEndpointTest_UnauthorizedRequest_0_T5tjjp" --sandbox_directory="/mnt/mesos/sandbox"
--strict="true" --switch_user="true" --systemd_enable_support="true" --systemd_runtime_directory="/run/systemd/system"
--version="false" --work_dir="/tmp/Endpoint_SlaveEndpointTest_UnauthorizedRequest_0_HyCc4M"
I0602 05:18:11.025218  4454 credentials.hpp:86] Loading credential for authentication from
'/tmp/Endpoint_SlaveEndpointTest_UnauthorizedRequest_0_T5tjjp/credential'
I0602 05:18:11.025413  4454 slave.cpp:281] Agent using credential for: test-principal
I0602 05:18:11.025440  4454 credentials.hpp:37] Loading credentials for authentication from
'/tmp/Endpoint_SlaveEndpointTest_UnauthorizedRequest_0_T5tjjp/http_credentials'
I0602 05:18:11.025658  4454 http.cpp:975] Creating default 'basic' HTTP authenticator for
realm 'mesos-agent-readonly'
I0602 05:18:11.025902  4454 http.cpp:975] Creating default 'basic' HTTP authenticator for
realm 'mesos-agent-readwrite'
I0602 05:18:11.027139  4454 slave.cpp:552] Agent resources: cpus(*):2; mem(*):1024; disk(*):1024;
ports(*):[31000-32000]
I0602 05:18:11.027221  4454 slave.cpp:560] Agent attributes: [  ]
I0602 05:18:11.027240  4454 slave.cpp:565] Agent hostname: 957d1c1c0e0e
I0602 05:18:11.027426  4455 status_update_manager.cpp:177] Pausing sending status updates
I0602 05:18:11.029156  4454 state.cpp:62] Recovering state from '/tmp/Endpoint_SlaveEndpointTest_UnauthorizedRequest_0_HyCc4M/meta'
I0602 05:18:11.029552  4452 status_update_manager.cpp:203] Recovering status update manager
I0602 05:18:11.029943  4456 containerizer.cpp:582] Recovering containerizer
I0602 05:18:11.032634  4451 provisioner.cpp:416] Provisioner recovery complete
I0602 05:18:11.033115  4456 slave.cpp:6119] Finished recovery
I0602 05:18:11.033658  4456 slave.cpp:6301] Querying resource estimator for oversubscribable
resources
I0602 05:18:11.033913  4456 slave.cpp:6315] Received oversubscribable resources {} from the
resource estimator
I0602 05:18:11.037086  4453 process.cpp:3778] Handling HTTP event for process 'slave(755)'
with path: '/slave(755)/monitor/statistics'
I0602 05:18:11.039139  4450 http.cpp:1115] HTTP GET for /slave(755)/monitor/statistics from
172.17.0.3:60410
I0602 05:18:11.039777  4450 http.cpp:936] Authorizing principal 'test-principal' to GET the
'/monitor/statistics' endpoint
I0602 05:18:11.043870  4430 slave.cpp:817] Agent terminating
[       OK ] Endpoint/SlaveEndpointTest.UnauthorizedRequest/0 (43 ms)
[ RUN      ] Endpoint/SlaveEndpointTest.UnauthorizedRequest/1
I0602 05:18:11.068478  4430 containerizer.cpp:230] Using isolation: posix/cpu,posix/mem,filesystem/posix,network/cni,environment_secret
W0602 05:18:11.069463  4430 backend.cpp:76] Failed to create 'aufs' backend: AufsBackend requires
root privileges
W0602 05:18:11.069788  4430 backend.cpp:76] Failed to create 'bind' backend: BindBackend requires
root privileges
I0602 05:18:11.069845  4430 provisioner.cpp:255] Using default backend 'copy'
I0602 05:18:11.076699  4454 slave.cpp:248] Mesos agent started on (756)@172.17.0.3:40462
I0602 05:18:11.076745  4454 slave.cpp:249] Flags at startup: --acls="" --appc_simple_discovery_uri_prefix="http://"
--appc_store_dir="/tmp/Endpoint_SlaveEndpointTest_UnauthorizedRequest_1_9XCVHS/store/appc"
--authenticate_http_readonly="true" --authenticate_http_readwrite="true" --authenticatee="crammd5"
--authentication_backoff_factor="1secs" --authorizer="local" --cgroups_cpu_enable_pids_and_tids_count="false"
--cgroups_enable_cfs="false" --cgroups_hierarchy="/sys/fs/cgroup" --cgroups_limit_swap="false"
--cgroups_root="mesos" --container_disk_watch_interval="15secs" --containerizers="mesos" --credential="/tmp/Endpoint_SlaveEndpointTest_UnauthorizedRequest_1_9XCVHS/credential"
--default_role="*" --disk_watch_interval="1mins" --docker="docker" --docker_kill_orphans="true"
--docker_registry="https://registry-1.docker.io" --docker_remove_delay="6hrs" --docker_socket="/var/run/docker.sock"
--docker_stop_timeout="0ns" --docker_store_dir="/tmp/Endpoint_SlaveEndpointTest_UnauthorizedRequest_1_9XCVHS/store/docker"
--docker_volume_checkpoint_dir="/var/run/mesos/isolators/docker/volume" --enforce_container_disk_quota="false"
--executor_registration_timeout="1mins" --executor_reregistration_timeout="2secs" --executor_shutdown_grace_period="5secs"
--fetcher_cache_dir="/tmp/Endpoint_SlaveEndpointTest_UnauthorizedRequest_1_9XCVHS/fetch" --fetcher_cache_size="2GB"
--frameworks_home="" --gc_delay="1weeks" --gc_disk_headroom="0.1" --hadoop_home="" --help="false"
--hostname_lookup="true" --http_command_executor="false" --http_credentials="/tmp/Endpoint_SlaveEndpointTest_UnauthorizedRequest_1_9XCVHS/http_credentials"
--http_heartbeat_interval="30secs" --initialize_driver_logging="true" --isolation="posix/cpu,posix/mem"
--launcher="posix" --launcher_dir="/mesos/mesos-1.4.0/_build/src" --logbufsecs="0" --logging_level="INFO"
--max_completed_executors_per_framework="150" --oversubscribed_resources_interval="15secs"
--perf_duration="10secs" --perf_interval="1mins" --port="5051" --qos_correction_interval_min="0ns"
--quiet="false" --recover="reconnect" --recovery_timeout="15mins" --registration_backoff_factor="10ms"
--resources="cpus:2;gpus:0;mem:1024;disk:1024;ports:[31000-32000]" --revocable_cpu_low_priority="true"
--runtime_dir="/tmp/Endpoint_SlaveEndpointTest_UnauthorizedRequest_1_9XCVHS" --sandbox_directory="/mnt/mesos/sandbox"
--strict="true" --switch_user="true" --systemd_enable_support="true" --systemd_runtime_directory="/run/systemd/system"
--version="false" --work_dir="/tmp/Endpoint_SlaveEndpointTest_UnauthorizedRequest_1_qYQLkg"
I0602 05:18:11.077148  4454 credentials.hpp:86] Loading credential for authentication from
'/tmp/Endpoint_SlaveEndpointTest_UnauthorizedRequest_1_9XCVHS/credential'
I0602 05:18:11.077306  4454 slave.cpp:281] Agent using credential for: test-principal
I0602 05:18:11.077327  4454 credentials.hpp:37] Loading credentials for authentication from
'/tmp/Endpoint_SlaveEndpointTest_UnauthorizedRequest_1_9XCVHS/http_credentials'
I0602 05:18:11.077539  4454 http.cpp:975] Creating default 'basic' HTTP authenticator for
realm 'mesos-agent-readonly'
I0602 05:18:11.077663  4454 http.cpp:975] Creating default 'basic' HTTP authenticator for
realm 'mesos-agent-readwrite'
I0602 05:18:11.078853  4454 slave.cpp:552] Agent resources: cpus(*):2; mem(*):1024; disk(*):1024;
ports(*):[31000-32000]
I0602 05:18:11.078932  4454 slave.cpp:560] Agent attributes: [  ]
I0602 05:18:11.078943  4454 slave.cpp:565] Agent hostname: 957d1c1c0e0e
I0602 05:18:11.079092  4452 status_update_manager.cpp:177] Pausing sending status updates
I0602 05:18:11.081131  4455 state.cpp:62] Recovering state from '/tmp/Endpoint_SlaveEndpointTest_UnauthorizedRequest_1_qYQLkg/meta'
I0602 05:18:11.081540  4452 status_update_manager.cpp:203] Recovering status update manager
I0602 05:18:11.082357  4451 containerizer.cpp:582] Recovering containerizer
I0602 05:18:11.084308  4449 provisioner.cpp:416] Provisioner recovery complete
I0602 05:18:11.085093  4451 slave.cpp:6119] Finished recovery
I0602 05:18:11.085916  4451 slave.cpp:6301] Querying resource estimator for oversubscribable
resources
I0602 05:18:11.086637  4451 slave.cpp:6315] Received oversubscribable resources {} from the
resource estimator
I0602 05:18:11.090399  4453 process.cpp:3778] Handling HTTP event for process 'slave(756)'
with path: '/slave(756)/monitor/statistics.json'
I0602 05:18:11.093210  4455 http.cpp:1115] HTTP GET for /slave(756)/monitor/statistics.json
from 172.17.0.3:60412
I0602 05:18:11.093296  4455 http.cpp:936] Authorizing principal 'test-principal' to GET the
'/monitor/statistics.json' endpoint
I0602 05:18:11.097726  4430 slave.cpp:817] Agent terminating
[       OK ] Endpoint/SlaveEndpointTest.UnauthorizedRequest/1 (45 ms)
[ RUN      ] Endpoint/SlaveEndpointTest.UnauthorizedRequest/2
I0602 05:18:11.112303  4430 containerizer.cpp:230] Using isolation: posix/cpu,posix/mem,filesystem/posix,network/cni,environment_secret
W0602 05:18:11.112900  4430 backend.cpp:76] Failed to create 'aufs' backend: AufsBackend requires
root privileges
W0602 05:18:11.113064  4430 backend.cpp:76] Failed to create 'bind' backend: BindBackend requires
root privileges
I0602 05:18:11.113131  4430 provisioner.cpp:255] Using default backend 'copy'
I0602 05:18:11.118626  4450 slave.cpp:248] Mesos agent started on (757)@172.17.0.3:40462
I0602 05:18:11.118861  4450 slave.cpp:249] Flags at startup: --acls="" --appc_simple_discovery_uri_prefix="http://"
--appc_store_dir="/tmp/Endpoint_SlaveEndpointTest_UnauthorizedRequest_2_lC5GDm/store/appc"
--authenticate_http_readonly="true" --authenticate_http_readwrite="true" --authenticatee="crammd5"
--authentication_backoff_factor="1secs" --authorizer="local" --cgroups_cpu_enable_pids_and_tids_count="false"
--cgroups_enable_cfs="false" --cgroups_hierarchy="/sys/fs/cgroup" --cgroups_limit_swap="false"
--cgroups_root="mesos" --container_disk_watch_interval="15secs" --containerizers="mesos" --credential="/tmp/Endpoint_SlaveEndpointTest_UnauthorizedRequest_2_lC5GDm/credential"
--default_role="*" --disk_watch_interval="1mins" --docker="docker" --docker_kill_orphans="true"
--docker_registry="https://registry-1.docker.io" --docker_remove_delay="6hrs" --docker_socket="/var/run/docker.sock"
--docker_stop_timeout="0ns" --docker_store_dir="/tmp/Endpoint_SlaveEndpointTest_UnauthorizedRequest_2_lC5GDm/store/docker"
--docker_volume_checkpoint_dir="/var/run/mesos/isolators/docker/volume" --enforce_container_disk_quota="false"
--executor_registration_timeout="1mins" --executor_reregistration_timeout="2secs" --executor_shutdown_grace_period="5secs"
--fetcher_cache_dir="/tmp/Endpoint_SlaveEndpointTest_UnauthorizedRequest_2_lC5GDm/fetch" --fetcher_cache_size="2GB"
--frameworks_home="" --gc_delay="1weeks" --gc_disk_headroom="0.1" --hadoop_home="" --help="false"
--hostname_lookup="true" --http_command_executor="false" --http_credentials="/tmp/Endpoint_SlaveEndpointTest_UnauthorizedRequest_2_lC5GDm/http_credentials"
--http_heartbeat_interval="30secs" --initialize_driver_logging="true" --isolation="posix/cpu,posix/mem"
--launcher="posix" --launcher_dir="/mesos/mesos-1.4.0/_build/src" --logbufsecs="0" --logging_level="INFO"
--max_completed_executors_per_framework="150" --oversubscribed_resources_interval="15secs"
--perf_duration="10secs" --perf_interval="1mins" --port="5051" --qos_correction_interval_min="0ns"
--quiet="false" --recover="reconnect" --recovery_timeout="15mins" --registration_backoff_factor="10ms"
--resources="cpus:2;gpus:0;mem:1024;disk:1024;ports:[31000-32000]" --revocable_cpu_low_priority="true"
--runtime_dir="/tmp/Endpoint_SlaveEndpointTest_UnauthorizedRequest_2_lC5GDm" --sandbox_directory="/mnt/mesos/sandbox"
--strict="true" --switch_user="true" --systemd_enable_support="true" --systemd_runtime_directory="/run/systemd/system"
--version="false" --work_dir="/tmp/Endpoint_SlaveEndpointTest_UnauthorizedRequest_2_xxKB8J"
I0602 05:18:11.119922  4450 credentials.hpp:86] Loading credential for authentication from
'/tmp/Endpoint_SlaveEndpointTest_UnauthorizedRequest_2_lC5GDm/credential'
I0602 05:18:11.121785  4450 slave.cpp:281] Agent using credential for: test-principal
I0602 05:18:11.122153  4450 credentials.hpp:37] Loading credentials for authentication from
'/tmp/Endpoint_SlaveEndpointTest_UnauthorizedRequest_2_lC5GDm/http_credentials'
I0602 05:18:11.122853  4450 http.cpp:975] Creating default 'basic' HTTP authenticator for
realm 'mesos-agent-readonly'
I0602 05:18:11.123739  4450 http.cpp:975] Creating default 'basic' HTTP authenticator for
realm 'mesos-agent-readwrite'
I0602 05:18:11.126019  4450 slave.cpp:552] Agent resources: cpus(*):2; mem(*):1024; disk(*):1024;
ports(*):[31000-32000]
I0602 05:18:11.126574  4450 slave.cpp:560] Agent attributes: [  ]
I0602 05:18:11.126991  4450 slave.cpp:565] Agent hostname: 957d1c1c0e0e
I0602 05:18:11.127785  4449 status_update_manager.cpp:177] Pausing sending status updates
I0602 05:18:11.129793  4456 state.cpp:62] Recovering state from '/tmp/Endpoint_SlaveEndpointTest_UnauthorizedRequest_2_xxKB8J/meta'
I0602 05:18:11.130421  4454 status_update_manager.cpp:203] Recovering status update manager
I0602 05:18:11.130869  4455 containerizer.cpp:582] Recovering containerizer
I0602 05:18:11.133896  4451 provisioner.cpp:416] Provisioner recovery complete
I0602 05:18:11.134649  4456 slave.cpp:6119] Finished recovery
I0602 05:18:11.135049  4456 slave.cpp:6301] Querying resource estimator for oversubscribable
resources
I0602 05:18:11.135586  4452 slave.cpp:6315] Received oversubscribable resources {} from the
resource estimator
I0602 05:18:11.138965  4451 process.cpp:3778] Handling HTTP event for process 'slave(757)'
with path: '/slave(757)/containers'
I0602 05:18:11.142181  4451 http.cpp:1115] HTTP GET for /slave(757)/containers from 172.17.0.3:60416
I0602 05:18:11.142693  4451 http.cpp:936] Authorizing principal 'test-principal' to GET the
'/containers' endpoint
I0602 05:18:11.146409  4452 slave.cpp:817] Agent terminating
[       OK ] Endpoint/SlaveEndpointTest.UnauthorizedRequest/2 (67 ms)
[ RUN      ] Endpoint/SlaveEndpointTest.NoAuthorizer/0
I0602 05:18:11.183859  4430 containerizer.cpp:230] Using isolation: posix/cpu,posix/mem,filesystem/posix,network/cni,environment_secret
W0602 05:18:11.185282  4430 backend.cpp:76] Failed to create 'aufs' backend: AufsBackend requires
root privileges
W0602 05:18:11.185727  4430 backend.cpp:76] Failed to create 'bind' backend: BindBackend requires
root privileges
I0602 05:18:11.185998  4430 provisioner.cpp:255] Using default backend 'copy'
I0602 05:18:11.191054  4430 cluster.cpp:448] Creating default 'local' authorizer
I0602 05:18:11.194185  4456 slave.cpp:248] Mesos agent started on (758)@172.17.0.3:40462
I0602 05:18:11.194212  4456 slave.cpp:249] Flags at startup: --acls="" --appc_simple_discovery_uri_prefix="http://"
--appc_store_dir="/tmp/Endpoint_SlaveEndpointTest_NoAuthorizer_0_xRuHiR/store/appc" --authenticate_http_readonly="true"
--authenticate_http_readwrite="true" --authenticatee="crammd5" --authentication_backoff_factor="1secs"
--authorizer="local" --cgroups_cpu_enable_pids_and_tids_count="false" --cgroups_enable_cfs="false"
--cgroups_hierarchy="/sys/fs/cgroup" --cgroups_limit_swap="false" --cgroups_root="mesos" --container_disk_watch_interval="15secs"
--containerizers="mesos" --credential="/tmp/Endpoint_SlaveEndpointTest_NoAuthorizer_0_xRuHiR/credential"
--default_role="*" --disk_watch_interval="1mins" --docker="docker" --docker_kill_orphans="true"
--docker_registry="https://registry-1.docker.io" --docker_remove_delay="6hrs" --docker_socket="/var/run/docker.sock"
--docker_stop_timeout="0ns" --docker_store_dir="/tmp/Endpoint_SlaveEndpointTest_NoAuthorizer_0_xRuHiR/store/docker"
--docker_volume_checkpoint_dir="/var/run/mesos/isolators/docker/volume" --enforce_container_disk_quota="false"
--executor_registration_timeout="1mins" --executor_reregistration_timeout="2secs" --executor_shutdown_grace_period="5secs"
--fetcher_cache_dir="/tmp/Endpoint_SlaveEndpointTest_NoAuthorizer_0_xRuHiR/fetch" --fetcher_cache_size="2GB"
--frameworks_home="" --gc_delay="1weeks" --gc_disk_headroom="0.1" --hadoop_home="" --help="false"
--hostname_lookup="true" --http_command_executor="false" --http_credentials="/tmp/Endpoint_SlaveEndpointTest_NoAuthorizer_0_xRuHiR/http_credentials"
--http_heartbeat_interval="30secs" --initialize_driver_logging="true" --isolation="posix/cpu,posix/mem"
--launcher="posix" --launcher_dir="/mesos/mesos-1.4.0/_build/src" --logbufsecs="0" --logging_level="INFO"
--max_completed_executors_per_framework="150" --oversubscribed_resources_interval="15secs"
--perf_duration="10secs" --perf_interval="1mins" --port="5051" --qos_correction_interval_min="0ns"
--quiet="false" --recover="reconnect" --recovery_timeout="15mins" --registration_backoff_factor="10ms"
--resources="cpus:2;gpus:0;mem:1024;disk:1024;ports:[31000-32000]" --revocable_cpu_low_priority="true"
--runtime_dir="/tmp/Endpoint_SlaveEndpointTest_NoAuthorizer_0_xRuHiR" --sandbox_directory="/mnt/mesos/sandbox"
--strict="true" --switch_user="true" --systemd_enable_support="true" --systemd_runtime_directory="/run/systemd/system"
--version="false" --work_dir="/tmp/Endpoint_SlaveEndpointTest_NoAuthorizer_0_sn3eBe"
I0602 05:18:11.194571  4456 credentials.hpp:86] Loading credential for authentication from
'/tmp/Endpoint_SlaveEndpointTest_NoAuthorizer_0_xRuHiR/credential'
I0602 05:18:11.194746  4456 slave.cpp:281] Agent using credential for: test-principal
I0602 05:18:11.194774  4456 credentials.hpp:37] Loading credentials for authentication from
'/tmp/Endpoint_SlaveEndpointTest_NoAuthorizer_0_xRuHiR/http_credentials'
I0602 05:18:11.195008  4456 http.cpp:975] Creating default 'basic' HTTP authenticator for
realm 'mesos-agent-readonly'
I0602 05:18:11.195152  4456 http.cpp:975] Creating default 'basic' HTTP authenticator for
realm 'mesos-agent-readwrite'
I0602 05:18:11.196414  4456 slave.cpp:552] Agent resources: cpus(*):2; mem(*):1024; disk(*):1024;
ports(*):[31000-32000]
I0602 05:18:11.196503  4456 slave.cpp:560] Agent attributes: [  ]
I0602 05:18:11.196516  4456 slave.cpp:565] Agent hostname: 957d1c1c0e0e
I0602 05:18:11.198221  4456 status_update_manager.cpp:177] Pausing sending status updates
I0602 05:18:11.198855  4456 state.cpp:62] Recovering state from '/tmp/Endpoint_SlaveEndpointTest_NoAuthorizer_0_sn3eBe/meta'
I0602 05:18:11.199309  4456 status_update_manager.cpp:203] Recovering status update manager
I0602 05:18:11.200153  4456 containerizer.cpp:582] Recovering containerizer
I0602 05:18:11.201984  4456 provisioner.cpp:416] Provisioner recovery complete
I0602 05:18:11.202476  4456 slave.cpp:6119] Finished recovery
I0602 05:18:11.203166  4456 slave.cpp:6301] Querying resource estimator for oversubscribable
resources
I0602 05:18:11.203505  4452 slave.cpp:6315] Received oversubscribable resources {} from the
resource estimator
I0602 05:18:11.207188  4454 process.cpp:3778] Handling HTTP event for process 'slave(758)'
with path: '/slave(758)/monitor/statistics'
I0602 05:18:11.209177  4454 http.cpp:1115] HTTP GET for /slave(758)/monitor/statistics from
172.17.0.3:60418
I0602 05:18:11.209254  4454 http.cpp:936] Authorizing principal 'test-principal' to GET the
'/monitor/statistics' endpoint
I0602 05:18:11.214818  4454 slave.cpp:817] Agent terminating
[       OK ] Endpoint/SlaveEndpointTest.NoAuthorizer/0 (51 ms)
[ RUN      ] Endpoint/SlaveEndpointTest.NoAuthorizer/1
I0602 05:18:11.233633  4430 containerizer.cpp:230] Using isolation: posix/cpu,posix/mem,filesystem/posix,network/cni,environment_secret
W0602 05:18:11.234400  4430 backend.cpp:76] Failed to create 'aufs' backend: AufsBackend requires
root privileges
W0602 05:18:11.234875  4430 backend.cpp:76] Failed to create 'bind' backend: BindBackend requires
root privileges
I0602 05:18:11.235049  4430 provisioner.cpp:255] Using default backend 'copy'
I0602 05:18:11.238692  4430 cluster.cpp:448] Creating default 'local' authorizer
I0602 05:18:11.242065  4456 slave.cpp:248] Mesos agent started on (759)@172.17.0.3:40462
I0602 05:18:11.242090  4456 slave.cpp:249] Flags at startup: --acls="" --appc_simple_discovery_uri_prefix="http://"
--appc_store_dir="/tmp/Endpoint_SlaveEndpointTest_NoAuthorizer_1_nFlfAm/store/appc" --authenticate_http_readonly="true"
--authenticate_http_readwrite="true" --authenticatee="crammd5" --authentication_backoff_factor="1secs"
--authorizer="local" --cgroups_cpu_enable_pids_and_tids_count="false" --cgroups_enable_cfs="false"
--cgroups_hierarchy="/sys/fs/cgroup" --cgroups_limit_swap="false" --cgroups_root="mesos" --container_disk_watch_interval="15secs"
--containerizers="mesos" --credential="/tmp/Endpoint_SlaveEndpointTest_NoAuthorizer_1_nFlfAm/credential"
--default_role="*" --disk_watch_interval="1mins" --docker="docker" --docker_kill_orphans="true"
--docker_registry="https://registry-1.docker.io" --docker_remove_delay="6hrs" --docker_socket="/var/run/docker.sock"
--docker_stop_timeout="0ns" --docker_store_dir="/tmp/Endpoint_SlaveEndpointTest_NoAuthorizer_1_nFlfAm/store/docker"
--docker_volume_checkpoint_dir="/var/run/mesos/isolators/docker/volume" --enforce_container_disk_quota="false"
--executor_registration_timeout="1mins" --executor_reregistration_timeout="2secs" --executor_shutdown_grace_period="5secs"
--fetcher_cache_dir="/tmp/Endpoint_SlaveEndpointTest_NoAuthorizer_1_nFlfAm/fetch" --fetcher_cache_size="2GB"
--frameworks_home="" --gc_delay="1weeks" --gc_disk_headroom="0.1" --hadoop_home="" --help="false"
--hostname_lookup="true" --http_command_executor="false" --http_credentials="/tmp/Endpoint_SlaveEndpointTest_NoAuthorizer_1_nFlfAm/http_credentials"
--http_heartbeat_interval="30secs" --initialize_driver_logging="true" --isolation="posix/cpu,posix/mem"
--launcher="posix" --launcher_dir="/mesos/mesos-1.4.0/_build/src" --logbufsecs="0" --logging_level="INFO"
--max_completed_executors_per_framework="150" --oversubscribed_resources_interval="15secs"
--perf_duration="10secs" --perf_interval="1mins" --port="5051" --qos_correction_interval_min="0ns"
--quiet="false" --recover="reconnect" --recovery_timeout="15mins" --registration_backoff_factor="10ms"
--resources="cpus:2;gpus:0;mem:1024;disk:1024;ports:[31000-32000]" --revocable_cpu_low_priority="true"
--runtime_dir="/tmp/Endpoint_SlaveEndpointTest_NoAuthorizer_1_nFlfAm" --sandbox_directory="/mnt/mesos/sandbox"
--strict="true" --switch_user="true" --systemd_enable_support="true" --systemd_runtime_directory="/run/systemd/system"
--version="false" --work_dir="/tmp/Endpoint_SlaveEndpointTest_NoAuthorizer_1_s4A5JJ"
I0602 05:18:11.242398  4456 credentials.hpp:86] Loading credential for authentication from
'/tmp/Endpoint_SlaveEndpointTest_NoAuthorizer_1_nFlfAm/credential'
I0602 05:18:11.242573  4456 slave.cpp:281] Agent using credential for: test-principal
I0602 05:18:11.242599  4456 credentials.hpp:37] Loading credentials for authentication from
'/tmp/Endpoint_SlaveEndpointTest_NoAuthorizer_1_nFlfAm/http_credentials'
I0602 05:18:11.242810  4456 http.cpp:975] Creating default 'basic' HTTP authenticator for
realm 'mesos-agent-readonly'
I0602 05:18:11.243188  4456 http.cpp:975] Creating default 'basic' HTTP authenticator for
realm 'mesos-agent-readwrite'
I0602 05:18:11.244431  4456 slave.cpp:552] Agent resources: cpus(*):2; mem(*):1024; disk(*):1024;
ports(*):[31000-32000]
I0602 05:18:11.244508  4456 slave.cpp:560] Agent attributes: [  ]
I0602 05:18:11.244524  4456 slave.cpp:565] Agent hostname: 957d1c1c0e0e
I0602 05:18:11.244853  4451 status_update_manager.cpp:177] Pausing sending status updates
I0602 05:18:11.245973  4453 state.cpp:62] Recovering state from '/tmp/Endpoint_SlaveEndpointTest_NoAuthorizer_1_s4A5JJ/meta'
I0602 05:18:11.246470  4456 status_update_manager.cpp:203] Recovering status update manager
I0602 05:18:11.246876  4456 containerizer.cpp:582] Recovering containerizer
I0602 05:18:11.248685  4452 provisioner.cpp:416] Provisioner recovery complete
I0602 05:18:11.249577  4452 slave.cpp:6119] Finished recovery
I0602 05:18:11.250111  4452 slave.cpp:6301] Querying resource estimator for oversubscribable
resources
I0602 05:18:11.250944  4452 slave.cpp:6315] Received oversubscribable resources {} from the
resource estimator
I0602 05:18:11.255631  4449 process.cpp:3778] Handling HTTP event for process 'slave(759)'
with path: '/slave(759)/monitor/statistics.json'
I0602 05:18:11.257601  4454 http.cpp:1115] HTTP GET for /slave(759)/monitor/statistics.json
from 172.17.0.3:60420
I0602 05:18:11.257673  4454 http.cpp:936] Authorizing principal 'test-principal' to GET the
'/monitor/statistics.json' endpoint
I0602 05:18:11.262959  4430 slave.cpp:817] Agent terminating
[       OK ] Endpoint/SlaveEndpointTest.NoAuthorizer/1 (57 ms)
[ RUN      ] Endpoint/SlaveEndpointTest.NoAuthorizer/2
I0602 05:18:11.291769  4430 containerizer.cpp:230] Using isolation: posix/cpu,posix/mem,filesystem/posix,network/cni,environment_secret
W0602 05:18:11.292560  4430 backend.cpp:76] Failed to create 'aufs' backend: AufsBackend requires
root privileges
W0602 05:18:11.292754  4430 backend.cpp:76] Failed to create 'bind' backend: BindBackend requires
root privileges
I0602 05:18:11.292856  4430 provisioner.cpp:255] Using default backend 'copy'
I0602 05:18:11.294967  4430 cluster.cpp:448] Creating default 'local' authorizer
I0602 05:18:11.297408  4450 slave.cpp:248] Mesos agent started on (760)@172.17.0.3:40462
I0602 05:18:11.297454  4450 slave.cpp:249] Flags at startup: --acls="" --appc_simple_discovery_uri_prefix="http://"
--appc_store_dir="/tmp/Endpoint_SlaveEndpointTest_NoAuthorizer_2_w25LuS/store/appc" --authenticate_http_readonly="true"
--authenticate_http_readwrite="true" --authenticatee="crammd5" --authentication_backoff_factor="1secs"
--authorizer="local" --cgroups_cpu_enable_pids_and_tids_count="false" --cgroups_enable_cfs="false"
--cgroups_hierarchy="/sys/fs/cgroup" --cgroups_limit_swap="false" --cgroups_root="mesos" --container_disk_watch_interval="15secs"
--containerizers="mesos" --credential="/tmp/Endpoint_SlaveEndpointTest_NoAuthorizer_2_w25LuS/credential"
--default_role="*" --disk_watch_interval="1mins" --docker="docker" --docker_kill_orphans="true"
--docker_registry="https://registry-1.docker.io" --docker_remove_delay="6hrs" --docker_socket="/var/run/docker.sock"
--docker_stop_timeout="0ns" --docker_store_dir="/tmp/Endpoint_SlaveEndpointTest_NoAuthorizer_2_w25LuS/store/docker"
--docker_volume_checkpoint_dir="/var/run/mesos/isolators/docker/volume" --enforce_container_disk_quota="false"
--executor_registration_timeout="1mins" --executor_reregistration_timeout="2secs" --executor_shutdown_grace_period="5secs"
--fetcher_cache_dir="/tmp/Endpoint_SlaveEndpointTest_NoAuthorizer_2_w25LuS/fetch" --fetcher_cache_size="2GB"
--frameworks_home="" --gc_delay="1weeks" --gc_disk_headroom="0.1" --hadoop_home="" --help="false"
--hostname_lookup="true" --http_command_executor="false" --http_credentials="/tmp/Endpoint_SlaveEndpointTest_NoAuthorizer_2_w25LuS/http_credentials"
--http_heartbeat_interval="30secs" --initialize_driver_logging="true" --isolation="posix/cpu,posix/mem"
--launcher="posix" --launcher_dir="/mesos/mesos-1.4.0/_build/src" --logbufsecs="0" --logging_level="INFO"
--max_completed_executors_per_framework="150" --oversubscribed_resources_interval="15secs"
--perf_duration="10secs" --perf_interval="1mins" --port="5051" --qos_correction_interval_min="0ns"
--quiet="false" --recover="reconnect" --recovery_timeout="15mins" --registration_backoff_factor="10ms"
--resources="cpus:2;gpus:0;mem:1024;disk:1024;ports:[31000-32000]" --revocable_cpu_low_priority="true"
--runtime_dir="/tmp/Endpoint_SlaveEndpointTest_NoAuthorizer_2_w25LuS" --sandbox_directory="/mnt/mesos/sandbox"
--strict="true" --switch_user="true" --systemd_enable_support="true" --systemd_runtime_directory="/run/systemd/system"
--version="false" --work_dir="/tmp/Endpoint_SlaveEndpointTest_NoAuthorizer_2_U6Njuf"
I0602 05:18:11.298477  4450 credentials.hpp:86] Loading credential for authentication from
'/tmp/Endpoint_SlaveEndpointTest_NoAuthorizer_2_w25LuS/credential'
I0602 05:18:11.298982  4450 slave.cpp:281] Agent using credential for: test-principal
I0602 05:18:11.299161  4450 credentials.hpp:37] Loading credentials for authentication from
'/tmp/Endpoint_SlaveEndpointTest_NoAuthorizer_2_w25LuS/http_credentials'
I0602 05:18:11.299726  4450 http.cpp:975] Creating default 'basic' HTTP authenticator for
realm 'mesos-agent-readonly'
I0602 05:18:11.299888  4450 http.cpp:975] Creating default 'basic' HTTP authenticator for
realm 'mesos-agent-readwrite'
I0602 05:18:11.301914  4450 slave.cpp:552] Agent resources: cpus(*):2; mem(*):1024; disk(*):1024;
ports(*):[31000-32000]
I0602 05:18:11.302155  4450 slave.cpp:560] Agent attributes: [  ]
I0602 05:18:11.302392  4450 slave.cpp:565] Agent hostname: 957d1c1c0e0e
I0602 05:18:11.302832  4449 status_update_manager.cpp:177] Pausing sending status updates
I0602 05:18:11.306149  4454 state.cpp:62] Recovering state from '/tmp/Endpoint_SlaveEndpointTest_NoAuthorizer_2_U6Njuf/meta'
I0602 05:18:11.306666  4455 status_update_manager.cpp:203] Recovering status update manager
I0602 05:18:11.307163  4454 containerizer.cpp:582] Recovering containerizer
I0602 05:18:11.309677  4449 provisioner.cpp:416] Provisioner recovery complete
I0602 05:18:11.310252  4449 slave.cpp:6119] Finished recovery
I0602 05:18:11.311064  4449 slave.cpp:6301] Querying resource estimator for oversubscribable
resources
I0602 05:18:11.311836  4450 slave.cpp:6315] Received oversubscribable resources {} from the
resource estimator
I0602 05:18:11.315830  4454 process.cpp:3778] Handling HTTP event for process 'slave(760)'
with path: '/slave(760)/containers'
I0602 05:18:11.317525  4454 http.cpp:1115] HTTP GET for /slave(760)/containers from 172.17.0.3:60422
I0602 05:18:11.317596  4454 http.cpp:936] Authorizing principal 'test-principal' to GET the
'/containers' endpoint
I0602 05:18:11.325444  4430 slave.cpp:817] Agent terminating
[       OK ] Endpoint/SlaveEndpointTest.NoAuthorizer/2 (52 ms)
[----------] 9 tests from Endpoint/SlaveEndpointTest (471 ms total)

[----------] Global test environment tear-down
[==========] 1586 tests from 176 test cases ran. (685475 ms total)
[  PASSED  ] 1582 tests.
[  FAILED  ] 4 tests, listed below:
[  FAILED  ] DefaultExecutorCheckTest.CommandCheckDeliveredAndReconciled
[  FAILED  ] DefaultExecutorCheckTest.CommandCheckStatusChange
[  FAILED  ] DefaultExecutorCheckTest.CommandCheckSeesParentsEnv
[  FAILED  ] DefaultExecutorCheckTest.CommandCheckSharesWorkDirWithTask

 4 FAILED TESTS
  YOU HAVE 22 DISABLED TESTS

E0602 05:18:11.416793  4457 process.cpp:968] Failed to accept socket: future discarded
make[4]: *** [check-local] Error 1
make[4]: Leaving directory `/mesos/mesos-1.4.0/_build/src'
make[3]: *** [check-am] Error 2
make[3]: Leaving directory `/mesos/mesos-1.4.0/_build/src'
make[2]: *** [check] Error 2
make[2]: Leaving directory `/mesos/mesos-1.4.0/_build/src'
make[1]: *** [check-recursive] Error 1
make[1]: Leaving directory `/mesos/mesos-1.4.0/_build'
make: *** [distcheck] Error 1
+ docker rmi mesos-1496376331-12172
Untagged: mesos-1496376331-12172:latest
Deleted: sha256:c3a73d2537a72eeb6ee821dcd40a98f2f30e8c0353c13b4dfca1497d250dea57
Deleted: sha256:c820e971a11dc72027a195865440d7d145e8de75352f8636061f6c448bffef8b
Deleted: sha256:ec7a3decb2acf446db5657da2b41f866aa9ce6f6e0317ba36fc667a77c84ed0d
Deleted: sha256:93cecc0ebc15ab8a78bae51c186c087d66da3f5e37129b1fd21c5673a055de03
Deleted: sha256:3ee23b081f9251f6a9896c448db2786ee00e29eb6fec94c91c776b62d203c5d0
Deleted: sha256:e91aebf4d3ca51462d116cac94c2853a44948d536d0c5c8d3ede99315450c587
Deleted: sha256:ed85b6f5eea7ea966f4ffff0928d6608c6de52951a225b9b65468938372d8b3f
Deleted: sha256:097154f3351c18b2b9ee78e766e3111dac3666463dc44759261b3180ade5773e
Deleted: sha256:af1dc33ac41d63ab1b275347adf59b60b5302da412d19e5e521e00d1623dab38
Deleted: sha256:38a9fd5c6136e2ddce691e77c3fc098fb2908284c1b2f371ec64f92bb07112a7
Deleted: sha256:b035e3b172d50dde544bbb6feca8c348078aec68e40c7f7caca71aac9b1d5c0a
Deleted: sha256:10a1aad39f84850d0cc45655e7ec1e86c70c40f352f843c152c7cd7e04397326
Deleted: sha256:74edd581e4d2a69cda9e8842ae2691e92b1f55f4fba4508ebccc4b4b2e2d2e61
Deleted: sha256:f02c69398cdf73a04675fb937443b4ade94c2e611eb36f8a4b53b53371466763
Deleted: sha256:4c9a048aa4b771625f0e281ec0e97ba7e8ee6f90b99fddc964e5d64258a002c9
Deleted: sha256:9d7a94f7a297ef43ccfcbf611798033979e989e25d2d86386e9f97c047f9561b
Deleted: sha256:8dced0ac95cd755b1bb4488f486fcd04ac025d34a5cedff3a340cb5325546563
Deleted: sha256:fbb575dcfbd2dcf21db10daca458d3e435c5d0fd180256de49f88a9b307b09b4
Deleted: sha256:39d941a05dbaacdb3ce3517c1a419ce42bfb2405eb5ab930533dc4ff6f2a24a0
Deleted: sha256:628bd112db902abdada4119bc42ae3b7d3aed92c72d31ec57cbdd5e6eaf72370
Deleted: sha256:d52731f3b26899627bf5434643d7c13b94b81d1d4fba4b44d536d399a92b10e1
Deleted: sha256:1781a31165f6168ee95632b701f5cc6c333fbe7b2681af3ac472ac61d7c8dfad
Deleted: sha256:4d0686a8abebbaedcb2816c1ca6f93e28e15e5ba913ca8520d55de99f866813d
Deleted: sha256:370fca608cf1e4017c5db0158dea5547145556ad26fec060f7885073e7a3fb26
Build step 'Execute shell' marked build as failure
Not sending mail to unregistered user xujyan@apple.com
Not sending mail to unregistered user neil.conway@gmail.com

Mime
View raw message