mesos-builds mailing list archives

Site index · List index
Message view « Date » · « Thread »
Top « Date » · « Thread »
From Apache Jenkins Server <jenk...@builds.apache.org>
Subject Build failed in Jenkins: Mesos-Buildbot » cmake,clang,--verbose --enable-libevent --enable-ssl,GLOG_v=1 MESOS_VERBOSE=1,ubuntu:14.04,(ubuntu)&&(!ubuntu-us1)&&(!ubuntu-eu2) #3837
Date Mon, 26 Jun 2017 07:38:47 GMT
See <https://builds.apache.org/job/Mesos-Buildbot/BUILDTOOL=cmake,COMPILER=clang,CONFIGURATION=--verbose%20--enable-libevent%20--enable-ssl,ENVIRONMENT=GLOG_v=1%20MESOS_VERBOSE=1,OS=ubuntu%3A14.04,label_exp=(ubuntu)&&(!ubuntu-us1)&&(!ubuntu-eu2)/3837/display/redirect?page=changes>

Changes:

[bmahler] Removed temporary MULTI_ROLE implementation logic in the master.

------------------------------------------
[...truncated 28.47 MB...]
I0626 07:38:41.353260  8453 slave.cpp:6168] Finished recovery
I0626 07:38:41.353905  8453 slave.cpp:6350] Querying resource estimator for oversubscribable
resources
I0626 07:38:41.354576  8453 slave.cpp:6364] Received oversubscribable resources {} from the
resource estimator
I0626 07:38:41.357199  8449 process.cpp:3779] Handling HTTP event for process 'slave(773)'
with path: '/slave(773)/containers'
I0626 07:38:41.359232  8446 http.cpp:1114] HTTP GET for /slave(773)/containers from 172.17.0.4:38900
I0626 07:38:41.359380  8446 http.cpp:935] Authorizing principal 'test-principal' to GET the
'/containers' endpoint
I0626 07:38:41.364549  8462 slave.cpp:818] Agent terminating
[       OK ] Endpoint/SlaveEndpointTest.AuthorizedRequest/2 (41 ms)
[ RUN      ] Endpoint/SlaveEndpointTest.UnauthorizedRequest/0
I0626 07:38:41.379914   571 containerizer.cpp:230] Using isolation: posix/cpu,posix/mem,filesystem/posix,network/cni,environment_secret
W0626 07:38:41.380512   571 backend.cpp:76] Failed to create 'aufs' backend: AufsBackend requires
root privileges
W0626 07:38:41.380641   571 backend.cpp:76] Failed to create 'bind' backend: BindBackend requires
root privileges
I0626 07:38:41.380830   571 provisioner.cpp:255] Using default backend 'copy'
I0626 07:38:41.384629  8459 slave.cpp:249] Mesos agent started on (774)@172.17.0.4:46778
I0626 07:38:41.384950  8459 slave.cpp:250] Flags at startup: --acls="" --appc_simple_discovery_uri_prefix="http://"
--appc_store_dir="/tmp/Endpoint_SlaveEndpointTest_UnauthorizedRequest_0_ba4QaQ/store/appc"
--authenticate_http_executors="true" --authenticate_http_readonly="true" --authenticate_http_readwrite="true"
--authenticatee="crammd5" --authentication_backoff_factor="1secs" --authorizer="local" --cgroups_cpu_enable_pids_and_tids_count="false"
--cgroups_enable_cfs="false" --cgroups_hierarchy="/sys/fs/cgroup" --cgroups_limit_swap="false"
--cgroups_root="mesos" --container_disk_watch_interval="15secs" --containerizers="mesos" --credential="/tmp/Endpoint_SlaveEndpointTest_UnauthorizedRequest_0_ba4QaQ/credential"
--default_role="*" --disk_watch_interval="1mins" --docker="docker" --docker_kill_orphans="true"
--docker_registry="https://registry-1.docker.io" --docker_remove_delay="6hrs" --docker_socket="/var/run/docker.sock"
--docker_stop_timeout="0ns" --docker_store_dir="/tmp/Endpoint_SlaveEndpointTest_UnauthorizedRequest_0_ba4QaQ/store/docker"
--docker_volume_checkpoint_dir="/var/run/mesos/isolators/docker/volume" --enforce_container_disk_quota="false"
--executor_registration_timeout="1mins" --executor_reregistration_timeout="2secs" --executor_secret_key="/tmp/Endpoint_SlaveEndpointTest_UnauthorizedRequest_0_ba4QaQ/executor_secret_key"
--executor_shutdown_grace_period="5secs" --fetcher_cache_dir="/tmp/Endpoint_SlaveEndpointTest_UnauthorizedRequest_0_ba4QaQ/fetch"
--fetcher_cache_size="2GB" --frameworks_home="" --gc_delay="1weeks" --gc_disk_headroom="0.1"
--hadoop_home="" --help="false" --hostname_lookup="true" --http_command_executor="false" --http_credentials="/tmp/Endpoint_SlaveEndpointTest_UnauthorizedRequest_0_ba4QaQ/http_credentials"
--http_heartbeat_interval="30secs" --initialize_driver_logging="true" --isolation="posix/cpu,posix/mem"
--launcher="posix" --launcher_dir="/mesos/build/src" --logbufsecs="0" --logging_level="INFO"
--max_completed_executors_per_framework="150" --oversubscribed_resources_interval="15secs"
--perf_duration="10secs" --perf_interval="1mins" --port="5051" --qos_correction_interval_min="0ns"
--quiet="false" --recover="reconnect" --recovery_timeout="15mins" --registration_backoff_factor="10ms"
--resources="cpus:2;gpus:0;mem:1024;disk:1024;ports:[31000-32000]" --revocable_cpu_low_priority="true"
--runtime_dir="/tmp/Endpoint_SlaveEndpointTest_UnauthorizedRequest_0_ba4QaQ" --sandbox_directory="/mnt/mesos/sandbox"
--strict="true" --switch_user="true" --systemd_enable_support="true" --systemd_runtime_directory="/run/systemd/system"
--version="false" --work_dir="/tmp/Endpoint_SlaveEndpointTest_UnauthorizedRequest_0_rJSWUE"
I0626 07:38:41.385658  8459 credentials.hpp:86] Loading credential for authentication from
'/tmp/Endpoint_SlaveEndpointTest_UnauthorizedRequest_0_ba4QaQ/credential'
I0626 07:38:41.385911  8459 slave.cpp:282] Agent using credential for: test-principal
I0626 07:38:41.385934  8459 credentials.hpp:37] Loading credentials for authentication from
'/tmp/Endpoint_SlaveEndpointTest_UnauthorizedRequest_0_ba4QaQ/http_credentials'
I0626 07:38:41.386386  8459 http.cpp:974] Creating default 'basic' HTTP authenticator for
realm 'mesos-agent-executor'
I0626 07:38:41.386554  8459 http.cpp:995] Creating default 'jwt' HTTP authenticator for realm
'mesos-agent-executor'
I0626 07:38:41.386863  8459 http.cpp:974] Creating default 'basic' HTTP authenticator for
realm 'mesos-agent-readonly'
I0626 07:38:41.386955  8459 http.cpp:995] Creating default 'jwt' HTTP authenticator for realm
'mesos-agent-readonly'
I0626 07:38:41.387107  8459 http.cpp:974] Creating default 'basic' HTTP authenticator for
realm 'mesos-agent-readwrite'
I0626 07:38:41.387193  8459 http.cpp:995] Creating default 'jwt' HTTP authenticator for realm
'mesos-agent-readwrite'
I0626 07:38:41.388871  8459 slave.cpp:553] Agent resources: [{"name":"cpus","scalar":{"value":2.0},"type":"SCALAR"},{"name":"mem","scalar":{"value":1024.0},"type":"SCALAR"},{"name":"disk","scalar":{"value":1024.0},"type":"SCALAR"},{"name":"ports","ranges":{"range":[{"begin":31000,"end":32000}]},"type":"RANGES"}]
I0626 07:38:41.389117  8459 slave.cpp:561] Agent attributes: [  ]
I0626 07:38:41.389358  8459 slave.cpp:566] Agent hostname: 13b0f1cc35c0
I0626 07:38:41.389681  8453 status_update_manager.cpp:177] Pausing sending status updates
I0626 07:38:41.391497  8442 state.cpp:64] Recovering state from '/tmp/Endpoint_SlaveEndpointTest_UnauthorizedRequest_0_rJSWUE/meta'
I0626 07:38:41.391871  8440 status_update_manager.cpp:203] Recovering status update manager
I0626 07:38:41.392246  8441 containerizer.cpp:582] Recovering containerizer
I0626 07:38:41.394029  8441 provisioner.cpp:416] Provisioner recovery complete
I0626 07:38:41.394567  8441 slave.cpp:6168] Finished recovery
I0626 07:38:41.395033  8441 slave.cpp:6350] Querying resource estimator for oversubscribable
resources
I0626 07:38:41.395609  8441 slave.cpp:6364] Received oversubscribable resources {} from the
resource estimator
I0626 07:38:41.398147  8458 process.cpp:3779] Handling HTTP event for process 'slave(774)'
with path: '/slave(774)/monitor/statistics'
I0626 07:38:41.400514  8458 http.cpp:1114] HTTP GET for /slave(774)/monitor/statistics from
172.17.0.4:38902
I0626 07:38:41.400593  8458 http.cpp:935] Authorizing principal 'test-principal' to GET the
'/monitor/statistics' endpoint
I0626 07:38:41.404827  8454 slave.cpp:818] Agent terminating
[       OK ] Endpoint/SlaveEndpointTest.UnauthorizedRequest/0 (36 ms)
[ RUN      ] Endpoint/SlaveEndpointTest.UnauthorizedRequest/1
I0626 07:38:41.417562   571 containerizer.cpp:230] Using isolation: posix/cpu,posix/mem,filesystem/posix,network/cni,environment_secret
W0626 07:38:41.418359   571 backend.cpp:76] Failed to create 'aufs' backend: AufsBackend requires
root privileges
W0626 07:38:41.418511   571 backend.cpp:76] Failed to create 'bind' backend: BindBackend requires
root privileges
I0626 07:38:41.418766   571 provisioner.cpp:255] Using default backend 'copy'
I0626 07:38:41.422286  8452 slave.cpp:249] Mesos agent started on (775)@172.17.0.4:46778
I0626 07:38:41.422338  8452 slave.cpp:250] Flags at startup: --acls="" --appc_simple_discovery_uri_prefix="http://"
--appc_store_dir="/tmp/Endpoint_SlaveEndpointTest_UnauthorizedRequest_1_ixX8uz/store/appc"
--authenticate_http_executors="true" --authenticate_http_readonly="true" --authenticate_http_readwrite="true"
--authenticatee="crammd5" --authentication_backoff_factor="1secs" --authorizer="local" --cgroups_cpu_enable_pids_and_tids_count="false"
--cgroups_enable_cfs="false" --cgroups_hierarchy="/sys/fs/cgroup" --cgroups_limit_swap="false"
--cgroups_root="mesos" --container_disk_watch_interval="15secs" --containerizers="mesos" --credential="/tmp/Endpoint_SlaveEndpointTest_UnauthorizedRequest_1_ixX8uz/credential"
--default_role="*" --disk_watch_interval="1mins" --docker="docker" --docker_kill_orphans="true"
--docker_registry="https://registry-1.docker.io" --docker_remove_delay="6hrs" --docker_socket="/var/run/docker.sock"
--docker_stop_timeout="0ns" --docker_store_dir="/tmp/Endpoint_SlaveEndpointTest_UnauthorizedRequest_1_ixX8uz/store/docker"
--docker_volume_checkpoint_dir="/var/run/mesos/isolators/docker/volume" --enforce_container_disk_quota="false"
--executor_registration_timeout="1mins" --executor_reregistration_timeout="2secs" --executor_secret_key="/tmp/Endpoint_SlaveEndpointTest_UnauthorizedRequest_1_ixX8uz/executor_secret_key"
--executor_shutdown_grace_period="5secs" --fetcher_cache_dir="/tmp/Endpoint_SlaveEndpointTest_UnauthorizedRequest_1_ixX8uz/fetch"
--fetcher_cache_size="2GB" --frameworks_home="" --gc_delay="1weeks" --gc_disk_headroom="0.1"
--hadoop_home="" --help="false" --hostname_lookup="true" --http_command_executor="false" --http_credentials="/tmp/Endpoint_SlaveEndpointTest_UnauthorizedRequest_1_ixX8uz/http_credentials"
--http_heartbeat_interval="30secs" --initialize_driver_logging="true" --isolation="posix/cpu,posix/mem"
--launcher="posix" --launcher_dir="/mesos/build/src" --logbufsecs="0" --logging_level="INFO"
--max_completed_executors_per_framework="150" --oversubscribed_resources_interval="15secs"
--perf_duration="10secs" --perf_interval="1mins" --port="5051" --qos_correction_interval_min="0ns"
--quiet="false" --recover="reconnect" --recovery_timeout="15mins" --registration_backoff_factor="10ms"
--resources="cpus:2;gpus:0;mem:1024;disk:1024;ports:[31000-32000]" --revocable_cpu_low_priority="true"
--runtime_dir="/tmp/Endpoint_SlaveEndpointTest_UnauthorizedRequest_1_ixX8uz" --sandbox_directory="/mnt/mesos/sandbox"
--strict="true" --switch_user="true" --systemd_enable_support="true" --systemd_runtime_directory="/run/systemd/system"
--version="false" --work_dir="/tmp/Endpoint_SlaveEndpointTest_UnauthorizedRequest_1_wUIL9n"
I0626 07:38:41.422778  8452 credentials.hpp:86] Loading credential for authentication from
'/tmp/Endpoint_SlaveEndpointTest_UnauthorizedRequest_1_ixX8uz/credential'
I0626 07:38:41.422971  8452 slave.cpp:282] Agent using credential for: test-principal
I0626 07:38:41.422993  8452 credentials.hpp:37] Loading credentials for authentication from
'/tmp/Endpoint_SlaveEndpointTest_UnauthorizedRequest_1_ixX8uz/http_credentials'
I0626 07:38:41.423305  8452 http.cpp:974] Creating default 'basic' HTTP authenticator for
realm 'mesos-agent-executor'
I0626 07:38:41.423447  8452 http.cpp:995] Creating default 'jwt' HTTP authenticator for realm
'mesos-agent-executor'
I0626 07:38:41.423681  8452 http.cpp:974] Creating default 'basic' HTTP authenticator for
realm 'mesos-agent-readonly'
I0626 07:38:41.423771  8452 http.cpp:995] Creating default 'jwt' HTTP authenticator for realm
'mesos-agent-readonly'
I0626 07:38:41.424043  8452 http.cpp:974] Creating default 'basic' HTTP authenticator for
realm 'mesos-agent-readwrite'
I0626 07:38:41.424134  8452 http.cpp:995] Creating default 'jwt' HTTP authenticator for realm
'mesos-agent-readwrite'
I0626 07:38:41.425464  8452 slave.cpp:553] Agent resources: [{"name":"cpus","scalar":{"value":2.0},"type":"SCALAR"},{"name":"mem","scalar":{"value":1024.0},"type":"SCALAR"},{"name":"disk","scalar":{"value":1024.0},"type":"SCALAR"},{"name":"ports","ranges":{"range":[{"begin":31000,"end":32000}]},"type":"RANGES"}]
I0626 07:38:41.425640  8452 slave.cpp:561] Agent attributes: [  ]
I0626 07:38:41.425657  8452 slave.cpp:566] Agent hostname: 13b0f1cc35c0
I0626 07:38:41.425849  8454 status_update_manager.cpp:177] Pausing sending status updates
I0626 07:38:41.427325  8457 state.cpp:64] Recovering state from '/tmp/Endpoint_SlaveEndpointTest_UnauthorizedRequest_1_wUIL9n/meta'
I0626 07:38:41.427624  8460 status_update_manager.cpp:203] Recovering status update manager
I0626 07:38:41.427846  8449 containerizer.cpp:582] Recovering containerizer
I0626 07:38:41.429726  8446 provisioner.cpp:416] Provisioner recovery complete
I0626 07:38:41.430078  8445 slave.cpp:6168] Finished recovery
I0626 07:38:41.430778  8445 slave.cpp:6350] Querying resource estimator for oversubscribable
resources
I0626 07:38:41.431016  8440 slave.cpp:6364] Received oversubscribable resources {} from the
resource estimator
I0626 07:38:41.438431  8448 process.cpp:3779] Handling HTTP event for process 'slave(775)'
with path: '/slave(775)/monitor/statistics.json'
I0626 07:38:41.441361  8449 http.cpp:1114] HTTP GET for /slave(775)/monitor/statistics.json
from 172.17.0.4:38904
I0626 07:38:41.441686  8449 http.cpp:935] Authorizing principal 'test-principal' to GET the
'/monitor/statistics.json' endpoint
I0626 07:38:41.444468  8444 slave.cpp:818] Agent terminating
[       OK ] Endpoint/SlaveEndpointTest.UnauthorizedRequest/1 (40 ms)
[ RUN      ] Endpoint/SlaveEndpointTest.UnauthorizedRequest/2
I0626 07:38:41.458369   571 containerizer.cpp:230] Using isolation: posix/cpu,posix/mem,filesystem/posix,network/cni,environment_secret
W0626 07:38:41.459497   571 backend.cpp:76] Failed to create 'aufs' backend: AufsBackend requires
root privileges
W0626 07:38:41.459784   571 backend.cpp:76] Failed to create 'bind' backend: BindBackend requires
root privileges
I0626 07:38:41.459985   571 provisioner.cpp:255] Using default backend 'copy'
I0626 07:38:41.465008  8463 slave.cpp:249] Mesos agent started on (776)@172.17.0.4:46778
I0626 07:38:41.465060  8463 slave.cpp:250] Flags at startup: --acls="" --appc_simple_discovery_uri_prefix="http://"
--appc_store_dir="/tmp/Endpoint_SlaveEndpointTest_UnauthorizedRequest_2_o2GMcj/store/appc"
--authenticate_http_executors="true" --authenticate_http_readonly="true" --authenticate_http_readwrite="true"
--authenticatee="crammd5" --authentication_backoff_factor="1secs" --authorizer="local" --cgroups_cpu_enable_pids_and_tids_count="false"
--cgroups_enable_cfs="false" --cgroups_hierarchy="/sys/fs/cgroup" --cgroups_limit_swap="false"
--cgroups_root="mesos" --container_disk_watch_interval="15secs" --containerizers="mesos" --credential="/tmp/Endpoint_SlaveEndpointTest_UnauthorizedRequest_2_o2GMcj/credential"
--default_role="*" --disk_watch_interval="1mins" --docker="docker" --docker_kill_orphans="true"
--docker_registry="https://registry-1.docker.io" --docker_remove_delay="6hrs" --docker_socket="/var/run/docker.sock"
--docker_stop_timeout="0ns" --docker_store_dir="/tmp/Endpoint_SlaveEndpointTest_UnauthorizedRequest_2_o2GMcj/store/docker"
--docker_volume_checkpoint_dir="/var/run/mesos/isolators/docker/volume" --enforce_container_disk_quota="false"
--executor_registration_timeout="1mins" --executor_reregistration_timeout="2secs" --executor_secret_key="/tmp/Endpoint_SlaveEndpointTest_UnauthorizedRequest_2_o2GMcj/executor_secret_key"
--executor_shutdown_grace_period="5secs" --fetcher_cache_dir="/tmp/Endpoint_SlaveEndpointTest_UnauthorizedRequest_2_o2GMcj/fetch"
--fetcher_cache_size="2GB" --frameworks_home="" --gc_delay="1weeks" --gc_disk_headroom="0.1"
--hadoop_home="" --help="false" --hostname_lookup="true" --http_command_executor="false" --http_credentials="/tmp/Endpoint_SlaveEndpointTest_UnauthorizedRequest_2_o2GMcj/http_credentials"
--http_heartbeat_interval="30secs" --initialize_driver_logging="true" --isolation="posix/cpu,posix/mem"
--launcher="posix" --launcher_dir="/mesos/build/src" --logbufsecs="0" --logging_level="INFO"
--max_completed_executors_per_framework="150" --oversubscribed_resources_interval="15secs"
--perf_duration="10secs" --perf_interval="1mins" --port="5051" --qos_correction_interval_min="0ns"
--quiet="false" --recover="reconnect" --recovery_timeout="15mins" --registration_backoff_factor="10ms"
--resources="cpus:2;gpus:0;mem:1024;disk:1024;ports:[31000-32000]" --revocable_cpu_low_priority="true"
--runtime_dir="/tmp/Endpoint_SlaveEndpointTest_UnauthorizedRequest_2_o2GMcj" --sandbox_directory="/mnt/mesos/sandbox"
--strict="true" --switch_user="true" --systemd_enable_support="true" --systemd_runtime_directory="/run/systemd/system"
--version="false" --work_dir="/tmp/Endpoint_SlaveEndpointTest_UnauthorizedRequest_2_t4RoL7"
I0626 07:38:41.465507  8463 credentials.hpp:86] Loading credential for authentication from
'/tmp/Endpoint_SlaveEndpointTest_UnauthorizedRequest_2_o2GMcj/credential'
I0626 07:38:41.465737  8463 slave.cpp:282] Agent using credential for: test-principal
I0626 07:38:41.465756  8463 credentials.hpp:37] Loading credentials for authentication from
'/tmp/Endpoint_SlaveEndpointTest_UnauthorizedRequest_2_o2GMcj/http_credentials'
I0626 07:38:41.466058  8463 http.cpp:974] Creating default 'basic' HTTP authenticator for
realm 'mesos-agent-executor'
I0626 07:38:41.466187  8463 http.cpp:995] Creating default 'jwt' HTTP authenticator for realm
'mesos-agent-executor'
I0626 07:38:41.466370  8463 http.cpp:974] Creating default 'basic' HTTP authenticator for
realm 'mesos-agent-readonly'
I0626 07:38:41.466440  8463 http.cpp:995] Creating default 'jwt' HTTP authenticator for realm
'mesos-agent-readonly'
I0626 07:38:41.466557  8463 http.cpp:974] Creating default 'basic' HTTP authenticator for
realm 'mesos-agent-readwrite'
I0626 07:38:41.466625  8463 http.cpp:995] Creating default 'jwt' HTTP authenticator for realm
'mesos-agent-readwrite'
I0626 07:38:41.468081  8463 slave.cpp:553] Agent resources: [{"name":"cpus","scalar":{"value":2.0},"type":"SCALAR"},{"name":"mem","scalar":{"value":1024.0},"type":"SCALAR"},{"name":"disk","scalar":{"value":1024.0},"type":"SCALAR"},{"name":"ports","ranges":{"range":[{"begin":31000,"end":32000}]},"type":"RANGES"}]
I0626 07:38:41.468308  8463 slave.cpp:561] Agent attributes: [  ]
I0626 07:38:41.468323  8463 slave.cpp:566] Agent hostname: 13b0f1cc35c0
I0626 07:38:41.470582  8460 state.cpp:64] Recovering state from '/tmp/Endpoint_SlaveEndpointTest_UnauthorizedRequest_2_t4RoL7/meta'
I0626 07:38:41.471305  8463 status_update_manager.cpp:177] Pausing sending status updates
I0626 07:38:41.471582  8463 status_update_manager.cpp:203] Recovering status update manager
I0626 07:38:41.472096  8456 containerizer.cpp:582] Recovering containerizer
I0626 07:38:41.474159  8456 provisioner.cpp:416] Provisioner recovery complete
I0626 07:38:41.474725  8446 slave.cpp:6168] Finished recovery
I0626 07:38:41.475456  8446 slave.cpp:6350] Querying resource estimator for oversubscribable
resources
I0626 07:38:41.475953  8446 slave.cpp:6364] Received oversubscribable resources {} from the
resource estimator
I0626 07:38:41.478775  8445 process.cpp:3779] Handling HTTP event for process 'slave(776)'
with path: '/slave(776)/containers'
I0626 07:38:41.480799  8445 http.cpp:1114] HTTP GET for /slave(776)/containers from 172.17.0.4:38906
I0626 07:38:41.481001  8445 http.cpp:935] Authorizing principal 'test-principal' to GET the
'/containers' endpoint
I0626 07:38:41.483515  8443 slave.cpp:818] Agent terminating
[       OK ] Endpoint/SlaveEndpointTest.UnauthorizedRequest/2 (38 ms)
[ RUN      ] Endpoint/SlaveEndpointTest.NoAuthorizer/0
I0626 07:38:41.496948   571 containerizer.cpp:230] Using isolation: posix/cpu,posix/mem,filesystem/posix,network/cni,environment_secret
W0626 07:38:41.497619   571 backend.cpp:76] Failed to create 'aufs' backend: AufsBackend requires
root privileges
W0626 07:38:41.497750   571 backend.cpp:76] Failed to create 'bind' backend: BindBackend requires
root privileges
I0626 07:38:41.497838   571 provisioner.cpp:255] Using default backend 'copy'
I0626 07:38:41.500242   571 cluster.cpp:448] Creating default 'local' authorizer
I0626 07:38:41.502244  8443 slave.cpp:249] Mesos agent started on (777)@172.17.0.4:46778
I0626 07:38:41.502322  8443 slave.cpp:250] Flags at startup: --acls="" --appc_simple_discovery_uri_prefix="http://"
--appc_store_dir="/tmp/Endpoint_SlaveEndpointTest_NoAuthorizer_0_wdTki3/store/appc" --authenticate_http_executors="true"
--authenticate_http_readonly="true" --authenticate_http_readwrite="true" --authenticatee="crammd5"
--authentication_backoff_factor="1secs" --authorizer="local" --cgroups_cpu_enable_pids_and_tids_count="false"
--cgroups_enable_cfs="false" --cgroups_hierarchy="/sys/fs/cgroup" --cgroups_limit_swap="false"
--cgroups_root="mesos" --container_disk_watch_interval="15secs" --containerizers="mesos" --credential="/tmp/Endpoint_SlaveEndpointTest_NoAuthorizer_0_wdTki3/credential"
--default_role="*" --disk_watch_interval="1mins" --docker="docker" --docker_kill_orphans="true"
--docker_registry="https://registry-1.docker.io" --docker_remove_delay="6hrs" --docker_socket="/var/run/docker.sock"
--docker_stop_timeout="0ns" --docker_store_dir="/tmp/Endpoint_SlaveEndpointTest_NoAuthorizer_0_wdTki3/store/docker"
--docker_volume_checkpoint_dir="/var/run/mesos/isolators/docker/volume" --enforce_container_disk_quota="false"
--executor_registration_timeout="1mins" --executor_reregistration_timeout="2secs" --executor_secret_key="/tmp/Endpoint_SlaveEndpointTest_NoAuthorizer_0_wdTki3/executor_secret_key"
--executor_shutdown_grace_period="5secs" --fetcher_cache_dir="/tmp/Endpoint_SlaveEndpointTest_NoAuthorizer_0_wdTki3/fetch"
--fetcher_cache_size="2GB" --frameworks_home="" --gc_delay="1weeks" --gc_disk_headroom="0.1"
--hadoop_home="" --help="false" --hostname_lookup="true" --http_command_executor="false" --http_credentials="/tmp/Endpoint_SlaveEndpointTest_NoAuthorizer_0_wdTki3/http_credentials"
--http_heartbeat_interval="30secs" --initialize_driver_logging="true" --isolation="posix/cpu,posix/mem"
--launcher="posix" --launcher_dir="/mesos/build/src" --logbufsecs="0" --logging_level="INFO"
--max_completed_executors_per_framework="150" --oversubscribed_resources_interval="15secs"
--perf_duration="10secs" --perf_interval="1mins" --port="5051" --qos_correction_interval_min="0ns"
--quiet="false" --recover="reconnect" --recovery_timeout="15mins" --registration_backoff_factor="10ms"
--resources="cpus:2;gpus:0;mem:1024;disk:1024;ports:[31000-32000]" --revocable_cpu_low_priority="true"
--runtime_dir="/tmp/Endpoint_SlaveEndpointTest_NoAuthorizer_0_wdTki3" --sandbox_directory="/mnt/mesos/sandbox"
--strict="true" --switch_user="true" --systemd_enable_support="true" --systemd_runtime_directory="/run/systemd/system"
--version="false" --work_dir="/tmp/Endpoint_SlaveEndpointTest_NoAuthorizer_0_YftbLR"
I0626 07:38:41.502858  8443 credentials.hpp:86] Loading credential for authentication from
'/tmp/Endpoint_SlaveEndpointTest_NoAuthorizer_0_wdTki3/credential'
I0626 07:38:41.503082  8443 slave.cpp:282] Agent using credential for: test-principal
I0626 07:38:41.503095  8443 credentials.hpp:37] Loading credentials for authentication from
'/tmp/Endpoint_SlaveEndpointTest_NoAuthorizer_0_wdTki3/http_credentials'
I0626 07:38:41.503324  8443 http.cpp:974] Creating default 'basic' HTTP authenticator for
realm 'mesos-agent-executor'
I0626 07:38:41.503473  8443 http.cpp:995] Creating default 'jwt' HTTP authenticator for realm
'mesos-agent-executor'
I0626 07:38:41.503672  8443 http.cpp:974] Creating default 'basic' HTTP authenticator for
realm 'mesos-agent-readonly'
I0626 07:38:41.503775  8443 http.cpp:995] Creating default 'jwt' HTTP authenticator for realm
'mesos-agent-readonly'
I0626 07:38:41.503976  8443 http.cpp:974] Creating default 'basic' HTTP authenticator for
realm 'mesos-agent-readwrite'
I0626 07:38:41.504081  8443 http.cpp:995] Creating default 'jwt' HTTP authenticator for realm
'mesos-agent-readwrite'
I0626 07:38:41.505604  8443 slave.cpp:553] Agent resources: [{"name":"cpus","scalar":{"value":2.0},"type":"SCALAR"},{"name":"mem","scalar":{"value":1024.0},"type":"SCALAR"},{"name":"disk","scalar":{"value":1024.0},"type":"SCALAR"},{"name":"ports","ranges":{"range":[{"begin":31000,"end":32000}]},"type":"RANGES"}]
I0626 07:38:41.505796  8443 slave.cpp:561] Agent attributes: [  ]
I0626 07:38:41.505812  8443 slave.cpp:566] Agent hostname: 13b0f1cc35c0
I0626 07:38:41.505946  8446 status_update_manager.cpp:177] Pausing sending status updates
I0626 07:38:41.511462  8446 state.cpp:64] Recovering state from '/tmp/Endpoint_SlaveEndpointTest_NoAuthorizer_0_YftbLR/meta'
I0626 07:38:41.511955  8441 status_update_manager.cpp:203] Recovering status update manager
I0626 07:38:41.512250  8443 containerizer.cpp:582] Recovering containerizer
I0626 07:38:41.513900  8446 provisioner.cpp:416] Provisioner recovery complete
I0626 07:38:41.514305  8453 slave.cpp:6168] Finished recovery
I0626 07:38:41.515008  8453 slave.cpp:6350] Querying resource estimator for oversubscribable
resources
I0626 07:38:41.515239  8451 slave.cpp:6364] Received oversubscribable resources {} from the
resource estimator
I0626 07:38:41.517443  8445 process.cpp:3779] Handling HTTP event for process 'slave(777)'
with path: '/slave(777)/monitor/statistics'
I0626 07:38:41.519117  8446 http.cpp:1114] HTTP GET for /slave(777)/monitor/statistics from
172.17.0.4:38908
I0626 07:38:41.519207  8446 http.cpp:935] Authorizing principal 'test-principal' to GET the
'/monitor/statistics' endpoint
I0626 07:38:41.523321  8457 slave.cpp:818] Agent terminating
[       OK ] Endpoint/SlaveEndpointTest.NoAuthorizer/0 (44 ms)
[ RUN      ] Endpoint/SlaveEndpointTest.NoAuthorizer/1
I0626 07:38:41.539765   571 containerizer.cpp:230] Using isolation: posix/cpu,posix/mem,filesystem/posix,network/cni,environment_secret
W0626 07:38:41.540258   571 backend.cpp:76] Failed to create 'aufs' backend: AufsBackend requires
root privileges
W0626 07:38:41.540370   571 backend.cpp:76] Failed to create 'bind' backend: BindBackend requires
root privileges
I0626 07:38:41.540406   571 provisioner.cpp:255] Using default backend 'copy'
I0626 07:38:41.542258   571 cluster.cpp:448] Creating default 'local' authorizer
I0626 07:38:41.543961  8440 slave.cpp:249] Mesos agent started on (778)@172.17.0.4:46778
I0626 07:38:41.543995  8440 slave.cpp:250] Flags at startup: --acls="" --appc_simple_discovery_uri_prefix="http://"
--appc_store_dir="/tmp/Endpoint_SlaveEndpointTest_NoAuthorizer_1_Wn8pNN/store/appc" --authenticate_http_executors="true"
--authenticate_http_readonly="true" --authenticate_http_readwrite="true" --authenticatee="crammd5"
--authentication_backoff_factor="1secs" --authorizer="local" --cgroups_cpu_enable_pids_and_tids_count="false"
--cgroups_enable_cfs="false" --cgroups_hierarchy="/sys/fs/cgroup" --cgroups_limit_swap="false"
--cgroups_root="mesos" --container_disk_watch_interval="15secs" --containerizers="mesos" --credential="/tmp/Endpoint_SlaveEndpointTest_NoAuthorizer_1_Wn8pNN/credential"
--default_role="*" --disk_watch_interval="1mins" --docker="docker" --docker_kill_orphans="true"
--docker_registry="https://registry-1.docker.io" --docker_remove_delay="6hrs" --docker_socket="/var/run/docker.sock"
--docker_stop_timeout="0ns" --docker_store_dir="/tmp/Endpoint_SlaveEndpointTest_NoAuthorizer_1_Wn8pNN/store/docker"
--docker_volume_checkpoint_dir="/var/run/mesos/isolators/docker/volume" --enforce_container_disk_quota="false"
--executor_registration_timeout="1mins" --executor_reregistration_timeout="2secs" --executor_secret_key="/tmp/Endpoint_SlaveEndpointTest_NoAuthorizer_1_Wn8pNN/executor_secret_key"
--executor_shutdown_grace_period="5secs" --fetcher_cache_dir="/tmp/Endpoint_SlaveEndpointTest_NoAuthorizer_1_Wn8pNN/fetch"
--fetcher_cache_size="2GB" --frameworks_home="" --gc_delay="1weeks" --gc_disk_headroom="0.1"
--hadoop_home="" --help="false" --hostname_lookup="true" --http_command_executor="false" --http_credentials="/tmp/Endpoint_SlaveEndpointTest_NoAuthorizer_1_Wn8pNN/http_credentials"
--http_heartbeat_interval="30secs" --initialize_driver_logging="true" --isolation="posix/cpu,posix/mem"
--launcher="posix" --launcher_dir="/mesos/build/src" --logbufsecs="0" --logging_level="INFO"
--max_completed_executors_per_framework="150" --oversubscribed_resources_interval="15secs"
--perf_duration="10secs" --perf_interval="1mins" --port="5051" --qos_correction_interval_min="0ns"
--quiet="false" --recover="reconnect" --recovery_timeout="15mins" --registration_backoff_factor="10ms"
--resources="cpus:2;gpus:0;mem:1024;disk:1024;ports:[31000-32000]" --revocable_cpu_low_priority="true"
--runtime_dir="/tmp/Endpoint_SlaveEndpointTest_NoAuthorizer_1_Wn8pNN" --sandbox_directory="/mnt/mesos/sandbox"
--strict="true" --switch_user="true" --systemd_enable_support="true" --systemd_runtime_directory="/run/systemd/system"
--version="false" --work_dir="/tmp/Endpoint_SlaveEndpointTest_NoAuthorizer_1_Fb5K9B"
I0626 07:38:41.544358  8440 credentials.hpp:86] Loading credential for authentication from
'/tmp/Endpoint_SlaveEndpointTest_NoAuthorizer_1_Wn8pNN/credential'
I0626 07:38:41.544539  8440 slave.cpp:282] Agent using credential for: test-principal
I0626 07:38:41.544559  8440 credentials.hpp:37] Loading credentials for authentication from
'/tmp/Endpoint_SlaveEndpointTest_NoAuthorizer_1_Wn8pNN/http_credentials'
I0626 07:38:41.544798  8440 http.cpp:974] Creating default 'basic' HTTP authenticator for
realm 'mesos-agent-executor'
I0626 07:38:41.544920  8440 http.cpp:995] Creating default 'jwt' HTTP authenticator for realm
'mesos-agent-executor'
I0626 07:38:41.545121  8440 http.cpp:974] Creating default 'basic' HTTP authenticator for
realm 'mesos-agent-readonly'
I0626 07:38:41.545222  8440 http.cpp:995] Creating default 'jwt' HTTP authenticator for realm
'mesos-agent-readonly'
I0626 07:38:41.545516  8440 http.cpp:974] Creating default 'basic' HTTP authenticator for
realm 'mesos-agent-readwrite'
I0626 07:38:41.545594  8440 http.cpp:995] Creating default 'jwt' HTTP authenticator for realm
'mesos-agent-readwrite'
I0626 07:38:41.546952  8440 slave.cpp:553] Agent resources: [{"name":"cpus","scalar":{"value":2.0},"type":"SCALAR"},{"name":"mem","scalar":{"value":1024.0},"type":"SCALAR"},{"name":"disk","scalar":{"value":1024.0},"type":"SCALAR"},{"name":"ports","ranges":{"range":[{"begin":31000,"end":32000}]},"type":"RANGES"}]
I0626 07:38:41.547124  8440 slave.cpp:561] Agent attributes: [  ]
I0626 07:38:41.547135  8440 slave.cpp:566] Agent hostname: 13b0f1cc35c0
I0626 07:38:41.547263  8453 status_update_manager.cpp:177] Pausing sending status updates
I0626 07:38:41.548755  8460 state.cpp:64] Recovering state from '/tmp/Endpoint_SlaveEndpointTest_NoAuthorizer_1_Fb5K9B/meta'
I0626 07:38:41.549167  8442 status_update_manager.cpp:203] Recovering status update manager
I0626 07:38:41.549525  8450 containerizer.cpp:582] Recovering containerizer
I0626 07:38:41.550896  8450 provisioner.cpp:416] Provisioner recovery complete
I0626 07:38:41.551369  8449 slave.cpp:6168] Finished recovery
I0626 07:38:41.551975  8449 slave.cpp:6350] Querying resource estimator for oversubscribable
resources
I0626 07:38:41.552306  8443 slave.cpp:6364] Received oversubscribable resources {} from the
resource estimator
I0626 07:38:41.554476  8445 process.cpp:3779] Handling HTTP event for process 'slave(778)'
with path: '/slave(778)/monitor/statistics.json'
I0626 07:38:41.556138  8451 http.cpp:1114] HTTP GET for /slave(778)/monitor/statistics.json
from 172.17.0.4:38910
I0626 07:38:41.556226  8451 http.cpp:935] Authorizing principal 'test-principal' to GET the
'/monitor/statistics.json' endpoint
I0626 07:38:41.559275  8459 slave.cpp:818] Agent terminating
[       OK ] Endpoint/SlaveEndpointTest.NoAuthorizer/1 (30 ms)
[ RUN      ] Endpoint/SlaveEndpointTest.NoAuthorizer/2
I0626 07:38:41.570467   571 containerizer.cpp:230] Using isolation: posix/cpu,posix/mem,filesystem/posix,network/cni,environment_secret
W0626 07:38:41.570981   571 backend.cpp:76] Failed to create 'aufs' backend: AufsBackend requires
root privileges
W0626 07:38:41.571099   571 backend.cpp:76] Failed to create 'bind' backend: BindBackend requires
root privileges
I0626 07:38:41.571130   571 provisioner.cpp:255] Using default backend 'copy'
I0626 07:38:41.573103   571 cluster.cpp:448] Creating default 'local' authorizer
I0626 07:38:41.574647  8454 slave.cpp:249] Mesos agent started on (779)@172.17.0.4:46778
I0626 07:38:41.574679  8454 slave.cpp:250] Flags at startup: --acls="" --appc_simple_discovery_uri_prefix="http://"
--appc_store_dir="/tmp/Endpoint_SlaveEndpointTest_NoAuthorizer_2_6KlKBy/store/appc" --authenticate_http_executors="true"
--authenticate_http_readonly="true" --authenticate_http_readwrite="true" --authenticatee="crammd5"
--authentication_backoff_factor="1secs" --authorizer="local" --cgroups_cpu_enable_pids_and_tids_count="false"
--cgroups_enable_cfs="false" --cgroups_hierarchy="/sys/fs/cgroup" --cgroups_limit_swap="false"
--cgroups_root="mesos" --container_disk_watch_interval="15secs" --containerizers="mesos" --credential="/tmp/Endpoint_SlaveEndpointTest_NoAuthorizer_2_6KlKBy/credential"
--default_role="*" --disk_watch_interval="1mins" --docker="docker" --docker_kill_orphans="true"
--docker_registry="https://registry-1.docker.io" --docker_remove_delay="6hrs" --docker_socket="/var/run/docker.sock"
--docker_stop_timeout="0ns" --docker_store_dir="/tmp/Endpoint_SlaveEndpointTest_NoAuthorizer_2_6KlKBy/store/docker"
--docker_volume_checkpoint_dir="/var/run/mesos/isolators/docker/volume" --enforce_container_disk_quota="false"
--executor_registration_timeout="1mins" --executor_reregistration_timeout="2secs" --executor_secret_key="/tmp/Endpoint_SlaveEndpointTest_NoAuthorizer_2_6KlKBy/executor_secret_key"
--executor_shutdown_grace_period="5secs" --fetcher_cache_dir="/tmp/Endpoint_SlaveEndpointTest_NoAuthorizer_2_6KlKBy/fetch"
--fetcher_cache_size="2GB" --frameworks_home="" --gc_delay="1weeks" --gc_disk_headroom="0.1"
--hadoop_home="" --help="false" --hostname_lookup="true" --http_command_executor="false" --http_credentials="/tmp/Endpoint_SlaveEndpointTest_NoAuthorizer_2_6KlKBy/http_credentials"
--http_heartbeat_interval="30secs" --initialize_driver_logging="true" --isolation="posix/cpu,posix/mem"
--launcher="posix" --launcher_dir="/mesos/build/src" --logbufsecs="0" --logging_level="INFO"
--max_completed_executors_per_framework="150" --oversubscribed_resources_interval="15secs"
--perf_duration="10secs" --perf_interval="1mins" --port="5051" --qos_correction_interval_min="0ns"
--quiet="false" --recover="reconnect" --recovery_timeout="15mins" --registration_backoff_factor="10ms"
--resources="cpus:2;gpus:0;mem:1024;disk:1024;ports:[31000-32000]" --revocable_cpu_low_priority="true"
--runtime_dir="/tmp/Endpoint_SlaveEndpointTest_NoAuthorizer_2_6KlKBy" --sandbox_directory="/mnt/mesos/sandbox"
--strict="true" --switch_user="true" --systemd_enable_support="true" --systemd_runtime_directory="/run/systemd/system"
--version="false" --work_dir="/tmp/Endpoint_SlaveEndpointTest_NoAuthorizer_2_DhOuTm"
I0626 07:38:41.575059  8454 credentials.hpp:86] Loading credential for authentication from
'/tmp/Endpoint_SlaveEndpointTest_NoAuthorizer_2_6KlKBy/credential'
I0626 07:38:41.575260  8454 slave.cpp:282] Agent using credential for: test-principal
I0626 07:38:41.575278  8454 credentials.hpp:37] Loading credentials for authentication from
'/tmp/Endpoint_SlaveEndpointTest_NoAuthorizer_2_6KlKBy/http_credentials'
I0626 07:38:41.575549  8454 http.cpp:974] Creating default 'basic' HTTP authenticator for
realm 'mesos-agent-executor'
I0626 07:38:41.575685  8454 http.cpp:995] Creating default 'jwt' HTTP authenticator for realm
'mesos-agent-executor'
I0626 07:38:41.575953  8454 http.cpp:974] Creating default 'basic' HTTP authenticator for
realm 'mesos-agent-readonly'
I0626 07:38:41.576074  8454 http.cpp:995] Creating default 'jwt' HTTP authenticator for realm
'mesos-agent-readonly'
I0626 07:38:41.576227  8454 http.cpp:974] Creating default 'basic' HTTP authenticator for
realm 'mesos-agent-readwrite'
I0626 07:38:41.576314  8454 http.cpp:995] Creating default 'jwt' HTTP authenticator for realm
'mesos-agent-readwrite'
I0626 07:38:41.577672  8454 slave.cpp:553] Agent resources: [{"name":"cpus","scalar":{"value":2.0},"type":"SCALAR"},{"name":"mem","scalar":{"value":1024.0},"type":"SCALAR"},{"name":"disk","scalar":{"value":1024.0},"type":"SCALAR"},{"name":"ports","ranges":{"range":[{"begin":31000,"end":32000}]},"type":"RANGES"}]
I0626 07:38:41.577841  8454 slave.cpp:561] Agent attributes: [  ]
I0626 07:38:41.577852  8454 slave.cpp:566] Agent hostname: 13b0f1cc35c0
I0626 07:38:41.577989  8448 status_update_manager.cpp:177] Pausing sending status updates
I0626 07:38:41.579491  8440 state.cpp:64] Recovering state from '/tmp/Endpoint_SlaveEndpointTest_NoAuthorizer_2_DhOuTm/meta'
I0626 07:38:41.579741  8461 status_update_manager.cpp:203] Recovering status update manager
I0626 07:38:41.580018  8462 containerizer.cpp:582] Recovering containerizer
I0626 07:38:41.581430  8448 provisioner.cpp:416] Provisioner recovery complete
I0626 07:38:41.581858  8451 slave.cpp:6168] Finished recovery
I0626 07:38:41.582448  8451 slave.cpp:6350] Querying resource estimator for oversubscribable
resources
I0626 07:38:41.582736  8453 slave.cpp:6364] Received oversubscribable resources {} from the
resource estimator
I0626 07:38:41.584822  8459 process.cpp:3779] Handling HTTP event for process 'slave(779)'
with path: '/slave(779)/containers'
I0626 07:38:41.586562  8462 http.cpp:1114] HTTP GET for /slave(779)/containers from 172.17.0.4:38912
I0626 07:38:41.586640  8462 http.cpp:935] Authorizing principal 'test-principal' to GET the
'/containers' endpoint
I0626 07:38:41.590221  8458 slave.cpp:818] Agent terminating
[       OK ] Endpoint/SlaveEndpointTest.NoAuthorizer/2 (30 ms)
[----------] 9 tests from Endpoint/SlaveEndpointTest (331 ms total)

[----------] Global test environment tear-down
[==========] 1579 tests from 173 test cases ran. (304261 ms total)
[  PASSED  ] 1578 tests.
[  FAILED  ] 1 test, listed below:
[  FAILED  ] PersistentVolumeEndpointsTest.ReserveAndSlaveRemoval

 1 FAILED TEST
  YOU HAVE 20 DISABLED TESTS

I0626 07:38:41.668172  8464 process.cpp:968] Failed to accept socket: future discarded
make[3]: Leaving directory `/mesos/build'
make[3]: *** [CMakeFiles/check] Error 1
make[2]: *** [CMakeFiles/check.dir/all] Error 2
make[2]: Leaving directory `/mesos/build'
make[1]: *** [CMakeFiles/check.dir/rule] Error 2
make[1]: Leaving directory `/mesos/build'
make: *** [check] Error 2
+ docker rmi mesos-1498460537-9621
Untagged: mesos-1498460537-9621:latest
Deleted: sha256:e9f5147a5e8fe5a1949f3be37235377e4883761e27da7d31c16044e1cb5c8062
Deleted: sha256:340006aca3113d7f740da38f4778e55c361e685c234c1f3059f160bbc8d54986
Deleted: sha256:4546647262a89afb894fcd098fdb2929db5cabe8d14f4a3ef8210fc36f6502f8
Deleted: sha256:084491b2372dc921864f44574dc213cb23a30583d183990976a611cff6ffef1e
Deleted: sha256:4384e4ece368d475b6de9c212440f1bac6f339e7d0a72ea4d09a449f1fd45796
Deleted: sha256:62fa9ec75207b55f130a9e57f5364fe1d95181ea9b9ac8537638755f6309e86d
Deleted: sha256:6ee4cefadf9707fa2c83e5d6cdb18cc4f81e9f27060608405368a3b71fe3cc3a
Deleted: sha256:a12bf9a37cb324ad509cdab6b5efe4ebc5276d24cece4df034c53b23e961c22b
Deleted: sha256:f867b76637ef350ed21492a24ff6a531c743be9b4a5880a44a474856e429ec8b
Deleted: sha256:7827a538da8ef109f66f8ae79c701331483a6988520b7359e7e165957074d267
Deleted: sha256:b2558ef5094cc2ff88a3d89e67551e213f0f9ff17643b4c8db61d0e8cfdb2323
Deleted: sha256:c9b54627b9a7f9e252b35af82701cc8009fb3a8976b3940747edd84414e33052
Deleted: sha256:c0ff257229f454e8cf8f42790dd75a387bff774bdb6b3fc2c57949715a082d89
Deleted: sha256:050729674089cbe374ece75fb0a749317a96201aa53b11ab2458772d3d6a3776
Deleted: sha256:e7660c135c2b0fe7226c659de96d3fd9797bdb6778aa191eec41d4217f894fc7
Deleted: sha256:9d89f895a1e9104402c5a750f088c3204d8dd302bb198ce1d90e3c9d258576a8
Deleted: sha256:ebdefbbcdb03c2ca9d8f51ff586352f623637452a76ab0f0e6676f9ec3423302
Deleted: sha256:b3e1562d4f5ccc1e8ac8a19d8b4d28c3de17ed612151ba7f7dcbf938f2017c2b
Deleted: sha256:853d433144f1a4cffa51960a46eeceb2cbeb166a33215548abe27bb8e40be2fa
Deleted: sha256:4fc4253e850ed939ae78b1cd754b4213fa65eaa4e6fc70defea781e5b194366c
Deleted: sha256:039907b0a73cd879a5b6066433aef1cce46ba5b070d34e0dcb7fc16f94a8e3b2
Deleted: sha256:c8fc322053c6eb72c136e8e71bb54184328f7a3cd3b9f2220fadb01a37f63d27
Deleted: sha256:c10092dc9752c6225049d81240e88eb831ca2294bf486abe59ccab092aa6aedb
Deleted: sha256:81ca644edbfec1c0ecedb73deaeb1267fc4c542bba7d142355e1039013f73f50
Build step 'Execute shell' marked build as failure

Mime
View raw message