mesos-builds mailing list archives

Site index · List index
Message view « Date » · « Thread »
Top « Date » · « Thread »
From Apache Jenkins Server <jenk...@builds.apache.org>
Subject Build failed in Jenkins: Mesos-Buildbot » autotools,gcc,--verbose,GLOG_v=1 MESOS_VERBOSE=1,ubuntu:14.04,(ubuntu)&&(!ubuntu-us1)&&(!ubuntu-eu2) #3814
Date Mon, 19 Jun 2017 06:43:29 GMT
See <https://builds.apache.org/job/Mesos-Buildbot/BUILDTOOL=autotools,COMPILER=gcc,CONFIGURATION=--verbose,ENVIRONMENT=GLOG_v=1%20MESOS_VERBOSE=1,OS=ubuntu%3A14.04,label_exp=(ubuntu)&&(!ubuntu-us1)&&(!ubuntu-eu2)/3814/display/redirect?page=changes>

Changes:

[mpark] Fixed an error message to report the allocation role as intended.

------------------------------------------
[...truncated 28.53 MB...]
I0619 06:43:20.774643  4523 containerizer.cpp:230] Using isolation: posix/cpu,posix/mem,filesystem/posix,network/cni,environment_secret
W0619 06:43:20.775152  4523 backend.cpp:76] Failed to create 'aufs' backend: AufsBackend requires
root privileges
W0619 06:43:20.775300  4523 backend.cpp:76] Failed to create 'bind' backend: BindBackend requires
root privileges
I0619 06:43:20.775341  4523 provisioner.cpp:255] Using default backend 'copy'
I0619 06:43:20.778731  4546 slave.cpp:249] Mesos agent started on (764)@172.17.0.3:41572
I0619 06:43:20.778779  4546 slave.cpp:250] Flags at startup: --acls="" --appc_simple_discovery_uri_prefix="http://"
--appc_store_dir="/tmp/Endpoint_SlaveEndpointTest_AuthorizedRequest_2_3MCUzq/store/appc" --authenticate_http_readonly="true"
--authenticate_http_readwrite="true" --authenticatee="crammd5" --authentication_backoff_factor="1secs"
--authorizer="local" --cgroups_cpu_enable_pids_and_tids_count="false" --cgroups_enable_cfs="false"
--cgroups_hierarchy="/sys/fs/cgroup" --cgroups_limit_swap="false" --cgroups_root="mesos" --container_disk_watch_interval="15secs"
--containerizers="mesos" --credential="/tmp/Endpoint_SlaveEndpointTest_AuthorizedRequest_2_3MCUzq/credential"
--default_role="*" --disk_watch_interval="1mins" --docker="docker" --docker_kill_orphans="true"
--docker_registry="https://registry-1.docker.io" --docker_remove_delay="6hrs" --docker_socket="/var/run/docker.sock"
--docker_stop_timeout="0ns" --docker_store_dir="/tmp/Endpoint_SlaveEndpointTest_AuthorizedRequest_2_3MCUzq/store/docker"
--docker_volume_checkpoint_dir="/var/run/mesos/isolators/docker/volume" --enforce_container_disk_quota="false"
--executor_registration_timeout="1mins" --executor_reregistration_timeout="2secs" --executor_shutdown_grace_period="5secs"
--fetcher_cache_dir="/tmp/Endpoint_SlaveEndpointTest_AuthorizedRequest_2_3MCUzq/fetch" --fetcher_cache_size="2GB"
--frameworks_home="" --gc_delay="1weeks" --gc_disk_headroom="0.1" --hadoop_home="" --help="false"
--hostname_lookup="true" --http_command_executor="false" --http_credentials="/tmp/Endpoint_SlaveEndpointTest_AuthorizedRequest_2_3MCUzq/http_credentials"
--http_heartbeat_interval="30secs" --initialize_driver_logging="true" --isolation="posix/cpu,posix/mem"
--launcher="posix" --launcher_dir="/mesos/mesos-1.4.0/_build/src" --logbufsecs="0" --logging_level="INFO"
--max_completed_executors_per_framework="150" --oversubscribed_resources_interval="15secs"
--perf_duration="10secs" --perf_interval="1mins" --port="5051" --qos_correction_interval_min="0ns"
--quiet="false" --recover="reconnect" --recovery_timeout="15mins" --registration_backoff_factor="10ms"
--resources="cpus:2;gpus:0;mem:1024;disk:1024;ports:[31000-32000]" --revocable_cpu_low_priority="true"
--runtime_dir="/tmp/Endpoint_SlaveEndpointTest_AuthorizedRequest_2_3MCUzq" --sandbox_directory="/mnt/mesos/sandbox"
--strict="true" --switch_user="true" --systemd_enable_support="true" --systemd_runtime_directory="/run/systemd/system"
--version="false" --work_dir="/tmp/Endpoint_SlaveEndpointTest_AuthorizedRequest_2_vYOOeS"
I0619 06:43:20.779287  4546 credentials.hpp:86] Loading credential for authentication from
'/tmp/Endpoint_SlaveEndpointTest_AuthorizedRequest_2_3MCUzq/credential'
I0619 06:43:20.780122  4546 slave.cpp:282] Agent using credential for: test-principal
I0619 06:43:20.780192  4546 credentials.hpp:37] Loading credentials for authentication from
'/tmp/Endpoint_SlaveEndpointTest_AuthorizedRequest_2_3MCUzq/http_credentials'
I0619 06:43:20.780791  4546 http.cpp:1019] Creating default 'basic' HTTP authenticator for
realm 'mesos-agent-readonly'
I0619 06:43:20.781126  4546 http.cpp:1019] Creating default 'basic' HTTP authenticator for
realm 'mesos-agent-readwrite'
I0619 06:43:20.783640  4546 slave.cpp:553] Agent resources: cpus(*):2; mem(*):1024; disk(*):1024;
ports(*):[31000-32000]
I0619 06:43:20.783748  4546 slave.cpp:561] Agent attributes: [  ]
I0619 06:43:20.783785  4546 slave.cpp:566] Agent hostname: 913086a80acc
I0619 06:43:20.784113  4549 status_update_manager.cpp:177] Pausing sending status updates
I0619 06:43:20.786669  4549 state.cpp:62] Recovering state from '/tmp/Endpoint_SlaveEndpointTest_AuthorizedRequest_2_vYOOeS/meta'
I0619 06:43:20.787207  4545 status_update_manager.cpp:203] Recovering status update manager
I0619 06:43:20.787562  4549 containerizer.cpp:582] Recovering containerizer
I0619 06:43:20.789355  4543 provisioner.cpp:416] Provisioner recovery complete
I0619 06:43:20.790594  4545 slave.cpp:6128] Finished recovery
I0619 06:43:20.791342  4545 slave.cpp:6310] Querying resource estimator for oversubscribable
resources
I0619 06:43:20.791810  4548 slave.cpp:6324] Received oversubscribable resources {} from the
resource estimator
I0619 06:43:20.795366  4543 process.cpp:3779] Handling HTTP event for process 'slave(764)'
with path: '/slave(764)/containers'
I0619 06:43:20.797289  4543 http.cpp:1159] HTTP GET for /slave(764)/containers from 172.17.0.3:35040
I0619 06:43:20.798194  4543 http.cpp:980] Authorizing principal 'test-principal' to GET the
'/containers' endpoint
I0619 06:43:20.803699  4542 slave.cpp:818] Agent terminating
[       OK ] Endpoint/SlaveEndpointTest.AuthorizedRequest/2 (40 ms)
[ RUN      ] Endpoint/SlaveEndpointTest.UnauthorizedRequest/0
I0619 06:43:20.817106  4523 containerizer.cpp:230] Using isolation: posix/cpu,posix/mem,filesystem/posix,network/cni,environment_secret
W0619 06:43:20.818189  4523 backend.cpp:76] Failed to create 'aufs' backend: AufsBackend requires
root privileges
W0619 06:43:20.818387  4523 backend.cpp:76] Failed to create 'bind' backend: BindBackend requires
root privileges
I0619 06:43:20.818424  4523 provisioner.cpp:255] Using default backend 'copy'
I0619 06:43:20.823272  4548 slave.cpp:249] Mesos agent started on (765)@172.17.0.3:41572
I0619 06:43:20.823344  4548 slave.cpp:250] Flags at startup: --acls="" --appc_simple_discovery_uri_prefix="http://"
--appc_store_dir="/tmp/Endpoint_SlaveEndpointTest_UnauthorizedRequest_0_ajbdlE/store/appc"
--authenticate_http_readonly="true" --authenticate_http_readwrite="true" --authenticatee="crammd5"
--authentication_backoff_factor="1secs" --authorizer="local" --cgroups_cpu_enable_pids_and_tids_count="false"
--cgroups_enable_cfs="false" --cgroups_hierarchy="/sys/fs/cgroup" --cgroups_limit_swap="false"
--cgroups_root="mesos" --container_disk_watch_interval="15secs" --containerizers="mesos" --credential="/tmp/Endpoint_SlaveEndpointTest_UnauthorizedRequest_0_ajbdlE/credential"
--default_role="*" --disk_watch_interval="1mins" --docker="docker" --docker_kill_orphans="true"
--docker_registry="https://registry-1.docker.io" --docker_remove_delay="6hrs" --docker_socket="/var/run/docker.sock"
--docker_stop_timeout="0ns" --docker_store_dir="/tmp/Endpoint_SlaveEndpointTest_UnauthorizedRequest_0_ajbdlE/store/docker"
--docker_volume_checkpoint_dir="/var/run/mesos/isolators/docker/volume" --enforce_container_disk_quota="false"
--executor_registration_timeout="1mins" --executor_reregistration_timeout="2secs" --executor_shutdown_grace_period="5secs"
--fetcher_cache_dir="/tmp/Endpoint_SlaveEndpointTest_UnauthorizedRequest_0_ajbdlE/fetch" --fetcher_cache_size="2GB"
--frameworks_home="" --gc_delay="1weeks" --gc_disk_headroom="0.1" --hadoop_home="" --help="false"
--hostname_lookup="true" --http_command_executor="false" --http_credentials="/tmp/Endpoint_SlaveEndpointTest_UnauthorizedRequest_0_ajbdlE/http_credentials"
--http_heartbeat_interval="30secs" --initialize_driver_logging="true" --isolation="posix/cpu,posix/mem"
--launcher="posix" --launcher_dir="/mesos/mesos-1.4.0/_build/src" --logbufsecs="0" --logging_level="INFO"
--max_completed_executors_per_framework="150" --oversubscribed_resources_interval="15secs"
--perf_duration="10secs" --perf_interval="1mins" --port="5051" --qos_correction_interval_min="0ns"
--quiet="false" --recover="reconnect" --recovery_timeout="15mins" --registration_backoff_factor="10ms"
--resources="cpus:2;gpus:0;mem:1024;disk:1024;ports:[31000-32000]" --revocable_cpu_low_priority="true"
--runtime_dir="/tmp/Endpoint_SlaveEndpointTest_UnauthorizedRequest_0_ajbdlE" --sandbox_directory="/mnt/mesos/sandbox"
--strict="true" --switch_user="true" --systemd_enable_support="true" --systemd_runtime_directory="/run/systemd/system"
--version="false" --work_dir="/tmp/Endpoint_SlaveEndpointTest_UnauthorizedRequest_0_hkKKS5"
I0619 06:43:20.823927  4548 credentials.hpp:86] Loading credential for authentication from
'/tmp/Endpoint_SlaveEndpointTest_UnauthorizedRequest_0_ajbdlE/credential'
I0619 06:43:20.824187  4548 slave.cpp:282] Agent using credential for: test-principal
I0619 06:43:20.824231  4548 credentials.hpp:37] Loading credentials for authentication from
'/tmp/Endpoint_SlaveEndpointTest_UnauthorizedRequest_0_ajbdlE/http_credentials'
I0619 06:43:20.824491  4548 http.cpp:1019] Creating default 'basic' HTTP authenticator for
realm 'mesos-agent-readonly'
I0619 06:43:20.824801  4548 http.cpp:1019] Creating default 'basic' HTTP authenticator for
realm 'mesos-agent-readwrite'
I0619 06:43:20.827639  4548 slave.cpp:553] Agent resources: cpus(*):2; mem(*):1024; disk(*):1024;
ports(*):[31000-32000]
I0619 06:43:20.827760  4548 slave.cpp:561] Agent attributes: [  ]
I0619 06:43:20.827795  4548 slave.cpp:566] Agent hostname: 913086a80acc
I0619 06:43:20.828176  4547 status_update_manager.cpp:177] Pausing sending status updates
I0619 06:43:20.829895  4545 state.cpp:62] Recovering state from '/tmp/Endpoint_SlaveEndpointTest_UnauthorizedRequest_0_hkKKS5/meta'
I0619 06:43:20.830402  4545 status_update_manager.cpp:203] Recovering status update manager
I0619 06:43:20.830757  4544 containerizer.cpp:582] Recovering containerizer
I0619 06:43:20.832690  4544 provisioner.cpp:416] Provisioner recovery complete
I0619 06:43:20.833220  4547 slave.cpp:6128] Finished recovery
I0619 06:43:20.834656  4547 slave.cpp:6310] Querying resource estimator for oversubscribable
resources
I0619 06:43:20.835289  4549 slave.cpp:6324] Received oversubscribable resources {} from the
resource estimator
I0619 06:43:20.839793  4547 process.cpp:3779] Handling HTTP event for process 'slave(765)'
with path: '/slave(765)/monitor/statistics'
I0619 06:43:20.841994  4547 http.cpp:1159] HTTP GET for /slave(765)/monitor/statistics from
172.17.0.3:35042
I0619 06:43:20.842073  4547 http.cpp:980] Authorizing principal 'test-principal' to GET the
'/monitor/statistics' endpoint
I0619 06:43:20.846397  4547 slave.cpp:818] Agent terminating
[       OK ] Endpoint/SlaveEndpointTest.UnauthorizedRequest/0 (44 ms)
[ RUN      ] Endpoint/SlaveEndpointTest.UnauthorizedRequest/1
I0619 06:43:20.860693  4523 containerizer.cpp:230] Using isolation: posix/cpu,posix/mem,filesystem/posix,network/cni,environment_secret
W0619 06:43:20.862417  4523 backend.cpp:76] Failed to create 'aufs' backend: AufsBackend requires
root privileges
W0619 06:43:20.862658  4523 backend.cpp:76] Failed to create 'bind' backend: BindBackend requires
root privileges
I0619 06:43:20.862704  4523 provisioner.cpp:255] Using default backend 'copy'
I0619 06:43:20.866663  4549 slave.cpp:249] Mesos agent started on (766)@172.17.0.3:41572
I0619 06:43:20.866693  4549 slave.cpp:250] Flags at startup: --acls="" --appc_simple_discovery_uri_prefix="http://"
--appc_store_dir="/tmp/Endpoint_SlaveEndpointTest_UnauthorizedRequest_1_4YW6AS/store/appc"
--authenticate_http_readonly="true" --authenticate_http_readwrite="true" --authenticatee="crammd5"
--authentication_backoff_factor="1secs" --authorizer="local" --cgroups_cpu_enable_pids_and_tids_count="false"
--cgroups_enable_cfs="false" --cgroups_hierarchy="/sys/fs/cgroup" --cgroups_limit_swap="false"
--cgroups_root="mesos" --container_disk_watch_interval="15secs" --containerizers="mesos" --credential="/tmp/Endpoint_SlaveEndpointTest_UnauthorizedRequest_1_4YW6AS/credential"
--default_role="*" --disk_watch_interval="1mins" --docker="docker" --docker_kill_orphans="true"
--docker_registry="https://registry-1.docker.io" --docker_remove_delay="6hrs" --docker_socket="/var/run/docker.sock"
--docker_stop_timeout="0ns" --docker_store_dir="/tmp/Endpoint_SlaveEndpointTest_UnauthorizedRequest_1_4YW6AS/store/docker"
--docker_volume_checkpoint_dir="/var/run/mesos/isolators/docker/volume" --enforce_container_disk_quota="false"
--executor_registration_timeout="1mins" --executor_reregistration_timeout="2secs" --executor_shutdown_grace_period="5secs"
--fetcher_cache_dir="/tmp/Endpoint_SlaveEndpointTest_UnauthorizedRequest_1_4YW6AS/fetch" --fetcher_cache_size="2GB"
--frameworks_home="" --gc_delay="1weeks" --gc_disk_headroom="0.1" --hadoop_home="" --help="false"
--hostname_lookup="true" --http_command_executor="false" --http_credentials="/tmp/Endpoint_SlaveEndpointTest_UnauthorizedRequest_1_4YW6AS/http_credentials"
--http_heartbeat_interval="30secs" --initialize_driver_logging="true" --isolation="posix/cpu,posix/mem"
--launcher="posix" --launcher_dir="/mesos/mesos-1.4.0/_build/src" --logbufsecs="0" --logging_level="INFO"
--max_completed_executors_per_framework="150" --oversubscribed_resources_interval="15secs"
--perf_duration="10secs" --perf_interval="1mins" --port="5051" --qos_correction_interval_min="0ns"
--quiet="false" --recover="reconnect" --recovery_timeout="15mins" --registration_backoff_factor="10ms"
--resources="cpus:2;gpus:0;mem:1024;disk:1024;ports:[31000-32000]" --revocable_cpu_low_priority="true"
--runtime_dir="/tmp/Endpoint_SlaveEndpointTest_UnauthorizedRequest_1_4YW6AS" --sandbox_directory="/mnt/mesos/sandbox"
--strict="true" --switch_user="true" --systemd_enable_support="true" --systemd_runtime_directory="/run/systemd/system"
--version="false" --work_dir="/tmp/Endpoint_SlaveEndpointTest_UnauthorizedRequest_1_NcH10j"
I0619 06:43:20.867499  4549 credentials.hpp:86] Loading credential for authentication from
'/tmp/Endpoint_SlaveEndpointTest_UnauthorizedRequest_1_4YW6AS/credential'
I0619 06:43:20.870301  4549 slave.cpp:282] Agent using credential for: test-principal
I0619 06:43:20.870335  4549 credentials.hpp:37] Loading credentials for authentication from
'/tmp/Endpoint_SlaveEndpointTest_UnauthorizedRequest_1_4YW6AS/http_credentials'
I0619 06:43:20.870805  4549 http.cpp:1019] Creating default 'basic' HTTP authenticator for
realm 'mesos-agent-readonly'
I0619 06:43:20.871537  4549 http.cpp:1019] Creating default 'basic' HTTP authenticator for
realm 'mesos-agent-readwrite'
I0619 06:43:20.873137  4549 slave.cpp:553] Agent resources: cpus(*):2; mem(*):1024; disk(*):1024;
ports(*):[31000-32000]
I0619 06:43:20.873809  4549 slave.cpp:561] Agent attributes: [  ]
I0619 06:43:20.873973  4549 slave.cpp:566] Agent hostname: 913086a80acc
I0619 06:43:20.874707  4546 status_update_manager.cpp:177] Pausing sending status updates
I0619 06:43:20.876644  4546 state.cpp:62] Recovering state from '/tmp/Endpoint_SlaveEndpointTest_UnauthorizedRequest_1_NcH10j/meta'
I0619 06:43:20.877718  4544 status_update_manager.cpp:203] Recovering status update manager
I0619 06:43:20.878181  4544 containerizer.cpp:582] Recovering containerizer
I0619 06:43:20.880424  4544 provisioner.cpp:416] Provisioner recovery complete
I0619 06:43:20.880991  4545 slave.cpp:6128] Finished recovery
I0619 06:43:20.882195  4545 slave.cpp:6310] Querying resource estimator for oversubscribable
resources
I0619 06:43:20.882624  4545 slave.cpp:6324] Received oversubscribable resources {} from the
resource estimator
I0619 06:43:20.888344  4545 process.cpp:3779] Handling HTTP event for process 'slave(766)'
with path: '/slave(766)/monitor/statistics.json'
I0619 06:43:20.890724  4546 http.cpp:1159] HTTP GET for /slave(766)/monitor/statistics.json
from 172.17.0.3:35044
I0619 06:43:20.891247  4546 http.cpp:980] Authorizing principal 'test-principal' to GET the
'/monitor/statistics.json' endpoint
I0619 06:43:20.894877  4523 slave.cpp:818] Agent terminating
[       OK ] Endpoint/SlaveEndpointTest.UnauthorizedRequest/1 (46 ms)
[ RUN      ] Endpoint/SlaveEndpointTest.UnauthorizedRequest/2
I0619 06:43:20.907236  4523 containerizer.cpp:230] Using isolation: posix/cpu,posix/mem,filesystem/posix,network/cni,environment_secret
W0619 06:43:20.907763  4523 backend.cpp:76] Failed to create 'aufs' backend: AufsBackend requires
root privileges
W0619 06:43:20.907912  4523 backend.cpp:76] Failed to create 'bind' backend: BindBackend requires
root privileges
I0619 06:43:20.907954  4523 provisioner.cpp:255] Using default backend 'copy'
I0619 06:43:20.912067  4547 slave.cpp:249] Mesos agent started on (767)@172.17.0.3:41572
I0619 06:43:20.912101  4547 slave.cpp:250] Flags at startup: --acls="" --appc_simple_discovery_uri_prefix="http://"
--appc_store_dir="/tmp/Endpoint_SlaveEndpointTest_UnauthorizedRequest_2_qQeZn7/store/appc"
--authenticate_http_readonly="true" --authenticate_http_readwrite="true" --authenticatee="crammd5"
--authentication_backoff_factor="1secs" --authorizer="local" --cgroups_cpu_enable_pids_and_tids_count="false"
--cgroups_enable_cfs="false" --cgroups_hierarchy="/sys/fs/cgroup" --cgroups_limit_swap="false"
--cgroups_root="mesos" --container_disk_watch_interval="15secs" --containerizers="mesos" --credential="/tmp/Endpoint_SlaveEndpointTest_UnauthorizedRequest_2_qQeZn7/credential"
--default_role="*" --disk_watch_interval="1mins" --docker="docker" --docker_kill_orphans="true"
--docker_registry="https://registry-1.docker.io" --docker_remove_delay="6hrs" --docker_socket="/var/run/docker.sock"
--docker_stop_timeout="0ns" --docker_store_dir="/tmp/Endpoint_SlaveEndpointTest_UnauthorizedRequest_2_qQeZn7/store/docker"
--docker_volume_checkpoint_dir="/var/run/mesos/isolators/docker/volume" --enforce_container_disk_quota="false"
--executor_registration_timeout="1mins" --executor_reregistration_timeout="2secs" --executor_shutdown_grace_period="5secs"
--fetcher_cache_dir="/tmp/Endpoint_SlaveEndpointTest_UnauthorizedRequest_2_qQeZn7/fetch" --fetcher_cache_size="2GB"
--frameworks_home="" --gc_delay="1weeks" --gc_disk_headroom="0.1" --hadoop_home="" --help="false"
--hostname_lookup="true" --http_command_executor="false" --http_credentials="/tmp/Endpoint_SlaveEndpointTest_UnauthorizedRequest_2_qQeZn7/http_credentials"
--http_heartbeat_interval="30secs" --initialize_driver_logging="true" --isolation="posix/cpu,posix/mem"
--launcher="posix" --launcher_dir="/mesos/mesos-1.4.0/_build/src" --logbufsecs="0" --logging_level="INFO"
--max_completed_executors_per_framework="150" --oversubscribed_resources_interval="15secs"
--perf_duration="10secs" --perf_interval="1mins" --port="5051" --qos_correction_interval_min="0ns"
--quiet="false" --recover="reconnect" --recovery_timeout="15mins" --registration_backoff_factor="10ms"
--resources="cpus:2;gpus:0;mem:1024;disk:1024;ports:[31000-32000]" --revocable_cpu_low_priority="true"
--runtime_dir="/tmp/Endpoint_SlaveEndpointTest_UnauthorizedRequest_2_qQeZn7" --sandbox_directory="/mnt/mesos/sandbox"
--strict="true" --switch_user="true" --systemd_enable_support="true" --systemd_runtime_directory="/run/systemd/system"
--version="false" --work_dir="/tmp/Endpoint_SlaveEndpointTest_UnauthorizedRequest_2_HjnDFy"
I0619 06:43:20.913213  4547 credentials.hpp:86] Loading credential for authentication from
'/tmp/Endpoint_SlaveEndpointTest_UnauthorizedRequest_2_qQeZn7/credential'
I0619 06:43:20.913592  4547 slave.cpp:282] Agent using credential for: test-principal
I0619 06:43:20.913625  4547 credentials.hpp:37] Loading credentials for authentication from
'/tmp/Endpoint_SlaveEndpointTest_UnauthorizedRequest_2_qQeZn7/http_credentials'
I0619 06:43:20.914018  4547 http.cpp:1019] Creating default 'basic' HTTP authenticator for
realm 'mesos-agent-readonly'
I0619 06:43:20.914337  4547 http.cpp:1019] Creating default 'basic' HTTP authenticator for
realm 'mesos-agent-readwrite'
I0619 06:43:20.916005  4547 slave.cpp:553] Agent resources: cpus(*):2; mem(*):1024; disk(*):1024;
ports(*):[31000-32000]
I0619 06:43:20.916093  4547 slave.cpp:561] Agent attributes: [  ]
I0619 06:43:20.916107  4547 slave.cpp:566] Agent hostname: 913086a80acc
I0619 06:43:20.916370  4545 status_update_manager.cpp:177] Pausing sending status updates
I0619 06:43:20.919345  4542 state.cpp:62] Recovering state from '/tmp/Endpoint_SlaveEndpointTest_UnauthorizedRequest_2_HjnDFy/meta'
I0619 06:43:20.919939  4547 status_update_manager.cpp:203] Recovering status update manager
I0619 06:43:20.920372  4547 containerizer.cpp:582] Recovering containerizer
I0619 06:43:20.923048  4547 provisioner.cpp:416] Provisioner recovery complete
I0619 06:43:20.923621  4547 slave.cpp:6128] Finished recovery
I0619 06:43:20.925318  4547 slave.cpp:6310] Querying resource estimator for oversubscribable
resources
I0619 06:43:20.925889  4547 slave.cpp:6324] Received oversubscribable resources {} from the
resource estimator
I0619 06:43:20.930286  4549 process.cpp:3779] Handling HTTP event for process 'slave(767)'
with path: '/slave(767)/containers'
I0619 06:43:20.932626  4549 http.cpp:1159] HTTP GET for /slave(767)/containers from 172.17.0.3:35046
I0619 06:43:20.932869  4549 http.cpp:980] Authorizing principal 'test-principal' to GET the
'/containers' endpoint
I0619 06:43:20.936844  4548 slave.cpp:818] Agent terminating
[       OK ] Endpoint/SlaveEndpointTest.UnauthorizedRequest/2 (44 ms)
[ RUN      ] Endpoint/SlaveEndpointTest.NoAuthorizer/0
I0619 06:43:20.953408  4523 containerizer.cpp:230] Using isolation: posix/cpu,posix/mem,filesystem/posix,network/cni,environment_secret
W0619 06:43:20.954639  4523 backend.cpp:76] Failed to create 'aufs' backend: AufsBackend requires
root privileges
W0619 06:43:20.954778  4523 backend.cpp:76] Failed to create 'bind' backend: BindBackend requires
root privileges
I0619 06:43:20.954844  4523 provisioner.cpp:255] Using default backend 'copy'
I0619 06:43:20.957007  4523 cluster.cpp:448] Creating default 'local' authorizer
I0619 06:43:20.959447  4543 slave.cpp:249] Mesos agent started on (768)@172.17.0.3:41572
I0619 06:43:20.959492  4543 slave.cpp:250] Flags at startup: --acls="" --appc_simple_discovery_uri_prefix="http://"
--appc_store_dir="/tmp/Endpoint_SlaveEndpointTest_NoAuthorizer_0_d3KjGm/store/appc" --authenticate_http_readonly="true"
--authenticate_http_readwrite="true" --authenticatee="crammd5" --authentication_backoff_factor="1secs"
--authorizer="local" --cgroups_cpu_enable_pids_and_tids_count="false" --cgroups_enable_cfs="false"
--cgroups_hierarchy="/sys/fs/cgroup" --cgroups_limit_swap="false" --cgroups_root="mesos" --container_disk_watch_interval="15secs"
--containerizers="mesos" --credential="/tmp/Endpoint_SlaveEndpointTest_NoAuthorizer_0_d3KjGm/credential"
--default_role="*" --disk_watch_interval="1mins" --docker="docker" --docker_kill_orphans="true"
--docker_registry="https://registry-1.docker.io" --docker_remove_delay="6hrs" --docker_socket="/var/run/docker.sock"
--docker_stop_timeout="0ns" --docker_store_dir="/tmp/Endpoint_SlaveEndpointTest_NoAuthorizer_0_d3KjGm/store/docker"
--docker_volume_checkpoint_dir="/var/run/mesos/isolators/docker/volume" --enforce_container_disk_quota="false"
--executor_registration_timeout="1mins" --executor_reregistration_timeout="2secs" --executor_shutdown_grace_period="5secs"
--fetcher_cache_dir="/tmp/Endpoint_SlaveEndpointTest_NoAuthorizer_0_d3KjGm/fetch" --fetcher_cache_size="2GB"
--frameworks_home="" --gc_delay="1weeks" --gc_disk_headroom="0.1" --hadoop_home="" --help="false"
--hostname_lookup="true" --http_command_executor="false" --http_credentials="/tmp/Endpoint_SlaveEndpointTest_NoAuthorizer_0_d3KjGm/http_credentials"
--http_heartbeat_interval="30secs" --initialize_driver_logging="true" --isolation="posix/cpu,posix/mem"
--launcher="posix" --launcher_dir="/mesos/mesos-1.4.0/_build/src" --logbufsecs="0" --logging_level="INFO"
--max_completed_executors_per_framework="150" --oversubscribed_resources_interval="15secs"
--perf_duration="10secs" --perf_interval="1mins" --port="5051" --qos_correction_interval_min="0ns"
--quiet="false" --recover="reconnect" --recovery_timeout="15mins" --registration_backoff_factor="10ms"
--resources="cpus:2;gpus:0;mem:1024;disk:1024;ports:[31000-32000]" --revocable_cpu_low_priority="true"
--runtime_dir="/tmp/Endpoint_SlaveEndpointTest_NoAuthorizer_0_d3KjGm" --sandbox_directory="/mnt/mesos/sandbox"
--strict="true" --switch_user="true" --systemd_enable_support="true" --systemd_runtime_directory="/run/systemd/system"
--version="false" --work_dir="/tmp/Endpoint_SlaveEndpointTest_NoAuthorizer_0_Isg1PN"
I0619 06:43:20.960201  4543 credentials.hpp:86] Loading credential for authentication from
'/tmp/Endpoint_SlaveEndpointTest_NoAuthorizer_0_d3KjGm/credential'
I0619 06:43:20.960618  4543 slave.cpp:282] Agent using credential for: test-principal
I0619 06:43:20.961495  4543 credentials.hpp:37] Loading credentials for authentication from
'/tmp/Endpoint_SlaveEndpointTest_NoAuthorizer_0_d3KjGm/http_credentials'
I0619 06:43:20.962473  4543 http.cpp:1019] Creating default 'basic' HTTP authenticator for
realm 'mesos-agent-readonly'
I0619 06:43:20.962728  4543 http.cpp:1019] Creating default 'basic' HTTP authenticator for
realm 'mesos-agent-readwrite'
I0619 06:43:20.964145  4543 slave.cpp:553] Agent resources: cpus(*):2; mem(*):1024; disk(*):1024;
ports(*):[31000-32000]
I0619 06:43:20.964570  4543 slave.cpp:561] Agent attributes: [  ]
I0619 06:43:20.964606  4543 slave.cpp:566] Agent hostname: 913086a80acc
I0619 06:43:20.965102  4546 status_update_manager.cpp:177] Pausing sending status updates
I0619 06:43:20.967984  4549 state.cpp:62] Recovering state from '/tmp/Endpoint_SlaveEndpointTest_NoAuthorizer_0_Isg1PN/meta'
I0619 06:43:20.968510  4548 status_update_manager.cpp:203] Recovering status update manager
I0619 06:43:20.969233  4548 containerizer.cpp:582] Recovering containerizer
I0619 06:43:20.971010  4549 provisioner.cpp:416] Provisioner recovery complete
I0619 06:43:20.971516  4548 slave.cpp:6128] Finished recovery
I0619 06:43:20.973258  4548 slave.cpp:6310] Querying resource estimator for oversubscribable
resources
I0619 06:43:20.973728  4546 slave.cpp:6324] Received oversubscribable resources {} from the
resource estimator
I0619 06:43:20.977856  4546 process.cpp:3779] Handling HTTP event for process 'slave(768)'
with path: '/slave(768)/monitor/statistics'
I0619 06:43:20.979953  4545 http.cpp:1159] HTTP GET for /slave(768)/monitor/statistics from
172.17.0.3:35048
I0619 06:43:20.980074  4545 http.cpp:980] Authorizing principal 'test-principal' to GET the
'/monitor/statistics' endpoint
I0619 06:43:20.985960  4542 slave.cpp:818] Agent terminating
[       OK ] Endpoint/SlaveEndpointTest.NoAuthorizer/0 (46 ms)
[ RUN      ] Endpoint/SlaveEndpointTest.NoAuthorizer/1
I0619 06:43:21.000334  4523 containerizer.cpp:230] Using isolation: posix/cpu,posix/mem,filesystem/posix,network/cni,environment_secret
W0619 06:43:21.001037  4523 backend.cpp:76] Failed to create 'aufs' backend: AufsBackend requires
root privileges
W0619 06:43:21.001222  4523 backend.cpp:76] Failed to create 'bind' backend: BindBackend requires
root privileges
I0619 06:43:21.001351  4523 provisioner.cpp:255] Using default backend 'copy'
I0619 06:43:21.004103  4523 cluster.cpp:448] Creating default 'local' authorizer
I0619 06:43:21.006409  4542 slave.cpp:249] Mesos agent started on (769)@172.17.0.3:41572
I0619 06:43:21.006464  4542 slave.cpp:250] Flags at startup: --acls="" --appc_simple_discovery_uri_prefix="http://"
--appc_store_dir="/tmp/Endpoint_SlaveEndpointTest_NoAuthorizer_1_zYyJvC/store/appc" --authenticate_http_readonly="true"
--authenticate_http_readwrite="true" --authenticatee="crammd5" --authentication_backoff_factor="1secs"
--authorizer="local" --cgroups_cpu_enable_pids_and_tids_count="false" --cgroups_enable_cfs="false"
--cgroups_hierarchy="/sys/fs/cgroup" --cgroups_limit_swap="false" --cgroups_root="mesos" --container_disk_watch_interval="15secs"
--containerizers="mesos" --credential="/tmp/Endpoint_SlaveEndpointTest_NoAuthorizer_1_zYyJvC/credential"
--default_role="*" --disk_watch_interval="1mins" --docker="docker" --docker_kill_orphans="true"
--docker_registry="https://registry-1.docker.io" --docker_remove_delay="6hrs" --docker_socket="/var/run/docker.sock"
--docker_stop_timeout="0ns" --docker_store_dir="/tmp/Endpoint_SlaveEndpointTest_NoAuthorizer_1_zYyJvC/store/docker"
--docker_volume_checkpoint_dir="/var/run/mesos/isolators/docker/volume" --enforce_container_disk_quota="false"
--executor_registration_timeout="1mins" --executor_reregistration_timeout="2secs" --executor_shutdown_grace_period="5secs"
--fetcher_cache_dir="/tmp/Endpoint_SlaveEndpointTest_NoAuthorizer_1_zYyJvC/fetch" --fetcher_cache_size="2GB"
--frameworks_home="" --gc_delay="1weeks" --gc_disk_headroom="0.1" --hadoop_home="" --help="false"
--hostname_lookup="true" --http_command_executor="false" --http_credentials="/tmp/Endpoint_SlaveEndpointTest_NoAuthorizer_1_zYyJvC/http_credentials"
--http_heartbeat_interval="30secs" --initialize_driver_logging="true" --isolation="posix/cpu,posix/mem"
--launcher="posix" --launcher_dir="/mesos/mesos-1.4.0/_build/src" --logbufsecs="0" --logging_level="INFO"
--max_completed_executors_per_framework="150" --oversubscribed_resources_interval="15secs"
--perf_duration="10secs" --perf_interval="1mins" --port="5051" --qos_correction_interval_min="0ns"
--quiet="false" --recover="reconnect" --recovery_timeout="15mins" --registration_backoff_factor="10ms"
--resources="cpus:2;gpus:0;mem:1024;disk:1024;ports:[31000-32000]" --revocable_cpu_low_priority="true"
--runtime_dir="/tmp/Endpoint_SlaveEndpointTest_NoAuthorizer_1_zYyJvC" --sandbox_directory="/mnt/mesos/sandbox"
--strict="true" --switch_user="true" --systemd_enable_support="true" --systemd_runtime_directory="/run/systemd/system"
--version="false" --work_dir="/tmp/Endpoint_SlaveEndpointTest_NoAuthorizer_1_WVrdx3"
I0619 06:43:21.007395  4542 credentials.hpp:86] Loading credential for authentication from
'/tmp/Endpoint_SlaveEndpointTest_NoAuthorizer_1_zYyJvC/credential'
I0619 06:43:21.008167  4542 slave.cpp:282] Agent using credential for: test-principal
I0619 06:43:21.008224  4542 credentials.hpp:37] Loading credentials for authentication from
'/tmp/Endpoint_SlaveEndpointTest_NoAuthorizer_1_zYyJvC/http_credentials'
I0619 06:43:21.008705  4542 http.cpp:1019] Creating default 'basic' HTTP authenticator for
realm 'mesos-agent-readonly'
I0619 06:43:21.009023  4542 http.cpp:1019] Creating default 'basic' HTTP authenticator for
realm 'mesos-agent-readwrite'
I0619 06:43:21.011193  4542 slave.cpp:553] Agent resources: cpus(*):2; mem(*):1024; disk(*):1024;
ports(*):[31000-32000]
I0619 06:43:21.011590  4542 slave.cpp:561] Agent attributes: [  ]
I0619 06:43:21.011641  4542 slave.cpp:566] Agent hostname: 913086a80acc
I0619 06:43:21.011914  4549 status_update_manager.cpp:177] Pausing sending status updates
I0619 06:43:21.014583  4549 state.cpp:62] Recovering state from '/tmp/Endpoint_SlaveEndpointTest_NoAuthorizer_1_WVrdx3/meta'
I0619 06:43:21.015714  4546 status_update_manager.cpp:203] Recovering status update manager
I0619 06:43:21.016052  4549 containerizer.cpp:582] Recovering containerizer
I0619 06:43:21.018576  4548 provisioner.cpp:416] Provisioner recovery complete
I0619 06:43:21.019301  4546 slave.cpp:6128] Finished recovery
I0619 06:43:21.020346  4546 slave.cpp:6310] Querying resource estimator for oversubscribable
resources
I0619 06:43:21.020860  4546 slave.cpp:6324] Received oversubscribable resources {} from the
resource estimator
I0619 06:43:21.024596  4543 process.cpp:3779] Handling HTTP event for process 'slave(769)'
with path: '/slave(769)/monitor/statistics.json'
I0619 06:43:21.026917  4546 http.cpp:1159] HTTP GET for /slave(769)/monitor/statistics.json
from 172.17.0.3:35050
I0619 06:43:21.027139  4546 http.cpp:980] Authorizing principal 'test-principal' to GET the
'/monitor/statistics.json' endpoint
I0619 06:43:21.032685  4523 slave.cpp:818] Agent terminating
[       OK ] Endpoint/SlaveEndpointTest.NoAuthorizer/1 (46 ms)
[ RUN      ] Endpoint/SlaveEndpointTest.NoAuthorizer/2
I0619 06:43:21.048885  4523 containerizer.cpp:230] Using isolation: posix/cpu,posix/mem,filesystem/posix,network/cni,environment_secret
W0619 06:43:21.049924  4523 backend.cpp:76] Failed to create 'aufs' backend: AufsBackend requires
root privileges
W0619 06:43:21.050066  4523 backend.cpp:76] Failed to create 'bind' backend: BindBackend requires
root privileges
I0619 06:43:21.050112  4523 provisioner.cpp:255] Using default backend 'copy'
I0619 06:43:21.052168  4523 cluster.cpp:448] Creating default 'local' authorizer
I0619 06:43:21.054919  4545 slave.cpp:249] Mesos agent started on (770)@172.17.0.3:41572
I0619 06:43:21.054945  4545 slave.cpp:250] Flags at startup: --acls="" --appc_simple_discovery_uri_prefix="http://"
--appc_store_dir="/tmp/Endpoint_SlaveEndpointTest_NoAuthorizer_2_qNbxSS/store/appc" --authenticate_http_readonly="true"
--authenticate_http_readwrite="true" --authenticatee="crammd5" --authentication_backoff_factor="1secs"
--authorizer="local" --cgroups_cpu_enable_pids_and_tids_count="false" --cgroups_enable_cfs="false"
--cgroups_hierarchy="/sys/fs/cgroup" --cgroups_limit_swap="false" --cgroups_root="mesos" --container_disk_watch_interval="15secs"
--containerizers="mesos" --credential="/tmp/Endpoint_SlaveEndpointTest_NoAuthorizer_2_qNbxSS/credential"
--default_role="*" --disk_watch_interval="1mins" --docker="docker" --docker_kill_orphans="true"
--docker_registry="https://registry-1.docker.io" --docker_remove_delay="6hrs" --docker_socket="/var/run/docker.sock"
--docker_stop_timeout="0ns" --docker_store_dir="/tmp/Endpoint_SlaveEndpointTest_NoAuthorizer_2_qNbxSS/store/docker"
--docker_volume_checkpoint_dir="/var/run/mesos/isolators/docker/volume" --enforce_container_disk_quota="false"
--executor_registration_timeout="1mins" --executor_reregistration_timeout="2secs" --executor_shutdown_grace_period="5secs"
--fetcher_cache_dir="/tmp/Endpoint_SlaveEndpointTest_NoAuthorizer_2_qNbxSS/fetch" --fetcher_cache_size="2GB"
--frameworks_home="" --gc_delay="1weeks" --gc_disk_headroom="0.1" --hadoop_home="" --help="false"
--hostname_lookup="true" --http_command_executor="false" --http_credentials="/tmp/Endpoint_SlaveEndpointTest_NoAuthorizer_2_qNbxSS/http_credentials"
--http_heartbeat_interval="30secs" --initialize_driver_logging="true" --isolation="posix/cpu,posix/mem"
--launcher="posix" --launcher_dir="/mesos/mesos-1.4.0/_build/src" --logbufsecs="0" --logging_level="INFO"
--max_completed_executors_per_framework="150" --oversubscribed_resources_interval="15secs"
--perf_duration="10secs" --perf_interval="1mins" --port="5051" --qos_correction_interval_min="0ns"
--quiet="false" --recover="reconnect" --recovery_timeout="15mins" --registration_backoff_factor="10ms"
--resources="cpus:2;gpus:0;mem:1024;disk:1024;ports:[31000-32000]" --revocable_cpu_low_priority="true"
--runtime_dir="/tmp/Endpoint_SlaveEndpointTest_NoAuthorizer_2_qNbxSS" --sandbox_directory="/mnt/mesos/sandbox"
--strict="true" --switch_user="true" --systemd_enable_support="true" --systemd_runtime_directory="/run/systemd/system"
--version="false" --work_dir="/tmp/Endpoint_SlaveEndpointTest_NoAuthorizer_2_DGuCLj"
I0619 06:43:21.055383  4545 credentials.hpp:86] Loading credential for authentication from
'/tmp/Endpoint_SlaveEndpointTest_NoAuthorizer_2_qNbxSS/credential'
I0619 06:43:21.055645  4545 slave.cpp:282] Agent using credential for: test-principal
I0619 06:43:21.055814  4545 credentials.hpp:37] Loading credentials for authentication from
'/tmp/Endpoint_SlaveEndpointTest_NoAuthorizer_2_qNbxSS/http_credentials'
I0619 06:43:21.056169  4545 http.cpp:1019] Creating default 'basic' HTTP authenticator for
realm 'mesos-agent-readonly'
I0619 06:43:21.056473  4545 http.cpp:1019] Creating default 'basic' HTTP authenticator for
realm 'mesos-agent-readwrite'
I0619 06:43:21.058137  4545 slave.cpp:553] Agent resources: cpus(*):2; mem(*):1024; disk(*):1024;
ports(*):[31000-32000]
I0619 06:43:21.058221  4545 slave.cpp:561] Agent attributes: [  ]
I0619 06:43:21.058244  4545 slave.cpp:566] Agent hostname: 913086a80acc
I0619 06:43:21.058482  4542 status_update_manager.cpp:177] Pausing sending status updates
I0619 06:43:21.060415  4548 state.cpp:62] Recovering state from '/tmp/Endpoint_SlaveEndpointTest_NoAuthorizer_2_DGuCLj/meta'
I0619 06:43:21.061102  4545 status_update_manager.cpp:203] Recovering status update manager
I0619 06:43:21.061602  4545 containerizer.cpp:582] Recovering containerizer
I0619 06:43:21.063545  4545 provisioner.cpp:416] Provisioner recovery complete
I0619 06:43:21.064117  4545 slave.cpp:6128] Finished recovery
I0619 06:43:21.064836  4545 slave.cpp:6310] Querying resource estimator for oversubscribable
resources
I0619 06:43:21.065330  4544 slave.cpp:6324] Received oversubscribable resources {} from the
resource estimator
I0619 06:43:21.070101  4546 process.cpp:3779] Handling HTTP event for process 'slave(770)'
with path: '/slave(770)/containers'
I0619 06:43:21.071907  4549 http.cpp:1159] HTTP GET for /slave(770)/containers from 172.17.0.3:35052
I0619 06:43:21.072108  4549 http.cpp:980] Authorizing principal 'test-principal' to GET the
'/containers' endpoint
I0619 06:43:21.077900  4523 slave.cpp:818] Agent terminating
[       OK ] Endpoint/SlaveEndpointTest.NoAuthorizer/2 (44 ms)
[----------] 9 tests from Endpoint/SlaveEndpointTest (410 ms total)

[----------] Global test environment tear-down
[==========] 1611 tests from 176 test cases ran. (677327 ms total)
[  PASSED  ] 1607 tests.
[  FAILED  ] 4 tests, listed below:
[  FAILED  ] DefaultExecutorCheckTest.CommandCheckDeliveredAndReconciled
[  FAILED  ] DefaultExecutorCheckTest.CommandCheckStatusChange
[  FAILED  ] DefaultExecutorCheckTest.CommandCheckSeesParentsEnv
[  FAILED  ] DefaultExecutorCheckTest.CommandCheckSharesWorkDirWithTask

 4 FAILED TESTS
  YOU HAVE 20 DISABLED TESTS

E0619 06:43:21.135826  4550 process.cpp:968] Failed to accept socket: future discarded
make[4]: *** [check-local] Error 1
make[4]: Leaving directory `/mesos/mesos-1.4.0/_build/src'
make[3]: *** [check-am] Error 2
make[3]: Leaving directory `/mesos/mesos-1.4.0/_build/src'
make[2]: *** [check] Error 2
make[2]: Leaving directory `/mesos/mesos-1.4.0/_build/src'
make[1]: *** [check-recursive] Error 1
make[1]: Leaving directory `/mesos/mesos-1.4.0/_build'
make: *** [distcheck] Error 1
+ docker rmi mesos-1497850399-29732
Untagged: mesos-1497850399-29732:latest
Deleted: sha256:59b0ae46ea692217c65a47ffd40a0c189d48bf2a0a9fa0e93a3f1f9b6c90f5f5
Deleted: sha256:7df9a0f7e6362a39ecc7a315f5b087f82c6767955c76819947bac90bd2008b5a
Deleted: sha256:15bba6c599d136e53800ac2875c10842339c9fa9da0c8065beb35a042366309a
Deleted: sha256:c3c63d8142c8ad157903e16c60332f2d06f7745769d786a37810c2621b14cb44
Deleted: sha256:a4d1ab134b00bd72d5f554492252279517e4572219eb2ff53e599d3d3ec8f6d2
Deleted: sha256:4af91357e2770c640b51e1976779cf178ed8b1dbeea2ef87fe2fcf126507478e
Deleted: sha256:3bb5b2db4c9ad4931c1d5566d58639b585134b19b5630d55d9d462dc97cfe566
Deleted: sha256:2d7633072940d6056b45e20dfab0d403abf7928172eda6e9acd611c1e61ec21c
Deleted: sha256:fae3157969a451dec3a0c21bccfc6971ba45dcdaa995ef20e287e8af747fd929
Deleted: sha256:d0f060e33fdd535ce44ff690eb990333e121cea69de71f43ab9b7cbdeed3376c
Deleted: sha256:8b5304b3c0fa9279444f1669782cbbb45e7d89048366510896b62458518275a3
Deleted: sha256:a555c9122eb0c6d118f8d0fcfbe1d2fa2e9383a27906ca6c0fbacd866233d288
Deleted: sha256:c90161d24cc74ddac68cbfb485d6f6195e46f1fa579c543e75082a85f9672a55
Deleted: sha256:4108ea24e6f335cafb7c36f4cef8c1d6403cb8814b954e75d508458287a53f4b
Deleted: sha256:d4694fa64468d395c26264b17ca77bd47a80a1c9da2a9477edd0d5bbf757cf6d
Deleted: sha256:bea57a486ead967ec5a07fafca02f0977ff7823a69ef3ccfc83d44d958af070f
Deleted: sha256:6e34657b3f585f5d4829ff8d979f94a048fbce569023683310bc6dcb63094842
Deleted: sha256:d276ba76074316c9f5d6f6dabce1c791acc0a7b8fc24c447f88e1b58a0e96ae9
Deleted: sha256:36c6a3569a7fdeda394847dca869c6f7c68012e1af0e9d8fc5883b151b569620
Deleted: sha256:3fed64534aa8fb0a1c327e7baa16a91291e1f21674e3e3f47ba079a85bea58cc
Deleted: sha256:a147246c6717b348bb1c96736ae6cf914a1757151583535b16faca3fa5692ab9
Deleted: sha256:3995e27ce40c3365f6ca7a8600144a2e183b83ca2e50e7079db76142fc69a36e
Deleted: sha256:df7ebfc1f05b1a78f1a76775dccd253678ff80e7715bbe188f298d67443f083b
Deleted: sha256:1ffd9596d8fc1058ba69c8cc730012b3f233435a5a0cdcde83e59f517fbab993
Build step 'Execute shell' marked build as failure

Mime
View raw message