mesos-builds mailing list archives

Site index · List index
Message view « Date » · « Thread »
Top « Date » · « Thread »
From Apache Jenkins Server <jenk...@builds.apache.org>
Subject Build failed in Jenkins: Mesos-Reviewbot #18245
Date Fri, 02 Jun 2017 10:53:51 GMT
See <https://builds.apache.org/job/Mesos-Reviewbot/18245/display/redirect>

------------------------------------------
[...truncated 27.91 MB...]
I0602 10:53:42.349956  4516 containerizer.cpp:230] Using isolation: posix/cpu,posix/mem,filesystem/posix,network/cni,environment_secret
W0602 10:53:42.350710  4516 backend.cpp:76] Failed to create 'overlay' backend: OverlayBackend
requires root privileges
W0602 10:53:42.350908  4516 backend.cpp:76] Failed to create 'bind' backend: BindBackend requires
root privileges
I0602 10:53:42.350950  4516 provisioner.cpp:255] Using default backend 'copy'
I0602 10:53:42.356056  4542 slave.cpp:248] Mesos agent started on (754)@172.17.0.2:39127
I0602 10:53:42.356101  4542 slave.cpp:249] Flags at startup: --acls="" --appc_simple_discovery_uri_prefix="http://"
--appc_store_dir="/tmp/Endpoint_SlaveEndpointTest_AuthorizedRequest_2_EfuQIA/store/appc" --authenticate_http_readonly="true"
--authenticate_http_readwrite="true" --authenticatee="crammd5" --authentication_backoff_factor="1secs"
--authorizer="local" --cgroups_cpu_enable_pids_and_tids_count="false" --cgroups_enable_cfs="false"
--cgroups_hierarchy="/sys/fs/cgroup" --cgroups_limit_swap="false" --cgroups_root="mesos" --container_disk_watch_interval="15secs"
--containerizers="mesos" --credential="/tmp/Endpoint_SlaveEndpointTest_AuthorizedRequest_2_EfuQIA/credential"
--default_role="*" --disk_watch_interval="1mins" --docker="docker" --docker_kill_orphans="true"
--docker_registry="https://registry-1.docker.io" --docker_remove_delay="6hrs" --docker_socket="/var/run/docker.sock"
--docker_stop_timeout="0ns" --docker_store_dir="/tmp/Endpoint_SlaveEndpointTest_AuthorizedRequest_2_EfuQIA/store/docker"
--docker_volume_checkpoint_dir="/var/run/mesos/isolators/docker/volume" --enforce_container_disk_quota="false"
--executor_registration_timeout="1mins" --executor_reregistration_timeout="2secs" --executor_shutdown_grace_period="5secs"
--fetcher_cache_dir="/tmp/Endpoint_SlaveEndpointTest_AuthorizedRequest_2_EfuQIA/fetch" --fetcher_cache_size="2GB"
--frameworks_home="" --gc_delay="1weeks" --gc_disk_headroom="0.1" --hadoop_home="" --help="false"
--hostname_lookup="true" --http_command_executor="false" --http_credentials="/tmp/Endpoint_SlaveEndpointTest_AuthorizedRequest_2_EfuQIA/http_credentials"
--http_heartbeat_interval="30secs" --initialize_driver_logging="true" --isolation="posix/cpu,posix/mem"
--launcher="posix" --launcher_dir="/mesos/mesos-1.4.0/_build/src" --logbufsecs="0" --logging_level="INFO"
--max_completed_executors_per_framework="150" --oversubscribed_resources_interval="15secs"
--perf_duration="10secs" --perf_interval="1mins" --port="5051" --qos_correction_interval_min="0ns"
--quiet="false" --recover="reconnect" --recovery_timeout="15mins" --registration_backoff_factor="10ms"
--resources="cpus:2;gpus:0;mem:1024;disk:1024;ports:[31000-32000]" --revocable_cpu_low_priority="true"
--runtime_dir="/tmp/Endpoint_SlaveEndpointTest_AuthorizedRequest_2_EfuQIA" --sandbox_directory="/mnt/mesos/sandbox"
--strict="true" --switch_user="true" --systemd_enable_support="true" --systemd_runtime_directory="/run/systemd/system"
--version="false" --work_dir="/tmp/Endpoint_SlaveEndpointTest_AuthorizedRequest_2_mSR38z"
I0602 10:53:42.356797  4542 credentials.hpp:86] Loading credential for authentication from
'/tmp/Endpoint_SlaveEndpointTest_AuthorizedRequest_2_EfuQIA/credential'
I0602 10:53:42.357059  4542 slave.cpp:281] Agent using credential for: test-principal
I0602 10:53:42.357081  4542 credentials.hpp:37] Loading credentials for authentication from
'/tmp/Endpoint_SlaveEndpointTest_AuthorizedRequest_2_EfuQIA/http_credentials'
I0602 10:53:42.357420  4542 http.cpp:975] Creating default 'basic' HTTP authenticator for
realm 'mesos-agent-readonly'
I0602 10:53:42.357625  4542 http.cpp:975] Creating default 'basic' HTTP authenticator for
realm 'mesos-agent-readwrite'
I0602 10:53:42.359577  4542 slave.cpp:552] Agent resources: cpus(*):2; mem(*):1024; disk(*):1024;
ports(*):[31000-32000]
I0602 10:53:42.359714  4542 slave.cpp:560] Agent attributes: [  ]
I0602 10:53:42.359735  4542 slave.cpp:565] Agent hostname: 41ce6861e2e4
I0602 10:53:42.360008  4536 status_update_manager.cpp:177] Pausing sending status updates
I0602 10:53:42.361896  4541 state.cpp:62] Recovering state from '/tmp/Endpoint_SlaveEndpointTest_AuthorizedRequest_2_mSR38z/meta'
I0602 10:53:42.362392  4537 status_update_manager.cpp:203] Recovering status update manager
I0602 10:53:42.362754  4537 containerizer.cpp:582] Recovering containerizer
I0602 10:53:42.365695  4537 provisioner.cpp:416] Provisioner recovery complete
I0602 10:53:42.366327  4536 slave.cpp:6119] Finished recovery
I0602 10:53:42.367024  4536 slave.cpp:6301] Querying resource estimator for oversubscribable
resources
I0602 10:53:42.367655  4537 slave.cpp:6315] Received oversubscribable resources {} from the
resource estimator
I0602 10:53:42.371738  4541 process.cpp:3778] Handling HTTP event for process 'slave(754)'
with path: '/slave(754)/containers'
I0602 10:53:42.373957  4536 http.cpp:1115] HTTP GET for /slave(754)/containers from 172.17.0.2:33252
I0602 10:53:42.374089  4536 http.cpp:936] Authorizing principal 'test-principal' to GET the
'/containers' endpoint
I0602 10:53:42.378907  4540 slave.cpp:817] Agent terminating
[       OK ] Endpoint/SlaveEndpointTest.AuthorizedRequest/2 (43 ms)
[ RUN      ] Endpoint/SlaveEndpointTest.UnauthorizedRequest/0
I0602 10:53:42.394249  4516 containerizer.cpp:230] Using isolation: posix/cpu,posix/mem,filesystem/posix,network/cni,environment_secret
W0602 10:53:42.395031  4516 backend.cpp:76] Failed to create 'overlay' backend: OverlayBackend
requires root privileges
W0602 10:53:42.395206  4516 backend.cpp:76] Failed to create 'bind' backend: BindBackend requires
root privileges
I0602 10:53:42.395249  4516 provisioner.cpp:255] Using default backend 'copy'
I0602 10:53:42.400127  4541 slave.cpp:248] Mesos agent started on (755)@172.17.0.2:39127
I0602 10:53:42.400169  4541 slave.cpp:249] Flags at startup: --acls="" --appc_simple_discovery_uri_prefix="http://"
--appc_store_dir="/tmp/Endpoint_SlaveEndpointTest_UnauthorizedRequest_0_6VueqD/store/appc"
--authenticate_http_readonly="true" --authenticate_http_readwrite="true" --authenticatee="crammd5"
--authentication_backoff_factor="1secs" --authorizer="local" --cgroups_cpu_enable_pids_and_tids_count="false"
--cgroups_enable_cfs="false" --cgroups_hierarchy="/sys/fs/cgroup" --cgroups_limit_swap="false"
--cgroups_root="mesos" --container_disk_watch_interval="15secs" --containerizers="mesos" --credential="/tmp/Endpoint_SlaveEndpointTest_UnauthorizedRequest_0_6VueqD/credential"
--default_role="*" --disk_watch_interval="1mins" --docker="docker" --docker_kill_orphans="true"
--docker_registry="https://registry-1.docker.io" --docker_remove_delay="6hrs" --docker_socket="/var/run/docker.sock"
--docker_stop_timeout="0ns" --docker_store_dir="/tmp/Endpoint_SlaveEndpointTest_UnauthorizedRequest_0_6VueqD/store/docker"
--docker_volume_checkpoint_dir="/var/run/mesos/isolators/docker/volume" --enforce_container_disk_quota="false"
--executor_registration_timeout="1mins" --executor_reregistration_timeout="2secs" --executor_shutdown_grace_period="5secs"
--fetcher_cache_dir="/tmp/Endpoint_SlaveEndpointTest_UnauthorizedRequest_0_6VueqD/fetch" --fetcher_cache_size="2GB"
--frameworks_home="" --gc_delay="1weeks" --gc_disk_headroom="0.1" --hadoop_home="" --help="false"
--hostname_lookup="true" --http_command_executor="false" --http_credentials="/tmp/Endpoint_SlaveEndpointTest_UnauthorizedRequest_0_6VueqD/http_credentials"
--http_heartbeat_interval="30secs" --initialize_driver_logging="true" --isolation="posix/cpu,posix/mem"
--launcher="posix" --launcher_dir="/mesos/mesos-1.4.0/_build/src" --logbufsecs="0" --logging_level="INFO"
--max_completed_executors_per_framework="150" --oversubscribed_resources_interval="15secs"
--perf_duration="10secs" --perf_interval="1mins" --port="5051" --qos_correction_interval_min="0ns"
--quiet="false" --recover="reconnect" --recovery_timeout="15mins" --registration_backoff_factor="10ms"
--resources="cpus:2;gpus:0;mem:1024;disk:1024;ports:[31000-32000]" --revocable_cpu_low_priority="true"
--runtime_dir="/tmp/Endpoint_SlaveEndpointTest_UnauthorizedRequest_0_6VueqD" --sandbox_directory="/mnt/mesos/sandbox"
--strict="true" --switch_user="true" --systemd_enable_support="true" --systemd_runtime_directory="/run/systemd/system"
--version="false" --work_dir="/tmp/Endpoint_SlaveEndpointTest_UnauthorizedRequest_0_k7tkJC"
I0602 10:53:42.401028  4541 credentials.hpp:86] Loading credential for authentication from
'/tmp/Endpoint_SlaveEndpointTest_UnauthorizedRequest_0_6VueqD/credential'
I0602 10:53:42.401401  4541 slave.cpp:281] Agent using credential for: test-principal
I0602 10:53:42.401437  4541 credentials.hpp:37] Loading credentials for authentication from
'/tmp/Endpoint_SlaveEndpointTest_UnauthorizedRequest_0_6VueqD/http_credentials'
I0602 10:53:42.401954  4541 http.cpp:975] Creating default 'basic' HTTP authenticator for
realm 'mesos-agent-readonly'
I0602 10:53:42.402334  4541 http.cpp:975] Creating default 'basic' HTTP authenticator for
realm 'mesos-agent-readwrite'
I0602 10:53:42.404587  4541 slave.cpp:552] Agent resources: cpus(*):2; mem(*):1024; disk(*):1024;
ports(*):[31000-32000]
I0602 10:53:42.404731  4541 slave.cpp:560] Agent attributes: [  ]
I0602 10:53:42.404755  4541 slave.cpp:565] Agent hostname: 41ce6861e2e4
I0602 10:53:42.405109  4539 status_update_manager.cpp:177] Pausing sending status updates
I0602 10:53:42.407052  4536 state.cpp:62] Recovering state from '/tmp/Endpoint_SlaveEndpointTest_UnauthorizedRequest_0_k7tkJC/meta'
I0602 10:53:42.407551  4541 status_update_manager.cpp:203] Recovering status update manager
I0602 10:53:42.407968  4538 containerizer.cpp:582] Recovering containerizer
I0602 10:53:42.410142  4537 provisioner.cpp:416] Provisioner recovery complete
I0602 10:53:42.410765  4542 slave.cpp:6119] Finished recovery
I0602 10:53:42.411445  4542 slave.cpp:6301] Querying resource estimator for oversubscribable
resources
I0602 10:53:42.411839  4541 slave.cpp:6315] Received oversubscribable resources {} from the
resource estimator
I0602 10:53:42.417186  4539 process.cpp:3778] Handling HTTP event for process 'slave(755)'
with path: '/slave(755)/monitor/statistics'
I0602 10:53:42.419208  4537 http.cpp:1115] HTTP GET for /slave(755)/monitor/statistics from
172.17.0.2:33258
I0602 10:53:42.419328  4537 http.cpp:936] Authorizing principal 'test-principal' to GET the
'/monitor/statistics' endpoint
I0602 10:53:42.422560  4538 slave.cpp:817] Agent terminating
[       OK ] Endpoint/SlaveEndpointTest.UnauthorizedRequest/0 (43 ms)
[ RUN      ] Endpoint/SlaveEndpointTest.UnauthorizedRequest/1
I0602 10:53:42.437870  4516 containerizer.cpp:230] Using isolation: posix/cpu,posix/mem,filesystem/posix,network/cni,environment_secret
W0602 10:53:42.438640  4516 backend.cpp:76] Failed to create 'overlay' backend: OverlayBackend
requires root privileges
W0602 10:53:42.438807  4516 backend.cpp:76] Failed to create 'bind' backend: BindBackend requires
root privileges
I0602 10:53:42.438849  4516 provisioner.cpp:255] Using default backend 'copy'
I0602 10:53:42.443713  4542 slave.cpp:248] Mesos agent started on (756)@172.17.0.2:39127
I0602 10:53:42.443758  4542 slave.cpp:249] Flags at startup: --acls="" --appc_simple_discovery_uri_prefix="http://"
--appc_store_dir="/tmp/Endpoint_SlaveEndpointTest_UnauthorizedRequest_1_8K68zG/store/appc"
--authenticate_http_readonly="true" --authenticate_http_readwrite="true" --authenticatee="crammd5"
--authentication_backoff_factor="1secs" --authorizer="local" --cgroups_cpu_enable_pids_and_tids_count="false"
--cgroups_enable_cfs="false" --cgroups_hierarchy="/sys/fs/cgroup" --cgroups_limit_swap="false"
--cgroups_root="mesos" --container_disk_watch_interval="15secs" --containerizers="mesos" --credential="/tmp/Endpoint_SlaveEndpointTest_UnauthorizedRequest_1_8K68zG/credential"
--default_role="*" --disk_watch_interval="1mins" --docker="docker" --docker_kill_orphans="true"
--docker_registry="https://registry-1.docker.io" --docker_remove_delay="6hrs" --docker_socket="/var/run/docker.sock"
--docker_stop_timeout="0ns" --docker_store_dir="/tmp/Endpoint_SlaveEndpointTest_UnauthorizedRequest_1_8K68zG/store/docker"
--docker_volume_checkpoint_dir="/var/run/mesos/isolators/docker/volume" --enforce_container_disk_quota="false"
--executor_registration_timeout="1mins" --executor_reregistration_timeout="2secs" --executor_shutdown_grace_period="5secs"
--fetcher_cache_dir="/tmp/Endpoint_SlaveEndpointTest_UnauthorizedRequest_1_8K68zG/fetch" --fetcher_cache_size="2GB"
--frameworks_home="" --gc_delay="1weeks" --gc_disk_headroom="0.1" --hadoop_home="" --help="false"
--hostname_lookup="true" --http_command_executor="false" --http_credentials="/tmp/Endpoint_SlaveEndpointTest_UnauthorizedRequest_1_8K68zG/http_credentials"
--http_heartbeat_interval="30secs" --initialize_driver_logging="true" --isolation="posix/cpu,posix/mem"
--launcher="posix" --launcher_dir="/mesos/mesos-1.4.0/_build/src" --logbufsecs="0" --logging_level="INFO"
--max_completed_executors_per_framework="150" --oversubscribed_resources_interval="15secs"
--perf_duration="10secs" --perf_interval="1mins" --port="5051" --qos_correction_interval_min="0ns"
--quiet="false" --recover="reconnect" --recovery_timeout="15mins" --registration_backoff_factor="10ms"
--resources="cpus:2;gpus:0;mem:1024;disk:1024;ports:[31000-32000]" --revocable_cpu_low_priority="true"
--runtime_dir="/tmp/Endpoint_SlaveEndpointTest_UnauthorizedRequest_1_8K68zG" --sandbox_directory="/mnt/mesos/sandbox"
--strict="true" --switch_user="true" --systemd_enable_support="true" --systemd_runtime_directory="/run/systemd/system"
--version="false" --work_dir="/tmp/Endpoint_SlaveEndpointTest_UnauthorizedRequest_1_wvt8LF"
I0602 10:53:42.444568  4542 credentials.hpp:86] Loading credential for authentication from
'/tmp/Endpoint_SlaveEndpointTest_UnauthorizedRequest_1_8K68zG/credential'
I0602 10:53:42.444826  4542 slave.cpp:281] Agent using credential for: test-principal
I0602 10:53:42.444855  4542 credentials.hpp:37] Loading credentials for authentication from
'/tmp/Endpoint_SlaveEndpointTest_UnauthorizedRequest_1_8K68zG/http_credentials'
I0602 10:53:42.445212  4542 http.cpp:975] Creating default 'basic' HTTP authenticator for
realm 'mesos-agent-readonly'
I0602 10:53:42.445441  4542 http.cpp:975] Creating default 'basic' HTTP authenticator for
realm 'mesos-agent-readwrite'
I0602 10:53:42.447504  4542 slave.cpp:552] Agent resources: cpus(*):2; mem(*):1024; disk(*):1024;
ports(*):[31000-32000]
I0602 10:53:42.447645  4542 slave.cpp:560] Agent attributes: [  ]
I0602 10:53:42.447664  4542 slave.cpp:565] Agent hostname: 41ce6861e2e4
I0602 10:53:42.447903  4535 status_update_manager.cpp:177] Pausing sending status updates
I0602 10:53:42.449812  4541 state.cpp:62] Recovering state from '/tmp/Endpoint_SlaveEndpointTest_UnauthorizedRequest_1_wvt8LF/meta'
I0602 10:53:42.450366  4536 status_update_manager.cpp:203] Recovering status update manager
I0602 10:53:42.450664  4535 containerizer.cpp:582] Recovering containerizer
I0602 10:53:42.452939  4537 provisioner.cpp:416] Provisioner recovery complete
I0602 10:53:42.453613  4535 slave.cpp:6119] Finished recovery
I0602 10:53:42.454509  4535 slave.cpp:6301] Querying resource estimator for oversubscribable
resources
I0602 10:53:42.455034  4540 slave.cpp:6315] Received oversubscribable resources {} from the
resource estimator
I0602 10:53:42.458904  4538 process.cpp:3778] Handling HTTP event for process 'slave(756)'
with path: '/slave(756)/monitor/statistics.json'
I0602 10:53:42.461144  4538 http.cpp:1115] HTTP GET for /slave(756)/monitor/statistics.json
from 172.17.0.2:33260
I0602 10:53:42.461262  4538 http.cpp:936] Authorizing principal 'test-principal' to GET the
'/monitor/statistics.json' endpoint
I0602 10:53:42.465294  4538 slave.cpp:817] Agent terminating
[       OK ] Endpoint/SlaveEndpointTest.UnauthorizedRequest/1 (42 ms)
[ RUN      ] Endpoint/SlaveEndpointTest.UnauthorizedRequest/2
I0602 10:53:42.481720  4516 containerizer.cpp:230] Using isolation: posix/cpu,posix/mem,filesystem/posix,network/cni,environment_secret
W0602 10:53:42.482483  4516 backend.cpp:76] Failed to create 'overlay' backend: OverlayBackend
requires root privileges
W0602 10:53:42.482650  4516 backend.cpp:76] Failed to create 'bind' backend: BindBackend requires
root privileges
I0602 10:53:42.482692  4516 provisioner.cpp:255] Using default backend 'copy'
I0602 10:53:42.487671  4538 slave.cpp:248] Mesos agent started on (757)@172.17.0.2:39127
I0602 10:53:42.487715  4538 slave.cpp:249] Flags at startup: --acls="" --appc_simple_discovery_uri_prefix="http://"
--appc_store_dir="/tmp/Endpoint_SlaveEndpointTest_UnauthorizedRequest_2_mAP5bK/store/appc"
--authenticate_http_readonly="true" --authenticate_http_readwrite="true" --authenticatee="crammd5"
--authentication_backoff_factor="1secs" --authorizer="local" --cgroups_cpu_enable_pids_and_tids_count="false"
--cgroups_enable_cfs="false" --cgroups_hierarchy="/sys/fs/cgroup" --cgroups_limit_swap="false"
--cgroups_root="mesos" --container_disk_watch_interval="15secs" --containerizers="mesos" --credential="/tmp/Endpoint_SlaveEndpointTest_UnauthorizedRequest_2_mAP5bK/credential"
--default_role="*" --disk_watch_interval="1mins" --docker="docker" --docker_kill_orphans="true"
--docker_registry="https://registry-1.docker.io" --docker_remove_delay="6hrs" --docker_socket="/var/run/docker.sock"
--docker_stop_timeout="0ns" --docker_store_dir="/tmp/Endpoint_SlaveEndpointTest_UnauthorizedRequest_2_mAP5bK/store/docker"
--docker_volume_checkpoint_dir="/var/run/mesos/isolators/docker/volume" --enforce_container_disk_quota="false"
--executor_registration_timeout="1mins" --executor_reregistration_timeout="2secs" --executor_shutdown_grace_period="5secs"
--fetcher_cache_dir="/tmp/Endpoint_SlaveEndpointTest_UnauthorizedRequest_2_mAP5bK/fetch" --fetcher_cache_size="2GB"
--frameworks_home="" --gc_delay="1weeks" --gc_disk_headroom="0.1" --hadoop_home="" --help="false"
--hostname_lookup="true" --http_command_executor="false" --http_credentials="/tmp/Endpoint_SlaveEndpointTest_UnauthorizedRequest_2_mAP5bK/http_credentials"
--http_heartbeat_interval="30secs" --initialize_driver_logging="true" --isolation="posix/cpu,posix/mem"
--launcher="posix" --launcher_dir="/mesos/mesos-1.4.0/_build/src" --logbufsecs="0" --logging_level="INFO"
--max_completed_executors_per_framework="150" --oversubscribed_resources_interval="15secs"
--perf_duration="10secs" --perf_interval="1mins" --port="5051" --qos_correction_interval_min="0ns"
--quiet="false" --recover="reconnect" --recovery_timeout="15mins" --registration_backoff_factor="10ms"
--resources="cpus:2;gpus:0;mem:1024;disk:1024;ports:[31000-32000]" --revocable_cpu_low_priority="true"
--runtime_dir="/tmp/Endpoint_SlaveEndpointTest_UnauthorizedRequest_2_mAP5bK" --sandbox_directory="/mnt/mesos/sandbox"
--strict="true" --switch_user="true" --systemd_enable_support="true" --systemd_runtime_directory="/run/systemd/system"
--version="false" --work_dir="/tmp/Endpoint_SlaveEndpointTest_UnauthorizedRequest_2_orTYgJ"
I0602 10:53:42.488708  4538 credentials.hpp:86] Loading credential for authentication from
'/tmp/Endpoint_SlaveEndpointTest_UnauthorizedRequest_2_mAP5bK/credential'
I0602 10:53:42.489174  4538 slave.cpp:281] Agent using credential for: test-principal
I0602 10:53:42.489207  4538 credentials.hpp:37] Loading credentials for authentication from
'/tmp/Endpoint_SlaveEndpointTest_UnauthorizedRequest_2_mAP5bK/http_credentials'
I0602 10:53:42.489723  4538 http.cpp:975] Creating default 'basic' HTTP authenticator for
realm 'mesos-agent-readonly'
I0602 10:53:42.490082  4538 http.cpp:975] Creating default 'basic' HTTP authenticator for
realm 'mesos-agent-readwrite'
I0602 10:53:42.492287  4538 slave.cpp:552] Agent resources: cpus(*):2; mem(*):1024; disk(*):1024;
ports(*):[31000-32000]
I0602 10:53:42.492429  4538 slave.cpp:560] Agent attributes: [  ]
I0602 10:53:42.492449  4538 slave.cpp:565] Agent hostname: 41ce6861e2e4
I0602 10:53:42.492784  4536 status_update_manager.cpp:177] Pausing sending status updates
I0602 10:53:42.494887  4538 state.cpp:62] Recovering state from '/tmp/Endpoint_SlaveEndpointTest_UnauthorizedRequest_2_orTYgJ/meta'
I0602 10:53:42.495488  4540 status_update_manager.cpp:203] Recovering status update manager
I0602 10:53:42.495985  4536 containerizer.cpp:582] Recovering containerizer
I0602 10:53:42.498034  4540 provisioner.cpp:416] Provisioner recovery complete
I0602 10:53:42.498538  4538 slave.cpp:6119] Finished recovery
I0602 10:53:42.499326  4538 slave.cpp:6301] Querying resource estimator for oversubscribable
resources
I0602 10:53:42.499825  4538 slave.cpp:6315] Received oversubscribable resources {} from the
resource estimator
I0602 10:53:42.503810  4542 process.cpp:3778] Handling HTTP event for process 'slave(757)'
with path: '/slave(757)/containers'
I0602 10:53:42.505856  4542 http.cpp:1115] HTTP GET for /slave(757)/containers from 172.17.0.2:33262
I0602 10:53:42.505980  4542 http.cpp:936] Authorizing principal 'test-principal' to GET the
'/containers' endpoint
I0602 10:53:42.509074  4538 slave.cpp:817] Agent terminating
[       OK ] Endpoint/SlaveEndpointTest.UnauthorizedRequest/2 (44 ms)
[ RUN      ] Endpoint/SlaveEndpointTest.NoAuthorizer/0
I0602 10:53:42.525132  4516 containerizer.cpp:230] Using isolation: posix/cpu,posix/mem,filesystem/posix,network/cni,environment_secret
W0602 10:53:42.525909  4516 backend.cpp:76] Failed to create 'overlay' backend: OverlayBackend
requires root privileges
W0602 10:53:42.526077  4516 backend.cpp:76] Failed to create 'bind' backend: BindBackend requires
root privileges
I0602 10:53:42.526118  4516 provisioner.cpp:255] Using default backend 'copy'
I0602 10:53:42.528640  4516 cluster.cpp:448] Creating default 'local' authorizer
I0602 10:53:42.531294  4536 slave.cpp:248] Mesos agent started on (758)@172.17.0.2:39127
I0602 10:53:42.531337  4536 slave.cpp:249] Flags at startup: --acls="" --appc_simple_discovery_uri_prefix="http://"
--appc_store_dir="/tmp/Endpoint_SlaveEndpointTest_NoAuthorizer_0_WSJ6fO/store/appc" --authenticate_http_readonly="true"
--authenticate_http_readwrite="true" --authenticatee="crammd5" --authentication_backoff_factor="1secs"
--authorizer="local" --cgroups_cpu_enable_pids_and_tids_count="false" --cgroups_enable_cfs="false"
--cgroups_hierarchy="/sys/fs/cgroup" --cgroups_limit_swap="false" --cgroups_root="mesos" --container_disk_watch_interval="15secs"
--containerizers="mesos" --credential="/tmp/Endpoint_SlaveEndpointTest_NoAuthorizer_0_WSJ6fO/credential"
--default_role="*" --disk_watch_interval="1mins" --docker="docker" --docker_kill_orphans="true"
--docker_registry="https://registry-1.docker.io" --docker_remove_delay="6hrs" --docker_socket="/var/run/docker.sock"
--docker_stop_timeout="0ns" --docker_store_dir="/tmp/Endpoint_SlaveEndpointTest_NoAuthorizer_0_WSJ6fO/store/docker"
--docker_volume_checkpoint_dir="/var/run/mesos/isolators/docker/volume" --enforce_container_disk_quota="false"
--executor_registration_timeout="1mins" --executor_reregistration_timeout="2secs" --executor_shutdown_grace_period="5secs"
--fetcher_cache_dir="/tmp/Endpoint_SlaveEndpointTest_NoAuthorizer_0_WSJ6fO/fetch" --fetcher_cache_size="2GB"
--frameworks_home="" --gc_delay="1weeks" --gc_disk_headroom="0.1" --hadoop_home="" --help="false"
--hostname_lookup="true" --http_command_executor="false" --http_credentials="/tmp/Endpoint_SlaveEndpointTest_NoAuthorizer_0_WSJ6fO/http_credentials"
--http_heartbeat_interval="30secs" --initialize_driver_logging="true" --isolation="posix/cpu,posix/mem"
--launcher="posix" --launcher_dir="/mesos/mesos-1.4.0/_build/src" --logbufsecs="0" --logging_level="INFO"
--max_completed_executors_per_framework="150" --oversubscribed_resources_interval="15secs"
--perf_duration="10secs" --perf_interval="1mins" --port="5051" --qos_correction_interval_min="0ns"
--quiet="false" --recover="reconnect" --recovery_timeout="15mins" --registration_backoff_factor="10ms"
--resources="cpus:2;gpus:0;mem:1024;disk:1024;ports:[31000-32000]" --revocable_cpu_low_priority="true"
--runtime_dir="/tmp/Endpoint_SlaveEndpointTest_NoAuthorizer_0_WSJ6fO" --sandbox_directory="/mnt/mesos/sandbox"
--strict="true" --switch_user="true" --systemd_enable_support="true" --systemd_runtime_directory="/run/systemd/system"
--version="false" --work_dir="/tmp/Endpoint_SlaveEndpointTest_NoAuthorizer_0_OKk9dN"
I0602 10:53:42.532052  4536 credentials.hpp:86] Loading credential for authentication from
'/tmp/Endpoint_SlaveEndpointTest_NoAuthorizer_0_WSJ6fO/credential'
I0602 10:53:42.532307  4536 slave.cpp:281] Agent using credential for: test-principal
I0602 10:53:42.532336  4536 credentials.hpp:37] Loading credentials for authentication from
'/tmp/Endpoint_SlaveEndpointTest_NoAuthorizer_0_WSJ6fO/http_credentials'
I0602 10:53:42.532752  4536 http.cpp:975] Creating default 'basic' HTTP authenticator for
realm 'mesos-agent-readonly'
I0602 10:53:42.532971  4536 http.cpp:975] Creating default 'basic' HTTP authenticator for
realm 'mesos-agent-readwrite'
I0602 10:53:42.535035  4536 slave.cpp:552] Agent resources: cpus(*):2; mem(*):1024; disk(*):1024;
ports(*):[31000-32000]
I0602 10:53:42.535173  4536 slave.cpp:560] Agent attributes: [  ]
I0602 10:53:42.535193  4536 slave.cpp:565] Agent hostname: 41ce6861e2e4
I0602 10:53:42.535418  4539 status_update_manager.cpp:177] Pausing sending status updates
I0602 10:53:42.537313  4537 state.cpp:62] Recovering state from '/tmp/Endpoint_SlaveEndpointTest_NoAuthorizer_0_OKk9dN/meta'
I0602 10:53:42.537823  4536 status_update_manager.cpp:203] Recovering status update manager
I0602 10:53:42.538089  4539 containerizer.cpp:582] Recovering containerizer
I0602 10:53:42.540315  4535 provisioner.cpp:416] Provisioner recovery complete
I0602 10:53:42.540875  4541 slave.cpp:6119] Finished recovery
I0602 10:53:42.541517  4541 slave.cpp:6301] Querying resource estimator for oversubscribable
resources
I0602 10:53:42.541929  4541 slave.cpp:6315] Received oversubscribable resources {} from the
resource estimator
I0602 10:53:42.545961  4536 process.cpp:3778] Handling HTTP event for process 'slave(758)'
with path: '/slave(758)/monitor/statistics'
I0602 10:53:42.547787  4541 http.cpp:1115] HTTP GET for /slave(758)/monitor/statistics from
172.17.0.2:33264
I0602 10:53:42.547905  4541 http.cpp:936] Authorizing principal 'test-principal' to GET the
'/monitor/statistics' endpoint
I0602 10:53:42.553023  4516 slave.cpp:817] Agent terminating
[       OK ] Endpoint/SlaveEndpointTest.NoAuthorizer/0 (44 ms)
[ RUN      ] Endpoint/SlaveEndpointTest.NoAuthorizer/1
I0602 10:53:42.568413  4516 containerizer.cpp:230] Using isolation: posix/cpu,posix/mem,filesystem/posix,network/cni,environment_secret
W0602 10:53:42.569190  4516 backend.cpp:76] Failed to create 'overlay' backend: OverlayBackend
requires root privileges
W0602 10:53:42.569631  4516 backend.cpp:76] Failed to create 'bind' backend: BindBackend requires
root privileges
I0602 10:53:42.569689  4516 provisioner.cpp:255] Using default backend 'copy'
I0602 10:53:42.572266  4516 cluster.cpp:448] Creating default 'local' authorizer
I0602 10:53:42.575017  4536 slave.cpp:248] Mesos agent started on (759)@172.17.0.2:39127
I0602 10:53:42.575062  4536 slave.cpp:249] Flags at startup: --acls="" --appc_simple_discovery_uri_prefix="http://"
--appc_store_dir="/tmp/Endpoint_SlaveEndpointTest_NoAuthorizer_1_mSglMS/store/appc" --authenticate_http_readonly="true"
--authenticate_http_readwrite="true" --authenticatee="crammd5" --authentication_backoff_factor="1secs"
--authorizer="local" --cgroups_cpu_enable_pids_and_tids_count="false" --cgroups_enable_cfs="false"
--cgroups_hierarchy="/sys/fs/cgroup" --cgroups_limit_swap="false" --cgroups_root="mesos" --container_disk_watch_interval="15secs"
--containerizers="mesos" --credential="/tmp/Endpoint_SlaveEndpointTest_NoAuthorizer_1_mSglMS/credential"
--default_role="*" --disk_watch_interval="1mins" --docker="docker" --docker_kill_orphans="true"
--docker_registry="https://registry-1.docker.io" --docker_remove_delay="6hrs" --docker_socket="/var/run/docker.sock"
--docker_stop_timeout="0ns" --docker_store_dir="/tmp/Endpoint_SlaveEndpointTest_NoAuthorizer_1_mSglMS/store/docker"
--docker_volume_checkpoint_dir="/var/run/mesos/isolators/docker/volume" --enforce_container_disk_quota="false"
--executor_registration_timeout="1mins" --executor_reregistration_timeout="2secs" --executor_shutdown_grace_period="5secs"
--fetcher_cache_dir="/tmp/Endpoint_SlaveEndpointTest_NoAuthorizer_1_mSglMS/fetch" --fetcher_cache_size="2GB"
--frameworks_home="" --gc_delay="1weeks" --gc_disk_headroom="0.1" --hadoop_home="" --help="false"
--hostname_lookup="true" --http_command_executor="false" --http_credentials="/tmp/Endpoint_SlaveEndpointTest_NoAuthorizer_1_mSglMS/http_credentials"
--http_heartbeat_interval="30secs" --initialize_driver_logging="true" --isolation="posix/cpu,posix/mem"
--launcher="posix" --launcher_dir="/mesos/mesos-1.4.0/_build/src" --logbufsecs="0" --logging_level="INFO"
--max_completed_executors_per_framework="150" --oversubscribed_resources_interval="15secs"
--perf_duration="10secs" --perf_interval="1mins" --port="5051" --qos_correction_interval_min="0ns"
--quiet="false" --recover="reconnect" --recovery_timeout="15mins" --registration_backoff_factor="10ms"
--resources="cpus:2;gpus:0;mem:1024;disk:1024;ports:[31000-32000]" --revocable_cpu_low_priority="true"
--runtime_dir="/tmp/Endpoint_SlaveEndpointTest_NoAuthorizer_1_mSglMS" --sandbox_directory="/mnt/mesos/sandbox"
--strict="true" --switch_user="true" --systemd_enable_support="true" --systemd_runtime_directory="/run/systemd/system"
--version="false" --work_dir="/tmp/Endpoint_SlaveEndpointTest_NoAuthorizer_1_YFVfDR"
I0602 10:53:42.575769  4536 credentials.hpp:86] Loading credential for authentication from
'/tmp/Endpoint_SlaveEndpointTest_NoAuthorizer_1_mSglMS/credential'
I0602 10:53:42.576017  4536 slave.cpp:281] Agent using credential for: test-principal
I0602 10:53:42.576042  4536 credentials.hpp:37] Loading credentials for authentication from
'/tmp/Endpoint_SlaveEndpointTest_NoAuthorizer_1_mSglMS/http_credentials'
I0602 10:53:42.576385  4536 http.cpp:975] Creating default 'basic' HTTP authenticator for
realm 'mesos-agent-readonly'
I0602 10:53:42.576594  4536 http.cpp:975] Creating default 'basic' HTTP authenticator for
realm 'mesos-agent-readwrite'
I0602 10:53:42.578593  4536 slave.cpp:552] Agent resources: cpus(*):2; mem(*):1024; disk(*):1024;
ports(*):[31000-32000]
I0602 10:53:42.578728  4536 slave.cpp:560] Agent attributes: [  ]
I0602 10:53:42.578747  4536 slave.cpp:565] Agent hostname: 41ce6861e2e4
I0602 10:53:42.578997  4538 status_update_manager.cpp:177] Pausing sending status updates
I0602 10:53:42.580860  4540 state.cpp:62] Recovering state from '/tmp/Endpoint_SlaveEndpointTest_NoAuthorizer_1_YFVfDR/meta'
I0602 10:53:42.581296  4538 status_update_manager.cpp:203] Recovering status update manager
I0602 10:53:42.581547  4536 containerizer.cpp:582] Recovering containerizer
I0602 10:53:42.583565  4540 provisioner.cpp:416] Provisioner recovery complete
I0602 10:53:42.584254  4541 slave.cpp:6119] Finished recovery
I0602 10:53:42.584894  4541 slave.cpp:6301] Querying resource estimator for oversubscribable
resources
I0602 10:53:42.585389  4538 slave.cpp:6315] Received oversubscribable resources {} from the
resource estimator
I0602 10:53:42.589236  4541 process.cpp:3778] Handling HTTP event for process 'slave(759)'
with path: '/slave(759)/monitor/statistics.json'
I0602 10:53:42.591086  4541 http.cpp:1115] HTTP GET for /slave(759)/monitor/statistics.json
from 172.17.0.2:33266
I0602 10:53:42.591202  4541 http.cpp:936] Authorizing principal 'test-principal' to GET the
'/monitor/statistics.json' endpoint
I0602 10:53:42.596163  4540 slave.cpp:817] Agent terminating
[       OK ] Endpoint/SlaveEndpointTest.NoAuthorizer/1 (43 ms)
[ RUN      ] Endpoint/SlaveEndpointTest.NoAuthorizer/2
I0602 10:53:42.611907  4516 containerizer.cpp:230] Using isolation: posix/cpu,posix/mem,filesystem/posix,network/cni,environment_secret
W0602 10:53:42.612660  4516 backend.cpp:76] Failed to create 'overlay' backend: OverlayBackend
requires root privileges
W0602 10:53:42.612828  4516 backend.cpp:76] Failed to create 'bind' backend: BindBackend requires
root privileges
I0602 10:53:42.612872  4516 provisioner.cpp:255] Using default backend 'copy'
I0602 10:53:42.615461  4516 cluster.cpp:448] Creating default 'local' authorizer
I0602 10:53:42.618239  4539 slave.cpp:248] Mesos agent started on (760)@172.17.0.2:39127
I0602 10:53:42.618280  4539 slave.cpp:249] Flags at startup: --acls="" --appc_simple_discovery_uri_prefix="http://"
--appc_store_dir="/tmp/Endpoint_SlaveEndpointTest_NoAuthorizer_2_8AhOKX/store/appc" --authenticate_http_readonly="true"
--authenticate_http_readwrite="true" --authenticatee="crammd5" --authentication_backoff_factor="1secs"
--authorizer="local" --cgroups_cpu_enable_pids_and_tids_count="false" --cgroups_enable_cfs="false"
--cgroups_hierarchy="/sys/fs/cgroup" --cgroups_limit_swap="false" --cgroups_root="mesos" --container_disk_watch_interval="15secs"
--containerizers="mesos" --credential="/tmp/Endpoint_SlaveEndpointTest_NoAuthorizer_2_8AhOKX/credential"
--default_role="*" --disk_watch_interval="1mins" --docker="docker" --docker_kill_orphans="true"
--docker_registry="https://registry-1.docker.io" --docker_remove_delay="6hrs" --docker_socket="/var/run/docker.sock"
--docker_stop_timeout="0ns" --docker_store_dir="/tmp/Endpoint_SlaveEndpointTest_NoAuthorizer_2_8AhOKX/store/docker"
--docker_volume_checkpoint_dir="/var/run/mesos/isolators/docker/volume" --enforce_container_disk_quota="false"
--executor_registration_timeout="1mins" --executor_reregistration_timeout="2secs" --executor_shutdown_grace_period="5secs"
--fetcher_cache_dir="/tmp/Endpoint_SlaveEndpointTest_NoAuthorizer_2_8AhOKX/fetch" --fetcher_cache_size="2GB"
--frameworks_home="" --gc_delay="1weeks" --gc_disk_headroom="0.1" --hadoop_home="" --help="false"
--hostname_lookup="true" --http_command_executor="false" --http_credentials="/tmp/Endpoint_SlaveEndpointTest_NoAuthorizer_2_8AhOKX/http_credentials"
--http_heartbeat_interval="30secs" --initialize_driver_logging="true" --isolation="posix/cpu,posix/mem"
--launcher="posix" --launcher_dir="/mesos/mesos-1.4.0/_build/src" --logbufsecs="0" --logging_level="INFO"
--max_completed_executors_per_framework="150" --oversubscribed_resources_interval="15secs"
--perf_duration="10secs" --perf_interval="1mins" --port="5051" --qos_correction_interval_min="0ns"
--quiet="false" --recover="reconnect" --recovery_timeout="15mins" --registration_backoff_factor="10ms"
--resources="cpus:2;gpus:0;mem:1024;disk:1024;ports:[31000-32000]" --revocable_cpu_low_priority="true"
--runtime_dir="/tmp/Endpoint_SlaveEndpointTest_NoAuthorizer_2_8AhOKX" --sandbox_directory="/mnt/mesos/sandbox"
--strict="true" --switch_user="true" --systemd_enable_support="true" --systemd_runtime_directory="/run/systemd/system"
--version="false" --work_dir="/tmp/Endpoint_SlaveEndpointTest_NoAuthorizer_2_gReEuW"
I0602 10:53:42.619081  4539 credentials.hpp:86] Loading credential for authentication from
'/tmp/Endpoint_SlaveEndpointTest_NoAuthorizer_2_8AhOKX/credential'
I0602 10:53:42.619504  4539 slave.cpp:281] Agent using credential for: test-principal
I0602 10:53:42.619534  4539 credentials.hpp:37] Loading credentials for authentication from
'/tmp/Endpoint_SlaveEndpointTest_NoAuthorizer_2_8AhOKX/http_credentials'
I0602 10:53:42.619979  4539 http.cpp:975] Creating default 'basic' HTTP authenticator for
realm 'mesos-agent-readonly'
I0602 10:53:42.620303  4539 http.cpp:975] Creating default 'basic' HTTP authenticator for
realm 'mesos-agent-readwrite'
I0602 10:53:42.622473  4539 slave.cpp:552] Agent resources: cpus(*):2; mem(*):1024; disk(*):1024;
ports(*):[31000-32000]
I0602 10:53:42.622613  4539 slave.cpp:560] Agent attributes: [  ]
I0602 10:53:42.622634  4539 slave.cpp:565] Agent hostname: 41ce6861e2e4
I0602 10:53:42.623124  4541 status_update_manager.cpp:177] Pausing sending status updates
I0602 10:53:42.625105  4540 state.cpp:62] Recovering state from '/tmp/Endpoint_SlaveEndpointTest_NoAuthorizer_2_gReEuW/meta'
I0602 10:53:42.625584  4541 status_update_manager.cpp:203] Recovering status update manager
I0602 10:53:42.625815  4540 containerizer.cpp:582] Recovering containerizer
I0602 10:53:42.627836  4541 provisioner.cpp:416] Provisioner recovery complete
I0602 10:53:42.628437  4536 slave.cpp:6119] Finished recovery
I0602 10:53:42.629081  4536 slave.cpp:6301] Querying resource estimator for oversubscribable
resources
I0602 10:53:42.629515  4536 slave.cpp:6315] Received oversubscribable resources {} from the
resource estimator
I0602 10:53:42.633373  4538 process.cpp:3778] Handling HTTP event for process 'slave(760)'
with path: '/slave(760)/containers'
I0602 10:53:42.635287  4542 http.cpp:1115] HTTP GET for /slave(760)/containers from 172.17.0.2:33272
I0602 10:53:42.635411  4542 http.cpp:936] Authorizing principal 'test-principal' to GET the
'/containers' endpoint
I0602 10:53:42.640511  4542 slave.cpp:817] Agent terminating
[       OK ] Endpoint/SlaveEndpointTest.NoAuthorizer/2 (46 ms)
[----------] 9 tests from Endpoint/SlaveEndpointTest (398 ms total)

[----------] Global test environment tear-down
[==========] 1586 tests from 176 test cases ran. (714523 ms total)
[  PASSED  ] 1582 tests.
[  FAILED  ] 4 tests, listed below:
[  FAILED  ] DefaultExecutorCheckTest.CommandCheckDeliveredAndReconciled
[  FAILED  ] DefaultExecutorCheckTest.CommandCheckStatusChange
[  FAILED  ] DefaultExecutorCheckTest.CommandCheckSeesParentsEnv
[  FAILED  ] DefaultExecutorCheckTest.CommandCheckSharesWorkDirWithTask

 4 FAILED TESTS
  YOU HAVE 22 DISABLED TESTS

E0602 10:53:42.787518  4543 process.cpp:968] Failed to accept socket: future discarded
make[4]: *** [check-local] Error 1
make[4]: Leaving directory `/mesos/mesos-1.4.0/_build/src'
make[3]: *** [check-am] Error 2
make[3]: Leaving directory `/mesos/mesos-1.4.0/_build/src'
make[2]: *** [check] Error 2
make[2]: Leaving directory `/mesos/mesos-1.4.0/_build/src'
make[1]: *** [check-recursive] Error 1
make[1]: Leaving directory `/mesos/mesos-1.4.0/_build'
make: *** [distcheck] Error 1
+ docker rmi mesos-1496395019-28806
Untagged: mesos-1496395019-28806:latest
Deleted: sha256:d406a94d3945233ee4486d3a1753e4bfb8e14e8a3840839866e8e51d310e7983
Deleted: sha256:0a6f2aede2d88fbe72fc93f871e5c66de846acb5a69a055f9ee1b3f74bd25f5b
Deleted: sha256:2a6fbcc5669f2e882f995fd28498bfdabc532cc907a9230c842c8d17cc8c1223
Deleted: sha256:6d63d59fb2a1af61e8b0d7bcae993a04b979a397ce5077e257c7fe098876de4d
Deleted: sha256:a1e45832b4df33ce454434400e22294512c259aeac3e51e2a97e627bd8db2512
Deleted: sha256:be2cb4e1e05fcb40cb6454c9a5bb2ea43d9993f4f8b56d8fb0a48a7764b577b0
Deleted: sha256:b48d14e0edafa10010cdbdb3ffb6b6f83bdeac0d15dfd543f72db0e7a073b9f4
Deleted: sha256:8d36fbc5b8341a6ed8ea997548e281bcb99976952829c8aa2052dcfc8351791a
Deleted: sha256:677e7808c87f1a9b05d8f8ed16a2bc342a806dad2cc807e080a9da074da1c10f
Deleted: sha256:9865798fd4cb7236dde6dd2940cad91bc6fec247bc66485bcbf8273acfa8eb51
Deleted: sha256:1fa950a30d75aa36bf5cf8c648b7d92ccdf55500b422b66904f099f2af12ab02
Deleted: sha256:7a824463f332674e82b9254b4989beb3646c8c1371e01b5db23b9a72be215da7
Deleted: sha256:64be82630e7ee170b154bf88812c85f54a51c0b375b1722ecdaba96f21293aee
Deleted: sha256:6c3286d107d5d945f5a2a6d116ed7e41873031c3b0ff117e20466ef45fae99a1
Deleted: sha256:8b3dd705546d2e41947c21d09c51ad90763714af17d2b5aed3031c55e075bb78
Deleted: sha256:2a2d34426275028666263f066a93d4f4426fe3b3123bbdb4541dd2c5072e6398
Deleted: sha256:052d49392346b09d255eaaef12e40d0ce7f10d36b63974aea3400c8141995943
Deleted: sha256:32a4cc1a09c5c31914d8ef4c7efa5d6672761b0d37441b65fdd7ef5e9f450f1a
Deleted: sha256:f89b912bb8fa6c3e9ec5b630b3c57a22fdedc7b4cda8fc775b8c5cdc67363368
Deleted: sha256:de35a671b5d5bf0b59042dade2965b3d823bee5b34aeef76b05d152fb1b58949
Deleted: sha256:848d972b3bb1477e74186a2f2f8ee9bf0ed44defba03a956b528650daeb5517f
Deleted: sha256:7027d579d449fa7264c832f34d2cb83e4098e77e18beffead6ed0a15bb5d3fa4
Deleted: sha256:566bd36b2ef884509b15747156f9f898c9a0146b35fade09dd76d506995eab54
Deleted: sha256:c55305e76cf876f95c4ad03600aca405987b8bdf669a0bad1e7f1eb1132fe47c
Build step 'Execute shell' marked build as failure

Mime
View raw message