mesos-builds mailing list archives

Site index · List index
Message view « Date » · « Thread »
Top « Date » · « Thread »
From Apache Jenkins Server <jenk...@builds.apache.org>
Subject Build failed in Jenkins: Mesos-Buildbot » autotools,gcc,--verbose,GLOG_v=1 MESOS_VERBOSE=1,centos:7,(ubuntu)&&(!ubuntu-us1)&&(!ubuntu-eu2) #3789
Date Tue, 13 Jun 2017 17:11:44 GMT
See <https://builds.apache.org/job/Mesos-Buildbot/BUILDTOOL=autotools,COMPILER=gcc,CONFIGURATION=--verbose,ENVIRONMENT=GLOG_v=1%20MESOS_VERBOSE=1,OS=centos%3A7,label_exp=(ubuntu)&&(!ubuntu-us1)&&(!ubuntu-eu2)/3789/display/redirect?page=changes>

Changes:

[vinodkone] Added python-mesos-http scheduler api client to docs.

------------------------------------------
[...truncated 28.06 MB...]
[ RUN      ] Endpoint/SlaveEndpointTest.AuthorizedRequest/2
I0613 17:11:23.765211  5329 containerizer.cpp:230] Using isolation: posix/cpu,posix/mem,filesystem/posix,network/cni,environment_secret
W0613 17:11:23.765862  5329 backend.cpp:76] Failed to create 'aufs' backend: AufsBackend requires
root privileges
W0613 17:11:23.766069  5329 backend.cpp:76] Failed to create 'bind' backend: BindBackend requires
root privileges
I0613 17:11:23.766135  5329 provisioner.cpp:255] Using default backend 'copy'
I0613 17:11:23.770146  5351 slave.cpp:248] Mesos agent started on (753)@172.17.0.3:42352
I0613 17:11:23.770707  5351 slave.cpp:249] Flags at startup: --acls="" --appc_simple_discovery_uri_prefix="http://"
--appc_store_dir="/tmp/Endpoint_SlaveEndpointTest_AuthorizedRequest_2_BvjBm8/store/appc" --authenticate_http_readonly="true"
--authenticate_http_readwrite="true" --authenticatee="crammd5" --authentication_backoff_factor="1secs"
--authorizer="local" --cgroups_cpu_enable_pids_and_tids_count="false" --cgroups_enable_cfs="false"
--cgroups_hierarchy="/sys/fs/cgroup" --cgroups_limit_swap="false" --cgroups_root="mesos" --container_disk_watch_interval="15secs"
--containerizers="mesos" --credential="/tmp/Endpoint_SlaveEndpointTest_AuthorizedRequest_2_BvjBm8/credential"
--default_role="*" --disk_watch_interval="1mins" --docker="docker" --docker_kill_orphans="true"
--docker_registry="https://registry-1.docker.io" --docker_remove_delay="6hrs" --docker_socket="/var/run/docker.sock"
--docker_stop_timeout="0ns" --docker_store_dir="/tmp/Endpoint_SlaveEndpointTest_AuthorizedRequest_2_BvjBm8/store/docker"
--docker_volume_checkpoint_dir="/var/run/mesos/isolators/docker/volume" --enforce_container_disk_quota="false"
--executor_registration_timeout="1mins" --executor_reregistration_timeout="2secs" --executor_shutdown_grace_period="5secs"
--fetcher_cache_dir="/tmp/Endpoint_SlaveEndpointTest_AuthorizedRequest_2_BvjBm8/fetch" --fetcher_cache_size="2GB"
--frameworks_home="" --gc_delay="1weeks" --gc_disk_headroom="0.1" --hadoop_home="" --help="false"
--hostname_lookup="true" --http_command_executor="false" --http_credentials="/tmp/Endpoint_SlaveEndpointTest_AuthorizedRequest_2_BvjBm8/http_credentials"
--http_heartbeat_interval="30secs" --initialize_driver_logging="true" --isolation="posix/cpu,posix/mem"
--launcher="posix" --launcher_dir="/mesos/mesos-1.4.0/_build/src" --logbufsecs="0" --logging_level="INFO"
--max_completed_executors_per_framework="150" --oversubscribed_resources_interval="15secs"
--perf_duration="10secs" --perf_interval="1mins" --port="5051" --qos_correction_interval_min="0ns"
--quiet="false" --recover="reconnect" --recovery_timeout="15mins" --registration_backoff_factor="10ms"
--resources="cpus:2;gpus:0;mem:1024;disk:1024;ports:[31000-32000]" --revocable_cpu_low_priority="true"
--runtime_dir="/tmp/Endpoint_SlaveEndpointTest_AuthorizedRequest_2_BvjBm8" --sandbox_directory="/mnt/mesos/sandbox"
--strict="true" --switch_user="true" --systemd_enable_support="true" --systemd_runtime_directory="/run/systemd/system"
--version="false" --work_dir="/tmp/Endpoint_SlaveEndpointTest_AuthorizedRequest_2_FnELTO"
I0613 17:11:23.771662  5351 credentials.hpp:86] Loading credential for authentication from
'/tmp/Endpoint_SlaveEndpointTest_AuthorizedRequest_2_BvjBm8/credential'
I0613 17:11:23.772428  5351 slave.cpp:281] Agent using credential for: test-principal
I0613 17:11:23.772794  5351 credentials.hpp:37] Loading credentials for authentication from
'/tmp/Endpoint_SlaveEndpointTest_AuthorizedRequest_2_BvjBm8/http_credentials'
I0613 17:11:23.773353  5351 http.cpp:975] Creating default 'basic' HTTP authenticator for
realm 'mesos-agent-readonly'
I0613 17:11:23.773865  5351 http.cpp:975] Creating default 'basic' HTTP authenticator for
realm 'mesos-agent-readwrite'
I0613 17:11:23.776641  5351 slave.cpp:552] Agent resources: cpus(*):2; mem(*):1024; disk(*):1024;
ports(*):[31000-32000]
I0613 17:11:23.777307  5351 slave.cpp:560] Agent attributes: [  ]
I0613 17:11:23.777683  5351 slave.cpp:565] Agent hostname: 1f9e878a0cd9
I0613 17:11:23.778410  5355 status_update_manager.cpp:177] Pausing sending status updates
I0613 17:11:23.780808  5350 state.cpp:62] Recovering state from '/tmp/Endpoint_SlaveEndpointTest_AuthorizedRequest_2_FnELTO/meta'
I0613 17:11:23.781170  5350 status_update_manager.cpp:203] Recovering status update manager
I0613 17:11:23.781703  5354 containerizer.cpp:582] Recovering containerizer
I0613 17:11:23.784193  5354 provisioner.cpp:416] Provisioner recovery complete
I0613 17:11:23.784929  5354 slave.cpp:6127] Finished recovery
I0613 17:11:23.787040  5354 slave.cpp:6309] Querying resource estimator for oversubscribable
resources
I0613 17:11:23.788286  5354 slave.cpp:6323] Received oversubscribable resources {} from the
resource estimator
I0613 17:11:23.793189  5348 process.cpp:3778] Handling HTTP event for process 'slave(753)'
with path: '/slave(753)/containers'
I0613 17:11:23.796285  5348 http.cpp:1115] HTTP GET for /slave(753)/containers from 172.17.0.3:58064
I0613 17:11:23.796372  5348 http.cpp:936] Authorizing principal 'test-principal' to GET the
'/containers' endpoint
I0613 17:11:23.804345  5353 slave.cpp:817] Agent terminating
[       OK ] Endpoint/SlaveEndpointTest.AuthorizedRequest/2 (51 ms)
[ RUN      ] Endpoint/SlaveEndpointTest.UnauthorizedRequest/0
I0613 17:11:23.817071  5329 containerizer.cpp:230] Using isolation: posix/cpu,posix/mem,filesystem/posix,network/cni,environment_secret
W0613 17:11:23.817692  5329 backend.cpp:76] Failed to create 'aufs' backend: AufsBackend requires
root privileges
W0613 17:11:23.817831  5329 backend.cpp:76] Failed to create 'bind' backend: BindBackend requires
root privileges
I0613 17:11:23.817878  5329 provisioner.cpp:255] Using default backend 'copy'
I0613 17:11:23.821821  5352 slave.cpp:248] Mesos agent started on (754)@172.17.0.3:42352
I0613 17:11:23.822160  5352 slave.cpp:249] Flags at startup: --acls="" --appc_simple_discovery_uri_prefix="http://"
--appc_store_dir="/tmp/Endpoint_SlaveEndpointTest_UnauthorizedRequest_0_uq84Io/store/appc"
--authenticate_http_readonly="true" --authenticate_http_readwrite="true" --authenticatee="crammd5"
--authentication_backoff_factor="1secs" --authorizer="local" --cgroups_cpu_enable_pids_and_tids_count="false"
--cgroups_enable_cfs="false" --cgroups_hierarchy="/sys/fs/cgroup" --cgroups_limit_swap="false"
--cgroups_root="mesos" --container_disk_watch_interval="15secs" --containerizers="mesos" --credential="/tmp/Endpoint_SlaveEndpointTest_UnauthorizedRequest_0_uq84Io/credential"
--default_role="*" --disk_watch_interval="1mins" --docker="docker" --docker_kill_orphans="true"
--docker_registry="https://registry-1.docker.io" --docker_remove_delay="6hrs" --docker_socket="/var/run/docker.sock"
--docker_stop_timeout="0ns" --docker_store_dir="/tmp/Endpoint_SlaveEndpointTest_UnauthorizedRequest_0_uq84Io/store/docker"
--docker_volume_checkpoint_dir="/var/run/mesos/isolators/docker/volume" --enforce_container_disk_quota="false"
--executor_registration_timeout="1mins" --executor_reregistration_timeout="2secs" --executor_shutdown_grace_period="5secs"
--fetcher_cache_dir="/tmp/Endpoint_SlaveEndpointTest_UnauthorizedRequest_0_uq84Io/fetch" --fetcher_cache_size="2GB"
--frameworks_home="" --gc_delay="1weeks" --gc_disk_headroom="0.1" --hadoop_home="" --help="false"
--hostname_lookup="true" --http_command_executor="false" --http_credentials="/tmp/Endpoint_SlaveEndpointTest_UnauthorizedRequest_0_uq84Io/http_credentials"
--http_heartbeat_interval="30secs" --initialize_driver_logging="true" --isolation="posix/cpu,posix/mem"
--launcher="posix" --launcher_dir="/mesos/mesos-1.4.0/_build/src" --logbufsecs="0" --logging_level="INFO"
--max_completed_executors_per_framework="150" --oversubscribed_resources_interval="15secs"
--perf_duration="10secs" --perf_interval="1mins" --port="5051" --qos_correction_interval_min="0ns"
--quiet="false" --recover="reconnect" --recovery_timeout="15mins" --registration_backoff_factor="10ms"
--resources="cpus:2;gpus:0;mem:1024;disk:1024;ports:[31000-32000]" --revocable_cpu_low_priority="true"
--runtime_dir="/tmp/Endpoint_SlaveEndpointTest_UnauthorizedRequest_0_uq84Io" --sandbox_directory="/mnt/mesos/sandbox"
--strict="true" --switch_user="true" --systemd_enable_support="true" --systemd_runtime_directory="/run/systemd/system"
--version="false" --work_dir="/tmp/Endpoint_SlaveEndpointTest_UnauthorizedRequest_0_XC5Z64"
I0613 17:11:23.823655  5352 credentials.hpp:86] Loading credential for authentication from
'/tmp/Endpoint_SlaveEndpointTest_UnauthorizedRequest_0_uq84Io/credential'
I0613 17:11:23.824270  5352 slave.cpp:281] Agent using credential for: test-principal
I0613 17:11:23.826349  5352 credentials.hpp:37] Loading credentials for authentication from
'/tmp/Endpoint_SlaveEndpointTest_UnauthorizedRequest_0_uq84Io/http_credentials'
I0613 17:11:23.827023  5352 http.cpp:975] Creating default 'basic' HTTP authenticator for
realm 'mesos-agent-readonly'
I0613 17:11:23.827605  5352 http.cpp:975] Creating default 'basic' HTTP authenticator for
realm 'mesos-agent-readwrite'
I0613 17:11:23.830212  5352 slave.cpp:552] Agent resources: cpus(*):2; mem(*):1024; disk(*):1024;
ports(*):[31000-32000]
I0613 17:11:23.830983  5352 slave.cpp:560] Agent attributes: [  ]
I0613 17:11:23.831352  5352 slave.cpp:565] Agent hostname: 1f9e878a0cd9
I0613 17:11:23.832022  5350 status_update_manager.cpp:177] Pausing sending status updates
I0613 17:11:23.834681  5350 state.cpp:62] Recovering state from '/tmp/Endpoint_SlaveEndpointTest_UnauthorizedRequest_0_XC5Z64/meta'
I0613 17:11:23.835391  5353 status_update_manager.cpp:203] Recovering status update manager
I0613 17:11:23.835577  5353 containerizer.cpp:582] Recovering containerizer
I0613 17:11:23.838582  5355 provisioner.cpp:416] Provisioner recovery complete
I0613 17:11:23.840207  5352 slave.cpp:6127] Finished recovery
I0613 17:11:23.841536  5352 slave.cpp:6309] Querying resource estimator for oversubscribable
resources
I0613 17:11:23.842337  5352 slave.cpp:6323] Received oversubscribable resources {} from the
resource estimator
I0613 17:11:23.847344  5351 process.cpp:3778] Handling HTTP event for process 'slave(754)'
with path: '/slave(754)/monitor/statistics'
I0613 17:11:23.849325  5351 http.cpp:1115] HTTP GET for /slave(754)/monitor/statistics from
172.17.0.3:58066
I0613 17:11:23.849819  5351 http.cpp:936] Authorizing principal 'test-principal' to GET the
'/monitor/statistics' endpoint
I0613 17:11:23.853425  5329 slave.cpp:817] Agent terminating
[       OK ] Endpoint/SlaveEndpointTest.UnauthorizedRequest/0 (50 ms)
[ RUN      ] Endpoint/SlaveEndpointTest.UnauthorizedRequest/1
I0613 17:11:23.865893  5329 containerizer.cpp:230] Using isolation: posix/cpu,posix/mem,filesystem/posix,network/cni,environment_secret
W0613 17:11:23.866495  5329 backend.cpp:76] Failed to create 'aufs' backend: AufsBackend requires
root privileges
W0613 17:11:23.866747  5329 backend.cpp:76] Failed to create 'bind' backend: BindBackend requires
root privileges
I0613 17:11:23.866804  5329 provisioner.cpp:255] Using default backend 'copy'
I0613 17:11:23.870393  5349 slave.cpp:248] Mesos agent started on (755)@172.17.0.3:42352
I0613 17:11:23.870419  5349 slave.cpp:249] Flags at startup: --acls="" --appc_simple_discovery_uri_prefix="http://"
--appc_store_dir="/tmp/Endpoint_SlaveEndpointTest_UnauthorizedRequest_1_G9yuFF/store/appc"
--authenticate_http_readonly="true" --authenticate_http_readwrite="true" --authenticatee="crammd5"
--authentication_backoff_factor="1secs" --authorizer="local" --cgroups_cpu_enable_pids_and_tids_count="false"
--cgroups_enable_cfs="false" --cgroups_hierarchy="/sys/fs/cgroup" --cgroups_limit_swap="false"
--cgroups_root="mesos" --container_disk_watch_interval="15secs" --containerizers="mesos" --credential="/tmp/Endpoint_SlaveEndpointTest_UnauthorizedRequest_1_G9yuFF/credential"
--default_role="*" --disk_watch_interval="1mins" --docker="docker" --docker_kill_orphans="true"
--docker_registry="https://registry-1.docker.io" --docker_remove_delay="6hrs" --docker_socket="/var/run/docker.sock"
--docker_stop_timeout="0ns" --docker_store_dir="/tmp/Endpoint_SlaveEndpointTest_UnauthorizedRequest_1_G9yuFF/store/docker"
--docker_volume_checkpoint_dir="/var/run/mesos/isolators/docker/volume" --enforce_container_disk_quota="false"
--executor_registration_timeout="1mins" --executor_reregistration_timeout="2secs" --executor_shutdown_grace_period="5secs"
--fetcher_cache_dir="/tmp/Endpoint_SlaveEndpointTest_UnauthorizedRequest_1_G9yuFF/fetch" --fetcher_cache_size="2GB"
--frameworks_home="" --gc_delay="1weeks" --gc_disk_headroom="0.1" --hadoop_home="" --help="false"
--hostname_lookup="true" --http_command_executor="false" --http_credentials="/tmp/Endpoint_SlaveEndpointTest_UnauthorizedRequest_1_G9yuFF/http_credentials"
--http_heartbeat_interval="30secs" --initialize_driver_logging="true" --isolation="posix/cpu,posix/mem"
--launcher="posix" --launcher_dir="/mesos/mesos-1.4.0/_build/src" --logbufsecs="0" --logging_level="INFO"
--max_completed_executors_per_framework="150" --oversubscribed_resources_interval="15secs"
--perf_duration="10secs" --perf_interval="1mins" --port="5051" --qos_correction_interval_min="0ns"
--quiet="false" --recover="reconnect" --recovery_timeout="15mins" --registration_backoff_factor="10ms"
--resources="cpus:2;gpus:0;mem:1024;disk:1024;ports:[31000-32000]" --revocable_cpu_low_priority="true"
--runtime_dir="/tmp/Endpoint_SlaveEndpointTest_UnauthorizedRequest_1_G9yuFF" --sandbox_directory="/mnt/mesos/sandbox"
--strict="true" --switch_user="true" --systemd_enable_support="true" --systemd_runtime_directory="/run/systemd/system"
--version="false" --work_dir="/tmp/Endpoint_SlaveEndpointTest_UnauthorizedRequest_1_YUiOUl"
I0613 17:11:23.871259  5349 credentials.hpp:86] Loading credential for authentication from
'/tmp/Endpoint_SlaveEndpointTest_UnauthorizedRequest_1_G9yuFF/credential'
I0613 17:11:23.871423  5349 slave.cpp:281] Agent using credential for: test-principal
I0613 17:11:23.871450  5349 credentials.hpp:37] Loading credentials for authentication from
'/tmp/Endpoint_SlaveEndpointTest_UnauthorizedRequest_1_G9yuFF/http_credentials'
I0613 17:11:23.871836  5349 http.cpp:975] Creating default 'basic' HTTP authenticator for
realm 'mesos-agent-readonly'
I0613 17:11:23.872058  5349 http.cpp:975] Creating default 'basic' HTTP authenticator for
realm 'mesos-agent-readwrite'
I0613 17:11:23.873822  5349 slave.cpp:552] Agent resources: cpus(*):2; mem(*):1024; disk(*):1024;
ports(*):[31000-32000]
I0613 17:11:23.873932  5349 slave.cpp:560] Agent attributes: [  ]
I0613 17:11:23.873949  5349 slave.cpp:565] Agent hostname: 1f9e878a0cd9
I0613 17:11:23.874356  5348 status_update_manager.cpp:177] Pausing sending status updates
I0613 17:11:23.877666  5355 state.cpp:62] Recovering state from '/tmp/Endpoint_SlaveEndpointTest_UnauthorizedRequest_1_YUiOUl/meta'
I0613 17:11:23.878319  5355 status_update_manager.cpp:203] Recovering status update manager
I0613 17:11:23.878873  5349 containerizer.cpp:582] Recovering containerizer
I0613 17:11:23.880997  5355 provisioner.cpp:416] Provisioner recovery complete
I0613 17:11:23.881947  5355 slave.cpp:6127] Finished recovery
I0613 17:11:23.883644  5355 slave.cpp:6309] Querying resource estimator for oversubscribable
resources
I0613 17:11:23.884593  5350 slave.cpp:6323] Received oversubscribable resources {} from the
resource estimator
I0613 17:11:23.889376  5348 process.cpp:3778] Handling HTTP event for process 'slave(755)'
with path: '/slave(755)/monitor/statistics.json'
I0613 17:11:23.892367  5351 http.cpp:1115] HTTP GET for /slave(755)/monitor/statistics.json
from 172.17.0.3:58068
I0613 17:11:23.893031  5351 http.cpp:936] Authorizing principal 'test-principal' to GET the
'/monitor/statistics.json' endpoint
I0613 17:11:23.897430  5329 slave.cpp:817] Agent terminating
[       OK ] Endpoint/SlaveEndpointTest.UnauthorizedRequest/1 (43 ms)
[ RUN      ] Endpoint/SlaveEndpointTest.UnauthorizedRequest/2
I0613 17:11:23.909313  5329 containerizer.cpp:230] Using isolation: posix/cpu,posix/mem,filesystem/posix,network/cni,environment_secret
W0613 17:11:23.909885  5329 backend.cpp:76] Failed to create 'aufs' backend: AufsBackend requires
root privileges
W0613 17:11:23.910034  5329 backend.cpp:76] Failed to create 'bind' backend: BindBackend requires
root privileges
I0613 17:11:23.910078  5329 provisioner.cpp:255] Using default backend 'copy'
I0613 17:11:23.913478  5348 slave.cpp:248] Mesos agent started on (756)@172.17.0.3:42352
I0613 17:11:23.913508  5348 slave.cpp:249] Flags at startup: --acls="" --appc_simple_discovery_uri_prefix="http://"
--appc_store_dir="/tmp/Endpoint_SlaveEndpointTest_UnauthorizedRequest_2_cBc45W/store/appc"
--authenticate_http_readonly="true" --authenticate_http_readwrite="true" --authenticatee="crammd5"
--authentication_backoff_factor="1secs" --authorizer="local" --cgroups_cpu_enable_pids_and_tids_count="false"
--cgroups_enable_cfs="false" --cgroups_hierarchy="/sys/fs/cgroup" --cgroups_limit_swap="false"
--cgroups_root="mesos" --container_disk_watch_interval="15secs" --containerizers="mesos" --credential="/tmp/Endpoint_SlaveEndpointTest_UnauthorizedRequest_2_cBc45W/credential"
--default_role="*" --disk_watch_interval="1mins" --docker="docker" --docker_kill_orphans="true"
--docker_registry="https://registry-1.docker.io" --docker_remove_delay="6hrs" --docker_socket="/var/run/docker.sock"
--docker_stop_timeout="0ns" --docker_store_dir="/tmp/Endpoint_SlaveEndpointTest_UnauthorizedRequest_2_cBc45W/store/docker"
--docker_volume_checkpoint_dir="/var/run/mesos/isolators/docker/volume" --enforce_container_disk_quota="false"
--executor_registration_timeout="1mins" --executor_reregistration_timeout="2secs" --executor_shutdown_grace_period="5secs"
--fetcher_cache_dir="/tmp/Endpoint_SlaveEndpointTest_UnauthorizedRequest_2_cBc45W/fetch" --fetcher_cache_size="2GB"
--frameworks_home="" --gc_delay="1weeks" --gc_disk_headroom="0.1" --hadoop_home="" --help="false"
--hostname_lookup="true" --http_command_executor="false" --http_credentials="/tmp/Endpoint_SlaveEndpointTest_UnauthorizedRequest_2_cBc45W/http_credentials"
--http_heartbeat_interval="30secs" --initialize_driver_logging="true" --isolation="posix/cpu,posix/mem"
--launcher="posix" --launcher_dir="/mesos/mesos-1.4.0/_build/src" --logbufsecs="0" --logging_level="INFO"
--max_completed_executors_per_framework="150" --oversubscribed_resources_interval="15secs"
--perf_duration="10secs" --perf_interval="1mins" --port="5051" --qos_correction_interval_min="0ns"
--quiet="false" --recover="reconnect" --recovery_timeout="15mins" --registration_backoff_factor="10ms"
--resources="cpus:2;gpus:0;mem:1024;disk:1024;ports:[31000-32000]" --revocable_cpu_low_priority="true"
--runtime_dir="/tmp/Endpoint_SlaveEndpointTest_UnauthorizedRequest_2_cBc45W" --sandbox_directory="/mnt/mesos/sandbox"
--strict="true" --switch_user="true" --systemd_enable_support="true" --systemd_runtime_directory="/run/systemd/system"
--version="false" --work_dir="/tmp/Endpoint_SlaveEndpointTest_UnauthorizedRequest_2_IKbNdD"
I0613 17:11:23.915148  5348 credentials.hpp:86] Loading credential for authentication from
'/tmp/Endpoint_SlaveEndpointTest_UnauthorizedRequest_2_cBc45W/credential'
I0613 17:11:23.915313  5348 slave.cpp:281] Agent using credential for: test-principal
I0613 17:11:23.915340  5348 credentials.hpp:37] Loading credentials for authentication from
'/tmp/Endpoint_SlaveEndpointTest_UnauthorizedRequest_2_cBc45W/http_credentials'
I0613 17:11:23.915721  5348 http.cpp:975] Creating default 'basic' HTTP authenticator for
realm 'mesos-agent-readonly'
I0613 17:11:23.915874  5348 http.cpp:975] Creating default 'basic' HTTP authenticator for
realm 'mesos-agent-readwrite'
I0613 17:11:23.917688  5348 slave.cpp:552] Agent resources: cpus(*):2; mem(*):1024; disk(*):1024;
ports(*):[31000-32000]
I0613 17:11:23.917840  5348 slave.cpp:560] Agent attributes: [  ]
I0613 17:11:23.917860  5348 slave.cpp:565] Agent hostname: 1f9e878a0cd9
I0613 17:11:23.918133  5354 status_update_manager.cpp:177] Pausing sending status updates
I0613 17:11:23.920624  5354 state.cpp:62] Recovering state from '/tmp/Endpoint_SlaveEndpointTest_UnauthorizedRequest_2_IKbNdD/meta'
I0613 17:11:23.921118  5354 status_update_manager.cpp:203] Recovering status update manager
I0613 17:11:23.921571  5353 containerizer.cpp:582] Recovering containerizer
I0613 17:11:23.923758  5354 provisioner.cpp:416] Provisioner recovery complete
I0613 17:11:23.924435  5353 slave.cpp:6127] Finished recovery
I0613 17:11:23.925017  5353 slave.cpp:6309] Querying resource estimator for oversubscribable
resources
I0613 17:11:23.925575  5354 slave.cpp:6323] Received oversubscribable resources {} from the
resource estimator
I0613 17:11:23.928889  5350 process.cpp:3778] Handling HTTP event for process 'slave(756)'
with path: '/slave(756)/containers'
I0613 17:11:23.930727  5350 http.cpp:1115] HTTP GET for /slave(756)/containers from 172.17.0.3:58070
I0613 17:11:23.930824  5350 http.cpp:936] Authorizing principal 'test-principal' to GET the
'/containers' endpoint
I0613 17:11:23.936394  5329 slave.cpp:817] Agent terminating
[       OK ] Endpoint/SlaveEndpointTest.UnauthorizedRequest/2 (38 ms)
[ RUN      ] Endpoint/SlaveEndpointTest.NoAuthorizer/0
I0613 17:11:23.946954  5329 containerizer.cpp:230] Using isolation: posix/cpu,posix/mem,filesystem/posix,network/cni,environment_secret
W0613 17:11:23.947548  5329 backend.cpp:76] Failed to create 'aufs' backend: AufsBackend requires
root privileges
W0613 17:11:23.947664  5329 backend.cpp:76] Failed to create 'bind' backend: BindBackend requires
root privileges
I0613 17:11:23.947701  5329 provisioner.cpp:255] Using default backend 'copy'
I0613 17:11:23.949636  5329 cluster.cpp:448] Creating default 'local' authorizer
I0613 17:11:23.951781  5354 slave.cpp:248] Mesos agent started on (757)@172.17.0.3:42352
I0613 17:11:23.952308  5354 slave.cpp:249] Flags at startup: --acls="" --appc_simple_discovery_uri_prefix="http://"
--appc_store_dir="/tmp/Endpoint_SlaveEndpointTest_NoAuthorizer_0_KprPXe/store/appc" --authenticate_http_readonly="true"
--authenticate_http_readwrite="true" --authenticatee="crammd5" --authentication_backoff_factor="1secs"
--authorizer="local" --cgroups_cpu_enable_pids_and_tids_count="false" --cgroups_enable_cfs="false"
--cgroups_hierarchy="/sys/fs/cgroup" --cgroups_limit_swap="false" --cgroups_root="mesos" --container_disk_watch_interval="15secs"
--containerizers="mesos" --credential="/tmp/Endpoint_SlaveEndpointTest_NoAuthorizer_0_KprPXe/credential"
--default_role="*" --disk_watch_interval="1mins" --docker="docker" --docker_kill_orphans="true"
--docker_registry="https://registry-1.docker.io" --docker_remove_delay="6hrs" --docker_socket="/var/run/docker.sock"
--docker_stop_timeout="0ns" --docker_store_dir="/tmp/Endpoint_SlaveEndpointTest_NoAuthorizer_0_KprPXe/store/docker"
--docker_volume_checkpoint_dir="/var/run/mesos/isolators/docker/volume" --enforce_container_disk_quota="false"
--executor_registration_timeout="1mins" --executor_reregistration_timeout="2secs" --executor_shutdown_grace_period="5secs"
--fetcher_cache_dir="/tmp/Endpoint_SlaveEndpointTest_NoAuthorizer_0_KprPXe/fetch" --fetcher_cache_size="2GB"
--frameworks_home="" --gc_delay="1weeks" --gc_disk_headroom="0.1" --hadoop_home="" --help="false"
--hostname_lookup="true" --http_command_executor="false" --http_credentials="/tmp/Endpoint_SlaveEndpointTest_NoAuthorizer_0_KprPXe/http_credentials"
--http_heartbeat_interval="30secs" --initialize_driver_logging="true" --isolation="posix/cpu,posix/mem"
--launcher="posix" --launcher_dir="/mesos/mesos-1.4.0/_build/src" --logbufsecs="0" --logging_level="INFO"
--max_completed_executors_per_framework="150" --oversubscribed_resources_interval="15secs"
--perf_duration="10secs" --perf_interval="1mins" --port="5051" --qos_correction_interval_min="0ns"
--quiet="false" --recover="reconnect" --recovery_timeout="15mins" --registration_backoff_factor="10ms"
--resources="cpus:2;gpus:0;mem:1024;disk:1024;ports:[31000-32000]" --revocable_cpu_low_priority="true"
--runtime_dir="/tmp/Endpoint_SlaveEndpointTest_NoAuthorizer_0_KprPXe" --sandbox_directory="/mnt/mesos/sandbox"
--strict="true" --switch_user="true" --systemd_enable_support="true" --systemd_runtime_directory="/run/systemd/system"
--version="false" --work_dir="/tmp/Endpoint_SlaveEndpointTest_NoAuthorizer_0_GHlWYU"
I0613 17:11:23.953303  5354 credentials.hpp:86] Loading credential for authentication from
'/tmp/Endpoint_SlaveEndpointTest_NoAuthorizer_0_KprPXe/credential'
I0613 17:11:23.953945  5354 slave.cpp:281] Agent using credential for: test-principal
I0613 17:11:23.954279  5354 credentials.hpp:37] Loading credentials for authentication from
'/tmp/Endpoint_SlaveEndpointTest_NoAuthorizer_0_KprPXe/http_credentials'
I0613 17:11:23.955057  5354 http.cpp:975] Creating default 'basic' HTTP authenticator for
realm 'mesos-agent-readonly'
I0613 17:11:23.955529  5354 http.cpp:975] Creating default 'basic' HTTP authenticator for
realm 'mesos-agent-readwrite'
I0613 17:11:23.958225  5354 slave.cpp:552] Agent resources: cpus(*):2; mem(*):1024; disk(*):1024;
ports(*):[31000-32000]
I0613 17:11:23.958606  5354 slave.cpp:560] Agent attributes: [  ]
I0613 17:11:23.958930  5354 slave.cpp:565] Agent hostname: 1f9e878a0cd9
I0613 17:11:23.959487  5355 status_update_manager.cpp:177] Pausing sending status updates
I0613 17:11:23.961841  5353 state.cpp:62] Recovering state from '/tmp/Endpoint_SlaveEndpointTest_NoAuthorizer_0_GHlWYU/meta'
I0613 17:11:23.962893  5353 status_update_manager.cpp:203] Recovering status update manager
I0613 17:11:23.963141  5354 containerizer.cpp:582] Recovering containerizer
I0613 17:11:23.966011  5354 provisioner.cpp:416] Provisioner recovery complete
I0613 17:11:23.967164  5354 slave.cpp:6127] Finished recovery
I0613 17:11:23.968300  5354 slave.cpp:6309] Querying resource estimator for oversubscribable
resources
I0613 17:11:23.968928  5355 slave.cpp:6323] Received oversubscribable resources {} from the
resource estimator
I0613 17:11:23.973424  5348 process.cpp:3778] Handling HTTP event for process 'slave(757)'
with path: '/slave(757)/monitor/statistics'
I0613 17:11:23.975672  5348 http.cpp:1115] HTTP GET for /slave(757)/monitor/statistics from
172.17.0.3:58072
I0613 17:11:23.975760  5348 http.cpp:936] Authorizing principal 'test-principal' to GET the
'/monitor/statistics' endpoint
I0613 17:11:23.981364  5329 slave.cpp:817] Agent terminating
[       OK ] Endpoint/SlaveEndpointTest.NoAuthorizer/0 (45 ms)
[ RUN      ] Endpoint/SlaveEndpointTest.NoAuthorizer/1
I0613 17:11:23.992789  5329 containerizer.cpp:230] Using isolation: posix/cpu,posix/mem,filesystem/posix,network/cni,environment_secret
W0613 17:11:23.993366  5329 backend.cpp:76] Failed to create 'aufs' backend: AufsBackend requires
root privileges
W0613 17:11:23.993472  5329 backend.cpp:76] Failed to create 'bind' backend: BindBackend requires
root privileges
I0613 17:11:23.993510  5329 provisioner.cpp:255] Using default backend 'copy'
I0613 17:11:23.995290  5329 cluster.cpp:448] Creating default 'local' authorizer
I0613 17:11:23.997054  5353 slave.cpp:248] Mesos agent started on (758)@172.17.0.3:42352
I0613 17:11:23.997083  5353 slave.cpp:249] Flags at startup: --acls="" --appc_simple_discovery_uri_prefix="http://"
--appc_store_dir="/tmp/Endpoint_SlaveEndpointTest_NoAuthorizer_1_6Dk9kx/store/appc" --authenticate_http_readonly="true"
--authenticate_http_readwrite="true" --authenticatee="crammd5" --authentication_backoff_factor="1secs"
--authorizer="local" --cgroups_cpu_enable_pids_and_tids_count="false" --cgroups_enable_cfs="false"
--cgroups_hierarchy="/sys/fs/cgroup" --cgroups_limit_swap="false" --cgroups_root="mesos" --container_disk_watch_interval="15secs"
--containerizers="mesos" --credential="/tmp/Endpoint_SlaveEndpointTest_NoAuthorizer_1_6Dk9kx/credential"
--default_role="*" --disk_watch_interval="1mins" --docker="docker" --docker_kill_orphans="true"
--docker_registry="https://registry-1.docker.io" --docker_remove_delay="6hrs" --docker_socket="/var/run/docker.sock"
--docker_stop_timeout="0ns" --docker_store_dir="/tmp/Endpoint_SlaveEndpointTest_NoAuthorizer_1_6Dk9kx/store/docker"
--docker_volume_checkpoint_dir="/var/run/mesos/isolators/docker/volume" --enforce_container_disk_quota="false"
--executor_registration_timeout="1mins" --executor_reregistration_timeout="2secs" --executor_shutdown_grace_period="5secs"
--fetcher_cache_dir="/tmp/Endpoint_SlaveEndpointTest_NoAuthorizer_1_6Dk9kx/fetch" --fetcher_cache_size="2GB"
--frameworks_home="" --gc_delay="1weeks" --gc_disk_headroom="0.1" --hadoop_home="" --help="false"
--hostname_lookup="true" --http_command_executor="false" --http_credentials="/tmp/Endpoint_SlaveEndpointTest_NoAuthorizer_1_6Dk9kx/http_credentials"
--http_heartbeat_interval="30secs" --initialize_driver_logging="true" --isolation="posix/cpu,posix/mem"
--launcher="posix" --launcher_dir="/mesos/mesos-1.4.0/_build/src" --logbufsecs="0" --logging_level="INFO"
--max_completed_executors_per_framework="150" --oversubscribed_resources_interval="15secs"
--perf_duration="10secs" --perf_interval="1mins" --port="5051" --qos_correction_interval_min="0ns"
--quiet="false" --recover="reconnect" --recovery_timeout="15mins" --registration_backoff_factor="10ms"
--resources="cpus:2;gpus:0;mem:1024;disk:1024;ports:[31000-32000]" --revocable_cpu_low_priority="true"
--runtime_dir="/tmp/Endpoint_SlaveEndpointTest_NoAuthorizer_1_6Dk9kx" --sandbox_directory="/mnt/mesos/sandbox"
--strict="true" --switch_user="true" --systemd_enable_support="true" --systemd_runtime_directory="/run/systemd/system"
--version="false" --work_dir="/tmp/Endpoint_SlaveEndpointTest_NoAuthorizer_1_p1lged"
I0613 17:11:23.997798  5353 credentials.hpp:86] Loading credential for authentication from
'/tmp/Endpoint_SlaveEndpointTest_NoAuthorizer_1_6Dk9kx/credential'
I0613 17:11:23.997942  5353 slave.cpp:281] Agent using credential for: test-principal
I0613 17:11:23.997969  5353 credentials.hpp:37] Loading credentials for authentication from
'/tmp/Endpoint_SlaveEndpointTest_NoAuthorizer_1_6Dk9kx/http_credentials'
I0613 17:11:23.998442  5353 http.cpp:975] Creating default 'basic' HTTP authenticator for
realm 'mesos-agent-readonly'
I0613 17:11:23.998626  5353 http.cpp:975] Creating default 'basic' HTTP authenticator for
realm 'mesos-agent-readwrite'
I0613 17:11:24.001869  5353 slave.cpp:552] Agent resources: cpus(*):2; mem(*):1024; disk(*):1024;
ports(*):[31000-32000]
I0613 17:11:24.001951  5353 slave.cpp:560] Agent attributes: [  ]
I0613 17:11:24.001971  5353 slave.cpp:565] Agent hostname: 1f9e878a0cd9
I0613 17:11:24.002212  5355 status_update_manager.cpp:177] Pausing sending status updates
I0613 17:11:24.005162  5352 state.cpp:62] Recovering state from '/tmp/Endpoint_SlaveEndpointTest_NoAuthorizer_1_p1lged/meta'
I0613 17:11:24.005990  5350 status_update_manager.cpp:203] Recovering status update manager
I0613 17:11:24.006407  5350 containerizer.cpp:582] Recovering containerizer
I0613 17:11:24.008839  5348 provisioner.cpp:416] Provisioner recovery complete
I0613 17:11:24.009412  5348 slave.cpp:6127] Finished recovery
I0613 17:11:24.010401  5348 slave.cpp:6309] Querying resource estimator for oversubscribable
resources
I0613 17:11:24.011184  5355 slave.cpp:6323] Received oversubscribable resources {} from the
resource estimator
I0613 17:11:24.015023  5350 process.cpp:3778] Handling HTTP event for process 'slave(758)'
with path: '/slave(758)/monitor/statistics.json'
I0613 17:11:24.016911  5350 http.cpp:1115] HTTP GET for /slave(758)/monitor/statistics.json
from 172.17.0.3:58074
I0613 17:11:24.016988  5350 http.cpp:936] Authorizing principal 'test-principal' to GET the
'/monitor/statistics.json' endpoint
I0613 17:11:24.021524  5329 slave.cpp:817] Agent terminating
[       OK ] Endpoint/SlaveEndpointTest.NoAuthorizer/1 (40 ms)
[ RUN      ] Endpoint/SlaveEndpointTest.NoAuthorizer/2
I0613 17:11:24.033319  5329 containerizer.cpp:230] Using isolation: posix/cpu,posix/mem,filesystem/posix,network/cni,environment_secret
W0613 17:11:24.033898  5329 backend.cpp:76] Failed to create 'aufs' backend: AufsBackend requires
root privileges
W0613 17:11:24.034018  5329 backend.cpp:76] Failed to create 'bind' backend: BindBackend requires
root privileges
I0613 17:11:24.034085  5329 provisioner.cpp:255] Using default backend 'copy'
I0613 17:11:24.035964  5329 cluster.cpp:448] Creating default 'local' authorizer
I0613 17:11:24.037665  5353 slave.cpp:248] Mesos agent started on (759)@172.17.0.3:42352
I0613 17:11:24.037691  5353 slave.cpp:249] Flags at startup: --acls="" --appc_simple_discovery_uri_prefix="http://"
--appc_store_dir="/tmp/Endpoint_SlaveEndpointTest_NoAuthorizer_2_wgNibQ/store/appc" --authenticate_http_readonly="true"
--authenticate_http_readwrite="true" --authenticatee="crammd5" --authentication_backoff_factor="1secs"
--authorizer="local" --cgroups_cpu_enable_pids_and_tids_count="false" --cgroups_enable_cfs="false"
--cgroups_hierarchy="/sys/fs/cgroup" --cgroups_limit_swap="false" --cgroups_root="mesos" --container_disk_watch_interval="15secs"
--containerizers="mesos" --credential="/tmp/Endpoint_SlaveEndpointTest_NoAuthorizer_2_wgNibQ/credential"
--default_role="*" --disk_watch_interval="1mins" --docker="docker" --docker_kill_orphans="true"
--docker_registry="https://registry-1.docker.io" --docker_remove_delay="6hrs" --docker_socket="/var/run/docker.sock"
--docker_stop_timeout="0ns" --docker_store_dir="/tmp/Endpoint_SlaveEndpointTest_NoAuthorizer_2_wgNibQ/store/docker"
--docker_volume_checkpoint_dir="/var/run/mesos/isolators/docker/volume" --enforce_container_disk_quota="false"
--executor_registration_timeout="1mins" --executor_reregistration_timeout="2secs" --executor_shutdown_grace_period="5secs"
--fetcher_cache_dir="/tmp/Endpoint_SlaveEndpointTest_NoAuthorizer_2_wgNibQ/fetch" --fetcher_cache_size="2GB"
--frameworks_home="" --gc_delay="1weeks" --gc_disk_headroom="0.1" --hadoop_home="" --help="false"
--hostname_lookup="true" --http_command_executor="false" --http_credentials="/tmp/Endpoint_SlaveEndpointTest_NoAuthorizer_2_wgNibQ/http_credentials"
--http_heartbeat_interval="30secs" --initialize_driver_logging="true" --isolation="posix/cpu,posix/mem"
--launcher="posix" --launcher_dir="/mesos/mesos-1.4.0/_build/src" --logbufsecs="0" --logging_level="INFO"
--max_completed_executors_per_framework="150" --oversubscribed_resources_interval="15secs"
--perf_duration="10secs" --perf_interval="1mins" --port="5051" --qos_correction_interval_min="0ns"
--quiet="false" --recover="reconnect" --recovery_timeout="15mins" --registration_backoff_factor="10ms"
--resources="cpus:2;gpus:0;mem:1024;disk:1024;ports:[31000-32000]" --revocable_cpu_low_priority="true"
--runtime_dir="/tmp/Endpoint_SlaveEndpointTest_NoAuthorizer_2_wgNibQ" --sandbox_directory="/mnt/mesos/sandbox"
--strict="true" --switch_user="true" --systemd_enable_support="true" --systemd_runtime_directory="/run/systemd/system"
--version="false" --work_dir="/tmp/Endpoint_SlaveEndpointTest_NoAuthorizer_2_PpfgXv"
I0613 17:11:24.038120  5353 credentials.hpp:86] Loading credential for authentication from
'/tmp/Endpoint_SlaveEndpointTest_NoAuthorizer_2_wgNibQ/credential'
I0613 17:11:24.038611  5353 slave.cpp:281] Agent using credential for: test-principal
I0613 17:11:24.038640  5353 credentials.hpp:37] Loading credentials for authentication from
'/tmp/Endpoint_SlaveEndpointTest_NoAuthorizer_2_wgNibQ/http_credentials'
I0613 17:11:24.040489  5353 http.cpp:975] Creating default 'basic' HTTP authenticator for
realm 'mesos-agent-readonly'
I0613 17:11:24.040670  5353 http.cpp:975] Creating default 'basic' HTTP authenticator for
realm 'mesos-agent-readwrite'
I0613 17:11:24.043507  5353 slave.cpp:552] Agent resources: cpus(*):2; mem(*):1024; disk(*):1024;
ports(*):[31000-32000]
I0613 17:11:24.043690  5353 slave.cpp:560] Agent attributes: [  ]
I0613 17:11:24.043705  5353 slave.cpp:565] Agent hostname: 1f9e878a0cd9
I0613 17:11:24.044832  5351 status_update_manager.cpp:177] Pausing sending status updates
I0613 17:11:24.046067  5353 state.cpp:62] Recovering state from '/tmp/Endpoint_SlaveEndpointTest_NoAuthorizer_2_PpfgXv/meta'
I0613 17:11:24.046988  5353 status_update_manager.cpp:203] Recovering status update manager
I0613 17:11:24.047361  5355 containerizer.cpp:582] Recovering containerizer
I0613 17:11:24.050228  5350 provisioner.cpp:416] Provisioner recovery complete
I0613 17:11:24.051077  5352 slave.cpp:6127] Finished recovery
I0613 17:11:24.052202  5352 slave.cpp:6309] Querying resource estimator for oversubscribable
resources
I0613 17:11:24.052824  5352 slave.cpp:6323] Received oversubscribable resources {} from the
resource estimator
I0613 17:11:24.057677  5349 process.cpp:3778] Handling HTTP event for process 'slave(759)'
with path: '/slave(759)/containers'
I0613 17:11:24.060112  5355 http.cpp:1115] HTTP GET for /slave(759)/containers from 172.17.0.3:58076
I0613 17:11:24.060634  5355 http.cpp:936] Authorizing principal 'test-principal' to GET the
'/containers' endpoint
I0613 17:11:24.067658  5353 slave.cpp:817] Agent terminating
[       OK ] Endpoint/SlaveEndpointTest.NoAuthorizer/2 (46 ms)
[----------] 9 tests from Endpoint/SlaveEndpointTest (425 ms total)

[----------] Global test environment tear-down
[==========] 1586 tests from 176 test cases ran. (614104 ms total)
[  PASSED  ] 1584 tests.
[  FAILED  ] 2 tests, listed below:
[  FAILED  ] DefaultExecutorCheckTest.CommandCheckDeliveredAndReconciled
[  FAILED  ] DefaultExecutorCheckTest.CommandCheckStatusChange

 2 FAILED TESTS
  YOU HAVE 22 DISABLED TESTS

E0613 17:11:24.128211  5356 process.cpp:968] Failed to accept socket: future discarded
make[4]: *** [check-local] Error 1
make[4]: Leaving directory `/mesos/mesos-1.4.0/_build/src'
make[3]: *** [check-am] Error 2
make[3]: Leaving directory `/mesos/mesos-1.4.0/_build/src'
make[2]: *** [check] Error 2
make[2]: Leaving directory `/mesos/mesos-1.4.0/_build/src'
make[1]: *** [check-recursive] Error 1
make[1]: Leaving directory `/mesos/mesos-1.4.0/_build'
make: *** [distcheck] Error 1
+ docker rmi mesos-1497370079-463
Untagged: mesos-1497370079-463:latest
Deleted: sha256:41277dbf22adc39b1e66151e6e98d76187ad5022ce4302f48a5a312f651ed4f3
Deleted: sha256:6ec52e6d992cf365f89e6873b1eb2c339cbc6a90e787c489c91b59a7ecd1dd38
Deleted: sha256:55f82126f88a8521722a42ad109b6e711b15ca88e6cbf89931dcd00264494c13
Deleted: sha256:17bd755aaf8bdd63a0293629f23a6a8a51df00f6894d68bbd7d420c9bda0a773
Deleted: sha256:f5e33c6a7102999a8ab0034fd08377e8bb1430df550f91a9136b98474d6cb77a
Deleted: sha256:926ef3afbaa741fc680a1aa82abb7242dcdcf5511da7ea3a2f6ce9fb56955c07
Deleted: sha256:05375a75e3cb4105feba9700475926caa2ee52bdf84e22d92f77033865417828
Deleted: sha256:d632a9b6b2b4de547b217a367b8a2a7834b3bceb8e3205ad79b36b4efce164e1
Deleted: sha256:9838f09f3edcd1bfbe5cbe91e760bc44d761e056f4318edc664655564723ff21
Deleted: sha256:cc4b1b4e9bb5682f8799da8f27942946c65508ea57cbb1eaa49b4e94bcdb81f8
Deleted: sha256:f5a2c88cf6a5e4a6aec6362770b16dab258fe8353e1fb942569b9679dddf0f5b
Deleted: sha256:d679b388527cd3c6c1237f4753fea77a2b3b9d2ca56779aebb656e24d519f189
Deleted: sha256:ff846816e156854bc5ec54b6d7483b91da30aab4932118911eb6bd1898b180e2
Deleted: sha256:68a404353d2f23a4f540db4e92e1be90b1ffd181982d61c1258d484db9a65b8e
Deleted: sha256:4595d3ed40fee2bddccfe6522c9a250fd4614085ce6eb50ecdbb54f17c970721
Deleted: sha256:b981d46f4a20cc26f57f4c4eb8d1900bd704098079e1ab89111a5162983b32e4
Deleted: sha256:8ba68442c20a99ea1ad61629529c5b404f06e044a236d740752e63df3161f06b
Deleted: sha256:0ebeedb71d710cf0d3567c285106a635e5e2df681b8cbc5ce7b70ab57592bbde
Deleted: sha256:889af8878a3cd4a6145e39bf330d016b455c6cc60c6a0a45ce10c0f6f2abbca2
Deleted: sha256:d5692a7ca03a8c0f84f0d7a80869da3a9931bada6e7099c189f4112b76765e60
Deleted: sha256:e4dd4fd27279007f08d1ffabf879bbe2dbc31fa81b2597487e1a17d760e40ecb
Deleted: sha256:73bcf48c384fca2cae3ab85b5afa343601cc06e44e99c4c909767e5ee3e537b1
Deleted: sha256:a20d2c7eec832aa67440110a39601e193517cf40478b1ea1494716caa24bae71
Deleted: sha256:8c6c60fb078555ba7d8d73a21067b63e4e05deb552959e9be1dd60fd39f8a198
Deleted: sha256:43cb4b05dcdb3be4455c683756bbce9847ba60fd99b06571a0c2c86f2b6fbf76
Build step 'Execute shell' marked build as failure

Mime
View raw message