mesos-builds mailing list archives

Site index · List index
Message view « Date » · « Thread »
Top « Date » · « Thread »
From Apache Jenkins Server <jenk...@builds.apache.org>
Subject Build failed in Jenkins: Mesos-Buildbot » autotools,clang,--verbose --enable-libevent --enable-ssl,GLOG_v=1 MESOS_VERBOSE=1,ubuntu:14.04,(ubuntu)&&(!ubuntu-us1)&&(!ubuntu-eu2) #3799
Date Wed, 14 Jun 2017 21:07:52 GMT
See <https://builds.apache.org/job/Mesos-Buildbot/BUILDTOOL=autotools,COMPILER=clang,CONFIGURATION=--verbose%20--enable-libevent%20--enable-ssl,ENVIRONMENT=GLOG_v=1%20MESOS_VERBOSE=1,OS=ubuntu%3A14.04,label_exp=(ubuntu)&&(!ubuntu-us1)&&(!ubuntu-eu2)/3799/display/redirect?page=changes>

Changes:

[yujie.jay] Ensure that host /etc/* files are mounted RDONLY by the CNI Isolator.

[yujie.jay] Test that bind-mounted host network configuration is mounted readonly.

------------------------------------------
[...truncated 29.56 MB...]
running bdist_egg
writing namespace_packages to src/mesos.native.egg-info/namespace_packages.txt
writing top-level names to src/mesos.native.egg-info/top_level.txt
reading manifest file 'src/mesos.cli.egg-info/SOURCES.txt'
writing dependency_links to src/mesos.native.egg-info/dependency_links.txt
running bdist_egg
running bdist_egg
writing manifest file 'src/mesos.cli.egg-info/SOURCES.txt'
installing library code to build/bdist.linux-x86_64/egg
running egg_info
writing requirements to src/mesos.scheduler.egg-info/requires.txt
writing src/mesos.scheduler.egg-info/PKG-INFO
writing namespace_packages to src/mesos.scheduler.egg-info/namespace_packages.txt
writing top-level names to src/mesos.scheduler.egg-info/top_level.txt
writing dependency_links to src/mesos.scheduler.egg-info/dependency_links.txt
reading manifest file 'src/mesos.native.egg-info/SOURCES.txt'
running egg_info
running egg_info
writing requirements to src/mesos.egg-info/requires.txt
writing manifest file 'src/mesos.native.egg-info/SOURCES.txt'
writing requirements to src/mesos.executor.egg-info/requires.txt
writing src/mesos.egg-info/PKG-INFO
installing library code to build/bdist.linux-x86_64/egg
running egg_info
writing top-level names to src/mesos.egg-info/top_level.txt
writing src/mesos.executor.egg-info/PKG-INFO
writing requirements to src/mesos.interface.egg-info/requires.txt
writing dependency_links to src/mesos.egg-info/dependency_links.txt
writing src/mesos.interface.egg-info/PKG-INFO
writing namespace_packages to src/mesos.executor.egg-info/namespace_packages.txt
writing top-level names to src/mesos.executor.egg-info/top_level.txt
writing dependency_links to src/mesos.executor.egg-info/dependency_links.txt
writing namespace_packages to src/mesos.interface.egg-info/namespace_packages.txt
writing top-level names to src/mesos.interface.egg-info/top_level.txt
writing dependency_links to src/mesos.interface.egg-info/dependency_links.txt
reading manifest file 'src/mesos.scheduler.egg-info/SOURCES.txt'
writing manifest file 'src/mesos.scheduler.egg-info/SOURCES.txt'
installing library code to build/bdist.linux-x86_64/egg
reading manifest file 'src/mesos.interface.egg-info/SOURCES.txt'
reading manifest file 'src/mesos.executor.egg-info/SOURCES.txt'
writing manifest file 'src/mesos.interface.egg-info/SOURCES.txt'
installing library code to build/bdist.linux-x86_64/egg
reading manifest file 'src/mesos.egg-info/SOURCES.txt'
writing manifest file 'src/mesos.executor.egg-info/SOURCES.txt'
installing library code to build/bdist.linux-x86_64/egg
writing manifest file 'src/mesos.egg-info/SOURCES.txt'
installing library code to build/bdist.linux-x86_64/egg
running install_lib
running build_py
creating build/bdist.linux-x86_64/egg
creating build/bdist.linux-x86_64/egg/mesos
copying build/lib.linux-x86_64-2.7/mesos/futures.py -> build/bdist.linux-x86_64/egg/mesos
copying build/lib.linux-x86_64-2.7/mesos/cli.py -> build/bdist.linux-x86_64/egg/mesos
copying build/lib.linux-x86_64-2.7/mesos/__init__.py -> build/bdist.linux-x86_64/egg/mesos
copying build/lib.linux-x86_64-2.7/mesos/http.py -> build/bdist.linux-x86_64/egg/mesos
byte-compiling build/bdist.linux-x86_64/egg/mesos/futures.py to futures.pyc
running install_lib
running build_py
byte-compiling build/bdist.linux-x86_64/egg/mesos/cli.py to cli.pyc
byte-compiling build/bdist.linux-x86_64/egg/mesos/__init__.py to __init__.pyc
creating build/bdist.linux-x86_64/egg
byte-compiling build/bdist.linux-x86_64/egg/mesos/http.py to http.pyc
creating build/bdist.linux-x86_64/egg/mesos
creating build/bdist.linux-x86_64/egg/mesos/native
copying build/lib.linux-x86_64-2.7/mesos/native/__init__.py -> build/bdist.linux-x86_64/egg/mesos/native
creating build/bdist.linux-x86_64/egg/EGG-INFO
copying src/mesos.cli.egg-info/PKG-INFO -> build/bdist.linux-x86_64/egg/EGG-INFO
copying build/lib.linux-x86_64-2.7/mesos/__init__.py -> build/bdist.linux-x86_64/egg/mesos
copying src/mesos.cli.egg-info/SOURCES.txt -> build/bdist.linux-x86_64/egg/EGG-INFO
copying src/mesos.cli.egg-info/dependency_links.txt -> build/bdist.linux-x86_64/egg/EGG-INFO
byte-compiling build/bdist.linux-x86_64/egg/mesos/native/__init__.py to __init__.pyc
copying src/mesos.cli.egg-info/namespace_packages.txt -> build/bdist.linux-x86_64/egg/EGG-INFO
copying src/mesos.cli.egg-info/top_level.txt -> build/bdist.linux-x86_64/egg/EGG-INFO
zip_safe flag not set; analyzing archive contents...
mesos.__init__: module references __path__
running install_lib
running build_py
creating '/mesos/mesos-1.4.0/_build/src/python/dist/mesos.cli-1.4.0-py2.7.egg' and adding
'build/bdist.linux-x86_64/egg' to it
running build_ext
byte-compiling build/bdist.linux-x86_64/egg/mesos/__init__.py to __init__.pyc
creating build/bdist.linux-x86_64/egg/EGG-INFO
copying src/mesos.native.egg-info/PKG-INFO -> build/bdist.linux-x86_64/egg/EGG-INFO
creating build/bdist.linux-x86_64/egg
copying src/mesos.native.egg-info/SOURCES.txt -> build/bdist.linux-x86_64/egg/EGG-INFO
creating build/bdist.linux-x86_64/egg/mesos
creating build/bdist.linux-x86_64/egg/mesos/scheduler
copying src/mesos.native.egg-info/dependency_links.txt -> build/bdist.linux-x86_64/egg/EGG-INFO
copying build/lib.linux-x86_64-2.7/mesos/scheduler/_scheduler.so -> build/bdist.linux-x86_64/egg/mesos/scheduler
copying src/mesos.native.egg-info/namespace_packages.txt -> build/bdist.linux-x86_64/egg/EGG-INFO
copying src/mesos.native.egg-info/requires.txt -> build/bdist.linux-x86_64/egg/EGG-INFO
copying src/mesos.native.egg-info/top_level.txt -> build/bdist.linux-x86_64/egg/EGG-INFO
zip_safe flag not set; analyzing archive contents...
mesos.__init__: module references __path__
removing 'build/bdist.linux-x86_64/egg' (and everything under it)
running bdist_wheel
running build
creating '/mesos/mesos-1.4.0/_build/src/python/dist/mesos.native-1.4.0-py2.7.egg' and adding
'build/bdist.linux-x86_64/egg' to it
installing to build/bdist.linux-x86_64/wheel
running install
running install_lib
removing 'build/bdist.linux-x86_64/egg' (and everything under it)
copying mesos/futures.py -> build/bdist.linux-x86_64/wheel/mesos
copying mesos/cli.py -> build/bdist.linux-x86_64/wheel/mesos
Skipping installation of build/bdist.linux-x86_64/wheel/mesos/__init__.py (namespace package)
copying mesos/http.py -> build/bdist.linux-x86_64/wheel/mesos
running install_lib
running build_py
running install_egg_info
Copying src/mesos.cli.egg-info to build/bdist.linux-x86_64/wheel/mesos.cli-1.4.0-py2.7.egg-info
running bdist_wheel
creating build/bdist.linux-x86_64/egg
creating build/bdist.linux-x86_64/egg/mesos
copying build/lib.linux-x86_64-2.7/mesos/__init__.py -> build/bdist.linux-x86_64/egg/mesos
running build
byte-compiling build/bdist.linux-x86_64/egg/mesos/__init__.py to __init__.pyc
Installing build/bdist.linux-x86_64/wheel/mesos.cli-1.4.0-py2.7-nspkg.pth
running install_scripts
running install_lib
running build_py
creating build/bdist.linux-x86_64/egg/EGG-INFO
installing to build/bdist.linux-x86_64/wheel
running install
copying src/mesos.egg-info/PKG-INFO -> build/bdist.linux-x86_64/egg/EGG-INFO
running install_lib
copying src/mesos.egg-info/SOURCES.txt -> build/bdist.linux-x86_64/egg/EGG-INFO
copying src/mesos.egg-info/dependency_links.txt -> build/bdist.linux-x86_64/egg/EGG-INFO
Skipping installation of build/bdist.linux-x86_64/wheel/mesos/__init__.py (namespace package)
copying mesos/native/__init__.py -> build/bdist.linux-x86_64/wheel/mesos/native
copying src/mesos.egg-info/requires.txt -> build/bdist.linux-x86_64/egg/EGG-INFO
running install_lib
copying src/mesos.egg-info/top_level.txt -> build/bdist.linux-x86_64/egg/EGG-INFO
running build_ext
zip_safe flag not set; analyzing archive contents...
running build_py
running install_egg_info
mesos.__init__: module references __path__
creating '/mesos/mesos-1.4.0/_build/src/python/dist/mesos-1.4.0-py2.7.egg' and adding 'build/bdist.linux-x86_64/egg'
to it
Copying src/mesos.native.egg-info to build/bdist.linux-x86_64/wheel/mesos.native-1.4.0-py2.7.egg-info
creating build/bdist.linux-x86_64/egg
Installing build/bdist.linux-x86_64/wheel/mesos.native-1.4.0-py2.7-nspkg.pth
running install_scripts
creating build/bdist.linux-x86_64/egg/mesos
removing 'build/bdist.linux-x86_64/egg' (and everything under it)
creating build/bdist.linux-x86_64/egg/mesos/interface
copying build/lib.linux-x86_64-2.7/mesos/interface/mesos_pb2.py -> build/bdist.linux-x86_64/egg/mesos/interface
creating build/bdist.linux-x86_64/egg
running bdist_wheel
creating build/bdist.linux-x86_64/egg/mesos
copying build/lib.linux-x86_64-2.7/mesos/__init__.py -> build/bdist.linux-x86_64/egg/mesos
running build
creating build/bdist.linux-x86_64/egg/mesos/executor
copying build/lib.linux-x86_64-2.7/mesos/executor/__init__.py -> build/bdist.linux-x86_64/egg/mesos/executor
copying build/lib.linux-x86_64-2.7/mesos/executor/_executor.so -> build/bdist.linux-x86_64/egg/mesos/executor
copying build/lib.linux-x86_64-2.7/mesos/interface/__init__.py -> build/bdist.linux-x86_64/egg/mesos/interface
copying build/lib.linux-x86_64-2.7/mesos/__init__.py -> build/bdist.linux-x86_64/egg/mesos
byte-compiling build/bdist.linux-x86_64/egg/mesos/interface/mesos_pb2.py to mesos_pb2.pyc
installing to build/bdist.linux-x86_64/wheel
running install
running install_lib
creating build/bdist.linux-x86_64/wheel
creating build/bdist.linux-x86_64/wheel/mesos
copying build/lib.linux-x86_64-2.7/mesos/__init__.py -> build/bdist.linux-x86_64/wheel/mesos
running install_egg_info
Copying src/mesos.egg-info to build/bdist.linux-x86_64/wheel/mesos-1.4.0-py2.7.egg-info
running install_scripts
creating build/bdist.linux-x86_64/wheel/mesos.cli-1.4.0.dist-info/WHEEL
creating build/bdist.linux-x86_64/wheel/mesos.native-1.4.0.dist-info/WHEEL
creating build/bdist.linux-x86_64/wheel/mesos-1.4.0.dist-info/WHEEL
byte-compiling build/bdist.linux-x86_64/egg/mesos/interface/__init__.py to __init__.pyc
byte-compiling build/bdist.linux-x86_64/egg/mesos/__init__.py to __init__.pyc
creating build/bdist.linux-x86_64/egg/EGG-INFO
copying src/mesos.interface.egg-info/PKG-INFO -> build/bdist.linux-x86_64/egg/EGG-INFO
copying src/mesos.interface.egg-info/SOURCES.txt -> build/bdist.linux-x86_64/egg/EGG-INFO
copying src/mesos.interface.egg-info/dependency_links.txt -> build/bdist.linux-x86_64/egg/EGG-INFO
copying src/mesos.interface.egg-info/namespace_packages.txt -> build/bdist.linux-x86_64/egg/EGG-INFO
copying src/mesos.interface.egg-info/requires.txt -> build/bdist.linux-x86_64/egg/EGG-INFO
copying src/mesos.interface.egg-info/top_level.txt -> build/bdist.linux-x86_64/egg/EGG-INFO
zip_safe flag not set; analyzing archive contents...
mesos.__init__: module references __path__
creating '/mesos/mesos-1.4.0/_build/src/python/dist/mesos.interface-1.4.0-py2.7.egg' and adding
'build/bdist.linux-x86_64/egg' to it
removing 'build/bdist.linux-x86_64/egg' (and everything under it)
running bdist_wheel
running build
installing to build/bdist.linux-x86_64/wheel
running install
running install_lib
Skipping installation of build/bdist.linux-x86_64/wheel/mesos/__init__.py (namespace package)
copying mesos/interface/mesos_pb2.py -> build/bdist.linux-x86_64/wheel/mesos/interface
copying mesos/interface/__init__.py -> build/bdist.linux-x86_64/wheel/mesos/interface
running install_egg_info
Copying src/mesos.interface.egg-info to build/bdist.linux-x86_64/wheel/mesos.interface-1.4.0-py2.7.egg-info
Installing build/bdist.linux-x86_64/wheel/mesos.interface-1.4.0-py2.7-nspkg.pth
running install_scripts
byte-compiling build/bdist.linux-x86_64/egg/mesos/__init__.py to __init__.pyc
byte-compiling build/bdist.linux-x86_64/egg/mesos/executor/__init__.py to __init__.pyc
creating stub loader for mesos/executor/_executor.so
byte-compiling build/bdist.linux-x86_64/egg/mesos/executor/_executor.py to _executor.pyc
creating build/bdist.linux-x86_64/egg/EGG-INFO
copying src/mesos.executor.egg-info/PKG-INFO -> build/bdist.linux-x86_64/egg/EGG-INFO
copying src/mesos.executor.egg-info/SOURCES.txt -> build/bdist.linux-x86_64/egg/EGG-INFO
copying src/mesos.executor.egg-info/dependency_links.txt -> build/bdist.linux-x86_64/egg/EGG-INFO
copying src/mesos.executor.egg-info/namespace_packages.txt -> build/bdist.linux-x86_64/egg/EGG-INFO
copying src/mesos.executor.egg-info/requires.txt -> build/bdist.linux-x86_64/egg/EGG-INFO
copying src/mesos.executor.egg-info/top_level.txt -> build/bdist.linux-x86_64/egg/EGG-INFO
writing build/bdist.linux-x86_64/egg/EGG-INFO/native_libs.txt
zip_safe flag not set; analyzing archive contents...
mesos.__init__: module references __path__
creating '/mesos/mesos-1.4.0/_build/src/python/dist/mesos.executor-1.4.0-py2.7-linux-x86_64.egg'
and adding 'build/bdist.linux-x86_64/egg' to it
creating build/bdist.linux-x86_64/wheel/mesos.interface-1.4.0.dist-info/WHEEL
error: [Errno 28] No space left on device
Exception IOError: (28, 'No space left on device') in <bound method ZipFile.__del__ of
<zipfile.ZipFile object at 0x2aeb022ec350>> ignored
error: [Errno 28] No space left on device
make[3]: *** [python/dist/mesos.scheduler-1.4.0-py2.7-linux-x86_64.egg] Error 1
make[3]: *** Waiting for unfinished jobs....
make[3]: *** [python/dist/mesos.executor-1.4.0-py2.7-linux-x86_64.egg] Error 1
make[3]: Leaving directory `/mesos/mesos-1.4.0/_build/src'
make[2]: *** [install] Error 2
make[2]: Leaving directory `/mesos/mesos-1.4.0/_build/src'
make[1]: *** [install-recursive] Error 1
make[1]: Leaving directory `/mesos/mesos-1.4.0/_build'
make: *** [distcheck] Error 1
+ docker rmi mesos-1497469056-2259
Untagged: mesos-1497469056-2259:latest
Deleted: sha256:a24142df4a36f1f6cad7ca1c2211d7dfb4620635b8225c12df63352c12a24f6f
Deleted: sha256:da0f95572d7c6681f82c8d07fc96d6fb4baab239db31852ff69e77638e42fcfb
Deleted: sha256:60b986afd25f2c03a861ced560989dbf8d82930cf6aae706ad19501480bcde50
Deleted: sha256:75458d7887c0161b16cf30785143af368d007a94ef8a1a13adb708e1b9eb1747
Deleted: sha256:1d1eb64f6228194a5f178c9f18bd22f44c689fdb3743b03eaa65935b426d1181
Deleted: sha256:ae695ed4f65f1100d5cf8e4a97f57d07bf3b1a2260485698910bdaaf8635d22b
Deleted: sha256:0fe0c1050506f8e244c19e56236a4fba8fbfcf6176ecf79a25a071155547c673
Deleted: sha256:b6a94c12ab630ac18ac1bd25d5f81b6dd14a096925edca5b9e0be4f3722dde73
Deleted: sha256:cedcc3205ec9345654131880b15fad6f8b085d9b1f047b807815e5ac1ca39459
Deleted: sha256:163b94f03f889c54231f6b087b9aa5193c22fc86264308a348c24fb84ed1dd5a
Deleted: sha256:6497072f90a69b9889f75994714948f297a95da313332c88f9c9297ece5b3eff
Deleted: sha256:58b721f134f88a28cc8f8d6e351242fd2f843b6222efdcf82eb1f619903203ce
Deleted: sha256:20735618423ee84411c26409a5802eb526cfaf18caf78bacb0dd61deba2150d5
Deleted: sha256:f46e95943d45e822f9652115035df3f60dff0709c5e66fa7658e0b599730b08d
Deleted: sha256:ebc2eb763da93ab336f25ed20c9a1c7e3b21f142fb26831b9c6efdea05108331
Deleted: sha256:c55fa3d9fa57adb3336fb29902587e4dbdd36ba653365918589ab2055a9db348
Deleted: sha256:2b22508fc4c4af306950a2aa2f24a16a052f47e9595774c620256d243457e35c
Deleted: sha256:53fcd0fd6b6c8c15f5bf5998af19f7ce226ee9ed4c9e931f47bb43fc0a80274b
Deleted: sha256:60c74d6a986f34243ee94048b0fd15be033a149b31775dd114e1547c6d6aa5ec
Deleted: sha256:f1c657ba484d4261282284525b8e13430a23983745d15959c9ca99d016a8b177
Deleted: sha256:decb344f730ee8853426341888e6954c001bb31ca1a86787a81847a174245180
Deleted: sha256:28824915c890633559b84a14c4ea8344aea62b9586fb201874c8a25a2d5e55f1
Deleted: sha256:091503445320da37e1db6ab20d9a2da35d14cf72a7fb8cc4bf50e1d12522b55d
Deleted: sha256:e9932903193703da876bdc5a8c25bb38335d3a4c98c18b26e2d985a32c879afa
Build step 'Execute shell' marked build as failure
Not sending mail to unregistered user yujie.jay@gmail.com

Mime
View raw message