mesos-builds mailing list archives

Site index · List index
Message view « Date » · « Thread »
Top « Date » · « Thread »
From Apache Jenkins Server <jenk...@builds.apache.org>
Subject Build failed in Jenkins: Mesos-Reviewbot #18342
Date Sun, 11 Jun 2017 19:06:38 GMT
See <https://builds.apache.org/job/Mesos-Reviewbot/18342/display/redirect>

------------------------------------------
[...truncated 28.20 MB...]
W0611 19:06:32.065171  4581 backend.cpp:76] Failed to create 'overlay' backend: OverlayBackend
requires root privileges
W0611 19:06:32.065335  4581 backend.cpp:76] Failed to create 'bind' backend: BindBackend requires
root privileges
I0611 19:06:32.065377  4581 provisioner.cpp:255] Using default backend 'copy'
I0611 19:06:32.071415  4601 slave.cpp:248] Mesos agent started on (756)@172.17.0.2:41667
I0611 19:06:32.071456  4601 slave.cpp:249] Flags at startup: --acls="" --appc_simple_discovery_uri_prefix="http://"
--appc_store_dir="/tmp/Endpoint_SlaveEndpointTest_AuthorizedRequest_2_Rudb3k/store/appc" --authenticate_http_readonly="true"
--authenticate_http_readwrite="true" --authenticatee="crammd5" --authentication_backoff_factor="1secs"
--authorizer="local" --cgroups_cpu_enable_pids_and_tids_count="false" --cgroups_enable_cfs="false"
--cgroups_hierarchy="/sys/fs/cgroup" --cgroups_limit_swap="false" --cgroups_root="mesos" --container_disk_watch_interval="15secs"
--containerizers="mesos" --credential="/tmp/Endpoint_SlaveEndpointTest_AuthorizedRequest_2_Rudb3k/credential"
--default_role="*" --disk_watch_interval="1mins" --docker="docker" --docker_kill_orphans="true"
--docker_registry="https://registry-1.docker.io" --docker_remove_delay="6hrs" --docker_socket="/var/run/docker.sock"
--docker_stop_timeout="0ns" --docker_store_dir="/tmp/Endpoint_SlaveEndpointTest_AuthorizedRequest_2_Rudb3k/store/docker"
--docker_volume_checkpoint_dir="/var/run/mesos/isolators/docker/volume" --enforce_container_disk_quota="false"
--executor_registration_timeout="1mins" --executor_reregistration_timeout="2secs" --executor_shutdown_grace_period="5secs"
--fetcher_cache_dir="/tmp/Endpoint_SlaveEndpointTest_AuthorizedRequest_2_Rudb3k/fetch" --fetcher_cache_size="2GB"
--frameworks_home="" --gc_delay="1weeks" --gc_disk_headroom="0.1" --hadoop_home="" --help="false"
--hostname_lookup="true" --http_command_executor="false" --http_credentials="/tmp/Endpoint_SlaveEndpointTest_AuthorizedRequest_2_Rudb3k/http_credentials"
--http_heartbeat_interval="30secs" --initialize_driver_logging="true" --isolation="posix/cpu,posix/mem"
--launcher="posix" --launcher_dir="/mesos/mesos-1.4.0/_build/src" --logbufsecs="0" --logging_level="INFO"
--max_completed_executors_per_framework="150" --oversubscribed_resources_interval="15secs"
--perf_duration="10secs" --perf_interval="1mins" --port="5051" --qos_correction_interval_min="0ns"
--quiet="false" --recover="reconnect" --recovery_timeout="15mins" --registration_backoff_factor="10ms"
--resources="cpus:2;gpus:0;mem:1024;disk:1024;ports:[31000-32000]" --revocable_cpu_low_priority="true"
--runtime_dir="/tmp/Endpoint_SlaveEndpointTest_AuthorizedRequest_2_Rudb3k" --sandbox_directory="/mnt/mesos/sandbox"
--strict="true" --switch_user="true" --systemd_enable_support="true" --systemd_runtime_directory="/run/systemd/system"
--version="false" --work_dir="/tmp/Endpoint_SlaveEndpointTest_AuthorizedRequest_2_CJxEeF"
I0611 19:06:32.072448  4601 credentials.hpp:86] Loading credential for authentication from
'/tmp/Endpoint_SlaveEndpointTest_AuthorizedRequest_2_Rudb3k/credential'
I0611 19:06:32.072836  4601 slave.cpp:281] Agent using credential for: test-principal
I0611 19:06:32.072871  4601 credentials.hpp:37] Loading credentials for authentication from
'/tmp/Endpoint_SlaveEndpointTest_AuthorizedRequest_2_Rudb3k/http_credentials'
I0611 19:06:32.073359  4601 http.cpp:975] Creating default 'basic' HTTP authenticator for
realm 'mesos-agent-readonly'
I0611 19:06:32.073734  4601 http.cpp:975] Creating default 'basic' HTTP authenticator for
realm 'mesos-agent-readwrite'
I0611 19:06:32.075956  4601 slave.cpp:552] Agent resources: cpus(*):2; mem(*):1024; disk(*):1024;
ports(*):[31000-32000]
I0611 19:06:32.076107  4601 slave.cpp:560] Agent attributes: [  ]
I0611 19:06:32.076130  4601 slave.cpp:565] Agent hostname: c247261e5268
I0611 19:06:32.076383  4604 status_update_manager.cpp:177] Pausing sending status updates
I0611 19:06:32.078505  4602 state.cpp:62] Recovering state from '/tmp/Endpoint_SlaveEndpointTest_AuthorizedRequest_2_CJxEeF/meta'
I0611 19:06:32.079133  4603 status_update_manager.cpp:203] Recovering status update manager
I0611 19:06:32.079394  4600 containerizer.cpp:582] Recovering containerizer
I0611 19:06:32.081702  4606 provisioner.cpp:416] Provisioner recovery complete
I0611 19:06:32.082399  4604 slave.cpp:6127] Finished recovery
I0611 19:06:32.083346  4604 slave.cpp:6309] Querying resource estimator for oversubscribable
resources
I0611 19:06:32.083699  4604 slave.cpp:6323] Received oversubscribable resources {} from the
resource estimator
I0611 19:06:32.087644  4606 process.cpp:3778] Handling HTTP event for process 'slave(756)'
with path: '/slave(756)/containers'
I0611 19:06:32.089707  4606 http.cpp:1115] HTTP GET for /slave(756)/containers from 172.17.0.2:54192
I0611 19:06:32.090024  4606 http.cpp:936] Authorizing principal 'test-principal' to GET the
'/containers' endpoint
I0611 19:06:32.097405  4600 slave.cpp:817] Agent terminating
[       OK ] Endpoint/SlaveEndpointTest.AuthorizedRequest/2 (47 ms)
[ RUN      ] Endpoint/SlaveEndpointTest.UnauthorizedRequest/0
I0611 19:06:32.112227  4581 containerizer.cpp:230] Using isolation: posix/cpu,posix/mem,filesystem/posix,network/cni,environment_secret
W0611 19:06:32.112992  4581 backend.cpp:76] Failed to create 'overlay' backend: OverlayBackend
requires root privileges
W0611 19:06:32.113157  4581 backend.cpp:76] Failed to create 'bind' backend: BindBackend requires
root privileges
I0611 19:06:32.113198  4581 provisioner.cpp:255] Using default backend 'copy'
I0611 19:06:32.119441  4602 slave.cpp:248] Mesos agent started on (757)@172.17.0.2:41667
I0611 19:06:32.119484  4602 slave.cpp:249] Flags at startup: --acls="" --appc_simple_discovery_uri_prefix="http://"
--appc_store_dir="/tmp/Endpoint_SlaveEndpointTest_UnauthorizedRequest_0_NGzOJ2/store/appc"
--authenticate_http_readonly="true" --authenticate_http_readwrite="true" --authenticatee="crammd5"
--authentication_backoff_factor="1secs" --authorizer="local" --cgroups_cpu_enable_pids_and_tids_count="false"
--cgroups_enable_cfs="false" --cgroups_hierarchy="/sys/fs/cgroup" --cgroups_limit_swap="false"
--cgroups_root="mesos" --container_disk_watch_interval="15secs" --containerizers="mesos" --credential="/tmp/Endpoint_SlaveEndpointTest_UnauthorizedRequest_0_NGzOJ2/credential"
--default_role="*" --disk_watch_interval="1mins" --docker="docker" --docker_kill_orphans="true"
--docker_registry="https://registry-1.docker.io" --docker_remove_delay="6hrs" --docker_socket="/var/run/docker.sock"
--docker_stop_timeout="0ns" --docker_store_dir="/tmp/Endpoint_SlaveEndpointTest_UnauthorizedRequest_0_NGzOJ2/store/docker"
--docker_volume_checkpoint_dir="/var/run/mesos/isolators/docker/volume" --enforce_container_disk_quota="false"
--executor_registration_timeout="1mins" --executor_reregistration_timeout="2secs" --executor_shutdown_grace_period="5secs"
--fetcher_cache_dir="/tmp/Endpoint_SlaveEndpointTest_UnauthorizedRequest_0_NGzOJ2/fetch" --fetcher_cache_size="2GB"
--frameworks_home="" --gc_delay="1weeks" --gc_disk_headroom="0.1" --hadoop_home="" --help="false"
--hostname_lookup="true" --http_command_executor="false" --http_credentials="/tmp/Endpoint_SlaveEndpointTest_UnauthorizedRequest_0_NGzOJ2/http_credentials"
--http_heartbeat_interval="30secs" --initialize_driver_logging="true" --isolation="posix/cpu,posix/mem"
--launcher="posix" --launcher_dir="/mesos/mesos-1.4.0/_build/src" --logbufsecs="0" --logging_level="INFO"
--max_completed_executors_per_framework="150" --oversubscribed_resources_interval="15secs"
--perf_duration="10secs" --perf_interval="1mins" --port="5051" --qos_correction_interval_min="0ns"
--quiet="false" --recover="reconnect" --recovery_timeout="15mins" --registration_backoff_factor="10ms"
--resources="cpus:2;gpus:0;mem:1024;disk:1024;ports:[31000-32000]" --revocable_cpu_low_priority="true"
--runtime_dir="/tmp/Endpoint_SlaveEndpointTest_UnauthorizedRequest_0_NGzOJ2" --sandbox_directory="/mnt/mesos/sandbox"
--strict="true" --switch_user="true" --systemd_enable_support="true" --systemd_runtime_directory="/run/systemd/system"
--version="false" --work_dir="/tmp/Endpoint_SlaveEndpointTest_UnauthorizedRequest_0_8FWvNm"
I0611 19:06:32.120147  4602 credentials.hpp:86] Loading credential for authentication from
'/tmp/Endpoint_SlaveEndpointTest_UnauthorizedRequest_0_NGzOJ2/credential'
I0611 19:06:32.120388  4602 slave.cpp:281] Agent using credential for: test-principal
I0611 19:06:32.120411  4602 credentials.hpp:37] Loading credentials for authentication from
'/tmp/Endpoint_SlaveEndpointTest_UnauthorizedRequest_0_NGzOJ2/http_credentials'
I0611 19:06:32.120761  4602 http.cpp:975] Creating default 'basic' HTTP authenticator for
realm 'mesos-agent-readonly'
I0611 19:06:32.120967  4602 http.cpp:975] Creating default 'basic' HTTP authenticator for
realm 'mesos-agent-readwrite'
I0611 19:06:32.122946  4602 slave.cpp:552] Agent resources: cpus(*):2; mem(*):1024; disk(*):1024;
ports(*):[31000-32000]
I0611 19:06:32.123083  4602 slave.cpp:560] Agent attributes: [  ]
I0611 19:06:32.123102  4602 slave.cpp:565] Agent hostname: c247261e5268
I0611 19:06:32.125587  4602 status_update_manager.cpp:177] Pausing sending status updates
I0611 19:06:32.126518  4602 state.cpp:62] Recovering state from '/tmp/Endpoint_SlaveEndpointTest_UnauthorizedRequest_0_8FWvNm/meta'
I0611 19:06:32.127130  4602 status_update_manager.cpp:203] Recovering status update manager
I0611 19:06:32.127339  4602 containerizer.cpp:582] Recovering containerizer
I0611 19:06:32.130190  4602 provisioner.cpp:416] Provisioner recovery complete
I0611 19:06:32.131034  4602 slave.cpp:6127] Finished recovery
I0611 19:06:32.131616  4602 slave.cpp:6309] Querying resource estimator for oversubscribable
resources
I0611 19:06:32.132477  4602 slave.cpp:6323] Received oversubscribable resources {} from the
resource estimator
I0611 19:06:32.136677  4606 process.cpp:3778] Handling HTTP event for process 'slave(757)'
with path: '/slave(757)/monitor/statistics'
I0611 19:06:32.139132  4603 http.cpp:1115] HTTP GET for /slave(757)/monitor/statistics from
172.17.0.2:54194
I0611 19:06:32.139253  4603 http.cpp:936] Authorizing principal 'test-principal' to GET the
'/monitor/statistics' endpoint
I0611 19:06:32.142365  4603 slave.cpp:817] Agent terminating
[       OK ] Endpoint/SlaveEndpointTest.UnauthorizedRequest/0 (45 ms)
[ RUN      ] Endpoint/SlaveEndpointTest.UnauthorizedRequest/1
I0611 19:06:32.158201  4581 containerizer.cpp:230] Using isolation: posix/cpu,posix/mem,filesystem/posix,network/cni,environment_secret
W0611 19:06:32.159001  4581 backend.cpp:76] Failed to create 'overlay' backend: OverlayBackend
requires root privileges
W0611 19:06:32.159163  4581 backend.cpp:76] Failed to create 'bind' backend: BindBackend requires
root privileges
I0611 19:06:32.159207  4581 provisioner.cpp:255] Using default backend 'copy'
I0611 19:06:32.164078  4606 slave.cpp:248] Mesos agent started on (758)@172.17.0.2:41667
I0611 19:06:32.164203  4606 slave.cpp:249] Flags at startup: --acls="" --appc_simple_discovery_uri_prefix="http://"
--appc_store_dir="/tmp/Endpoint_SlaveEndpointTest_UnauthorizedRequest_1_nRexUK/store/appc"
--authenticate_http_readonly="true" --authenticate_http_readwrite="true" --authenticatee="crammd5"
--authentication_backoff_factor="1secs" --authorizer="local" --cgroups_cpu_enable_pids_and_tids_count="false"
--cgroups_enable_cfs="false" --cgroups_hierarchy="/sys/fs/cgroup" --cgroups_limit_swap="false"
--cgroups_root="mesos" --container_disk_watch_interval="15secs" --containerizers="mesos" --credential="/tmp/Endpoint_SlaveEndpointTest_UnauthorizedRequest_1_nRexUK/credential"
--default_role="*" --disk_watch_interval="1mins" --docker="docker" --docker_kill_orphans="true"
--docker_registry="https://registry-1.docker.io" --docker_remove_delay="6hrs" --docker_socket="/var/run/docker.sock"
--docker_stop_timeout="0ns" --docker_store_dir="/tmp/Endpoint_SlaveEndpointTest_UnauthorizedRequest_1_nRexUK/store/docker"
--docker_volume_checkpoint_dir="/var/run/mesos/isolators/docker/volume" --enforce_container_disk_quota="false"
--executor_registration_timeout="1mins" --executor_reregistration_timeout="2secs" --executor_shutdown_grace_period="5secs"
--fetcher_cache_dir="/tmp/Endpoint_SlaveEndpointTest_UnauthorizedRequest_1_nRexUK/fetch" --fetcher_cache_size="2GB"
--frameworks_home="" --gc_delay="1weeks" --gc_disk_headroom="0.1" --hadoop_home="" --help="false"
--hostname_lookup="true" --http_command_executor="false" --http_credentials="/tmp/Endpoint_SlaveEndpointTest_UnauthorizedRequest_1_nRexUK/http_credentials"
--http_heartbeat_interval="30secs" --initialize_driver_logging="true" --isolation="posix/cpu,posix/mem"
--launcher="posix" --launcher_dir="/mesos/mesos-1.4.0/_build/src" --logbufsecs="0" --logging_level="INFO"
--max_completed_executors_per_framework="150" --oversubscribed_resources_interval="15secs"
--perf_duration="10secs" --perf_interval="1mins" --port="5051" --qos_correction_interval_min="0ns"
--quiet="false" --recover="reconnect" --recovery_timeout="15mins" --registration_backoff_factor="10ms"
--resources="cpus:2;gpus:0;mem:1024;disk:1024;ports:[31000-32000]" --revocable_cpu_low_priority="true"
--runtime_dir="/tmp/Endpoint_SlaveEndpointTest_UnauthorizedRequest_1_nRexUK" --sandbox_directory="/mnt/mesos/sandbox"
--strict="true" --switch_user="true" --systemd_enable_support="true" --systemd_runtime_directory="/run/systemd/system"
--version="false" --work_dir="/tmp/Endpoint_SlaveEndpointTest_UnauthorizedRequest_1_UaPOQ4"
I0611 19:06:32.165114  4606 credentials.hpp:86] Loading credential for authentication from
'/tmp/Endpoint_SlaveEndpointTest_UnauthorizedRequest_1_nRexUK/credential'
I0611 19:06:32.165598  4606 slave.cpp:281] Agent using credential for: test-principal
I0611 19:06:32.165657  4606 credentials.hpp:37] Loading credentials for authentication from
'/tmp/Endpoint_SlaveEndpointTest_UnauthorizedRequest_1_nRexUK/http_credentials'
I0611 19:06:32.166249  4606 http.cpp:975] Creating default 'basic' HTTP authenticator for
realm 'mesos-agent-readonly'
I0611 19:06:32.166618  4606 http.cpp:975] Creating default 'basic' HTTP authenticator for
realm 'mesos-agent-readwrite'
I0611 19:06:32.168750  4606 slave.cpp:552] Agent resources: cpus(*):2; mem(*):1024; disk(*):1024;
ports(*):[31000-32000]
I0611 19:06:32.168936  4606 slave.cpp:560] Agent attributes: [  ]
I0611 19:06:32.169054  4606 slave.cpp:565] Agent hostname: c247261e5268
I0611 19:06:32.169507  4602 status_update_manager.cpp:177] Pausing sending status updates
I0611 19:06:32.171820  4605 state.cpp:62] Recovering state from '/tmp/Endpoint_SlaveEndpointTest_UnauthorizedRequest_1_UaPOQ4/meta'
I0611 19:06:32.173197  4604 status_update_manager.cpp:203] Recovering status update manager
I0611 19:06:32.173605  4607 containerizer.cpp:582] Recovering containerizer
I0611 19:06:32.175755  4607 provisioner.cpp:416] Provisioner recovery complete
I0611 19:06:32.176503  4607 slave.cpp:6127] Finished recovery
I0611 19:06:32.177127  4607 slave.cpp:6309] Querying resource estimator for oversubscribable
resources
I0611 19:06:32.177578  4606 slave.cpp:6323] Received oversubscribable resources {} from the
resource estimator
I0611 19:06:32.181905  4603 process.cpp:3778] Handling HTTP event for process 'slave(758)'
with path: '/slave(758)/monitor/statistics.json'
I0611 19:06:32.184258  4603 http.cpp:1115] HTTP GET for /slave(758)/monitor/statistics.json
from 172.17.0.2:54196
I0611 19:06:32.184378  4603 http.cpp:936] Authorizing principal 'test-principal' to GET the
'/monitor/statistics.json' endpoint
I0611 19:06:32.187752  4581 slave.cpp:817] Agent terminating
[       OK ] Endpoint/SlaveEndpointTest.UnauthorizedRequest/1 (44 ms)
[ RUN      ] Endpoint/SlaveEndpointTest.UnauthorizedRequest/2
I0611 19:06:32.202083  4581 containerizer.cpp:230] Using isolation: posix/cpu,posix/mem,filesystem/posix,network/cni,environment_secret
W0611 19:06:32.202847  4581 backend.cpp:76] Failed to create 'overlay' backend: OverlayBackend
requires root privileges
W0611 19:06:32.203007  4581 backend.cpp:76] Failed to create 'bind' backend: BindBackend requires
root privileges
I0611 19:06:32.203052  4581 provisioner.cpp:255] Using default backend 'copy'
I0611 19:06:32.208118  4601 slave.cpp:248] Mesos agent started on (759)@172.17.0.2:41667
I0611 19:06:32.208160  4601 slave.cpp:249] Flags at startup: --acls="" --appc_simple_discovery_uri_prefix="http://"
--appc_store_dir="/tmp/Endpoint_SlaveEndpointTest_UnauthorizedRequest_2_fbAZxt/store/appc"
--authenticate_http_readonly="true" --authenticate_http_readwrite="true" --authenticatee="crammd5"
--authentication_backoff_factor="1secs" --authorizer="local" --cgroups_cpu_enable_pids_and_tids_count="false"
--cgroups_enable_cfs="false" --cgroups_hierarchy="/sys/fs/cgroup" --cgroups_limit_swap="false"
--cgroups_root="mesos" --container_disk_watch_interval="15secs" --containerizers="mesos" --credential="/tmp/Endpoint_SlaveEndpointTest_UnauthorizedRequest_2_fbAZxt/credential"
--default_role="*" --disk_watch_interval="1mins" --docker="docker" --docker_kill_orphans="true"
--docker_registry="https://registry-1.docker.io" --docker_remove_delay="6hrs" --docker_socket="/var/run/docker.sock"
--docker_stop_timeout="0ns" --docker_store_dir="/tmp/Endpoint_SlaveEndpointTest_UnauthorizedRequest_2_fbAZxt/store/docker"
--docker_volume_checkpoint_dir="/var/run/mesos/isolators/docker/volume" --enforce_container_disk_quota="false"
--executor_registration_timeout="1mins" --executor_reregistration_timeout="2secs" --executor_shutdown_grace_period="5secs"
--fetcher_cache_dir="/tmp/Endpoint_SlaveEndpointTest_UnauthorizedRequest_2_fbAZxt/fetch" --fetcher_cache_size="2GB"
--frameworks_home="" --gc_delay="1weeks" --gc_disk_headroom="0.1" --hadoop_home="" --help="false"
--hostname_lookup="true" --http_command_executor="false" --http_credentials="/tmp/Endpoint_SlaveEndpointTest_UnauthorizedRequest_2_fbAZxt/http_credentials"
--http_heartbeat_interval="30secs" --initialize_driver_logging="true" --isolation="posix/cpu,posix/mem"
--launcher="posix" --launcher_dir="/mesos/mesos-1.4.0/_build/src" --logbufsecs="0" --logging_level="INFO"
--max_completed_executors_per_framework="150" --oversubscribed_resources_interval="15secs"
--perf_duration="10secs" --perf_interval="1mins" --port="5051" --qos_correction_interval_min="0ns"
--quiet="false" --recover="reconnect" --recovery_timeout="15mins" --registration_backoff_factor="10ms"
--resources="cpus:2;gpus:0;mem:1024;disk:1024;ports:[31000-32000]" --revocable_cpu_low_priority="true"
--runtime_dir="/tmp/Endpoint_SlaveEndpointTest_UnauthorizedRequest_2_fbAZxt" --sandbox_directory="/mnt/mesos/sandbox"
--strict="true" --switch_user="true" --systemd_enable_support="true" --systemd_runtime_directory="/run/systemd/system"
--version="false" --work_dir="/tmp/Endpoint_SlaveEndpointTest_UnauthorizedRequest_2_S3e9mN"
I0611 19:06:32.209152  4601 credentials.hpp:86] Loading credential for authentication from
'/tmp/Endpoint_SlaveEndpointTest_UnauthorizedRequest_2_fbAZxt/credential'
I0611 19:06:32.209595  4601 slave.cpp:281] Agent using credential for: test-principal
I0611 19:06:32.209636  4601 credentials.hpp:37] Loading credentials for authentication from
'/tmp/Endpoint_SlaveEndpointTest_UnauthorizedRequest_2_fbAZxt/http_credentials'
I0611 19:06:32.210150  4601 http.cpp:975] Creating default 'basic' HTTP authenticator for
realm 'mesos-agent-readonly'
I0611 19:06:32.210577  4601 http.cpp:975] Creating default 'basic' HTTP authenticator for
realm 'mesos-agent-readwrite'
I0611 19:06:32.213152  4601 slave.cpp:552] Agent resources: cpus(*):2; mem(*):1024; disk(*):1024;
ports(*):[31000-32000]
I0611 19:06:32.213304  4601 slave.cpp:560] Agent attributes: [  ]
I0611 19:06:32.213327  4601 slave.cpp:565] Agent hostname: c247261e5268
I0611 19:06:32.213609  4603 status_update_manager.cpp:177] Pausing sending status updates
I0611 19:06:32.216065  4607 state.cpp:62] Recovering state from '/tmp/Endpoint_SlaveEndpointTest_UnauthorizedRequest_2_S3e9mN/meta'
I0611 19:06:32.216815  4607 status_update_manager.cpp:203] Recovering status update manager
I0611 19:06:32.217033  4607 containerizer.cpp:582] Recovering containerizer
I0611 19:06:32.219764  4607 provisioner.cpp:416] Provisioner recovery complete
I0611 19:06:32.220521  4607 slave.cpp:6127] Finished recovery
I0611 19:06:32.221089  4607 slave.cpp:6309] Querying resource estimator for oversubscribable
resources
I0611 19:06:32.221941  4607 slave.cpp:6323] Received oversubscribable resources {} from the
resource estimator
I0611 19:06:32.226199  4602 process.cpp:3778] Handling HTTP event for process 'slave(759)'
with path: '/slave(759)/containers'
I0611 19:06:32.228195  4602 http.cpp:1115] HTTP GET for /slave(759)/containers from 172.17.0.2:54198
I0611 19:06:32.228317  4602 http.cpp:936] Authorizing principal 'test-principal' to GET the
'/containers' endpoint
I0611 19:06:32.232208  4600 slave.cpp:817] Agent terminating
[       OK ] Endpoint/SlaveEndpointTest.UnauthorizedRequest/2 (45 ms)
[ RUN      ] Endpoint/SlaveEndpointTest.NoAuthorizer/0
I0611 19:06:32.247654  4581 containerizer.cpp:230] Using isolation: posix/cpu,posix/mem,filesystem/posix,network/cni,environment_secret
W0611 19:06:32.248414  4581 backend.cpp:76] Failed to create 'overlay' backend: OverlayBackend
requires root privileges
W0611 19:06:32.248575  4581 backend.cpp:76] Failed to create 'bind' backend: BindBackend requires
root privileges
I0611 19:06:32.248617  4581 provisioner.cpp:255] Using default backend 'copy'
I0611 19:06:32.250958  4581 cluster.cpp:448] Creating default 'local' authorizer
I0611 19:06:32.255170  4600 slave.cpp:248] Mesos agent started on (760)@172.17.0.2:41667
I0611 19:06:32.255213  4600 slave.cpp:249] Flags at startup: --acls="" --appc_simple_discovery_uri_prefix="http://"
--appc_store_dir="/tmp/Endpoint_SlaveEndpointTest_NoAuthorizer_0_PlNqEc/store/appc" --authenticate_http_readonly="true"
--authenticate_http_readwrite="true" --authenticatee="crammd5" --authentication_backoff_factor="1secs"
--authorizer="local" --cgroups_cpu_enable_pids_and_tids_count="false" --cgroups_enable_cfs="false"
--cgroups_hierarchy="/sys/fs/cgroup" --cgroups_limit_swap="false" --cgroups_root="mesos" --container_disk_watch_interval="15secs"
--containerizers="mesos" --credential="/tmp/Endpoint_SlaveEndpointTest_NoAuthorizer_0_PlNqEc/credential"
--default_role="*" --disk_watch_interval="1mins" --docker="docker" --docker_kill_orphans="true"
--docker_registry="https://registry-1.docker.io" --docker_remove_delay="6hrs" --docker_socket="/var/run/docker.sock"
--docker_stop_timeout="0ns" --docker_store_dir="/tmp/Endpoint_SlaveEndpointTest_NoAuthorizer_0_PlNqEc/store/docker"
--docker_volume_checkpoint_dir="/var/run/mesos/isolators/docker/volume" --enforce_container_disk_quota="false"
--executor_registration_timeout="1mins" --executor_reregistration_timeout="2secs" --executor_shutdown_grace_period="5secs"
--fetcher_cache_dir="/tmp/Endpoint_SlaveEndpointTest_NoAuthorizer_0_PlNqEc/fetch" --fetcher_cache_size="2GB"
--frameworks_home="" --gc_delay="1weeks" --gc_disk_headroom="0.1" --hadoop_home="" --help="false"
--hostname_lookup="true" --http_command_executor="false" --http_credentials="/tmp/Endpoint_SlaveEndpointTest_NoAuthorizer_0_PlNqEc/http_credentials"
--http_heartbeat_interval="30secs" --initialize_driver_logging="true" --isolation="posix/cpu,posix/mem"
--launcher="posix" --launcher_dir="/mesos/mesos-1.4.0/_build/src" --logbufsecs="0" --logging_level="INFO"
--max_completed_executors_per_framework="150" --oversubscribed_resources_interval="15secs"
--perf_duration="10secs" --perf_interval="1mins" --port="5051" --qos_correction_interval_min="0ns"
--quiet="false" --recover="reconnect" --recovery_timeout="15mins" --registration_backoff_factor="10ms"
--resources="cpus:2;gpus:0;mem:1024;disk:1024;ports:[31000-32000]" --revocable_cpu_low_priority="true"
--runtime_dir="/tmp/Endpoint_SlaveEndpointTest_NoAuthorizer_0_PlNqEc" --sandbox_directory="/mnt/mesos/sandbox"
--strict="true" --switch_user="true" --systemd_enable_support="true" --systemd_runtime_directory="/run/systemd/system"
--version="false" --work_dir="/tmp/Endpoint_SlaveEndpointTest_NoAuthorizer_0_Kjqjmw"
I0611 19:06:32.256350  4600 credentials.hpp:86] Loading credential for authentication from
'/tmp/Endpoint_SlaveEndpointTest_NoAuthorizer_0_PlNqEc/credential'
I0611 19:06:32.256608  4600 slave.cpp:281] Agent using credential for: test-principal
I0611 19:06:32.256638  4600 credentials.hpp:37] Loading credentials for authentication from
'/tmp/Endpoint_SlaveEndpointTest_NoAuthorizer_0_PlNqEc/http_credentials'
I0611 19:06:32.257227  4600 http.cpp:975] Creating default 'basic' HTTP authenticator for
realm 'mesos-agent-readonly'
I0611 19:06:32.257612  4600 http.cpp:975] Creating default 'basic' HTTP authenticator for
realm 'mesos-agent-readwrite'
I0611 19:06:32.260164  4600 slave.cpp:552] Agent resources: cpus(*):2; mem(*):1024; disk(*):1024;
ports(*):[31000-32000]
I0611 19:06:32.260305  4600 slave.cpp:560] Agent attributes: [  ]
I0611 19:06:32.260327  4600 slave.cpp:565] Agent hostname: c247261e5268
I0611 19:06:32.260582  4607 status_update_manager.cpp:177] Pausing sending status updates
I0611 19:06:32.263433  4606 state.cpp:62] Recovering state from '/tmp/Endpoint_SlaveEndpointTest_NoAuthorizer_0_Kjqjmw/meta'
I0611 19:06:32.263901  4604 status_update_manager.cpp:203] Recovering status update manager
I0611 19:06:32.264328  4604 containerizer.cpp:582] Recovering containerizer
I0611 19:06:32.266590  4604 provisioner.cpp:416] Provisioner recovery complete
I0611 19:06:32.267355  4601 slave.cpp:6127] Finished recovery
I0611 19:06:32.268180  4601 slave.cpp:6309] Querying resource estimator for oversubscribable
resources
I0611 19:06:32.268646  4607 slave.cpp:6323] Received oversubscribable resources {} from the
resource estimator
I0611 19:06:32.272745  4605 process.cpp:3778] Handling HTTP event for process 'slave(760)'
with path: '/slave(760)/monitor/statistics'
I0611 19:06:32.274947  4603 http.cpp:1115] HTTP GET for /slave(760)/monitor/statistics from
172.17.0.2:54200
I0611 19:06:32.275063  4603 http.cpp:936] Authorizing principal 'test-principal' to GET the
'/monitor/statistics' endpoint
I0611 19:06:32.280622  4602 slave.cpp:817] Agent terminating
[       OK ] Endpoint/SlaveEndpointTest.NoAuthorizer/0 (48 ms)
[ RUN      ] Endpoint/SlaveEndpointTest.NoAuthorizer/1
I0611 19:06:32.295564  4581 containerizer.cpp:230] Using isolation: posix/cpu,posix/mem,filesystem/posix,network/cni,environment_secret
W0611 19:06:32.296330  4581 backend.cpp:76] Failed to create 'overlay' backend: OverlayBackend
requires root privileges
W0611 19:06:32.296489  4581 backend.cpp:76] Failed to create 'bind' backend: BindBackend requires
root privileges
I0611 19:06:32.296531  4581 provisioner.cpp:255] Using default backend 'copy'
I0611 19:06:32.298869  4581 cluster.cpp:448] Creating default 'local' authorizer
I0611 19:06:32.301388  4607 slave.cpp:248] Mesos agent started on (761)@172.17.0.2:41667
I0611 19:06:32.301427  4607 slave.cpp:249] Flags at startup: --acls="" --appc_simple_discovery_uri_prefix="http://"
--appc_store_dir="/tmp/Endpoint_SlaveEndpointTest_NoAuthorizer_1_dkFPfW/store/appc" --authenticate_http_readonly="true"
--authenticate_http_readwrite="true" --authenticatee="crammd5" --authentication_backoff_factor="1secs"
--authorizer="local" --cgroups_cpu_enable_pids_and_tids_count="false" --cgroups_enable_cfs="false"
--cgroups_hierarchy="/sys/fs/cgroup" --cgroups_limit_swap="false" --cgroups_root="mesos" --container_disk_watch_interval="15secs"
--containerizers="mesos" --credential="/tmp/Endpoint_SlaveEndpointTest_NoAuthorizer_1_dkFPfW/credential"
--default_role="*" --disk_watch_interval="1mins" --docker="docker" --docker_kill_orphans="true"
--docker_registry="https://registry-1.docker.io" --docker_remove_delay="6hrs" --docker_socket="/var/run/docker.sock"
--docker_stop_timeout="0ns" --docker_store_dir="/tmp/Endpoint_SlaveEndpointTest_NoAuthorizer_1_dkFPfW/store/docker"
--docker_volume_checkpoint_dir="/var/run/mesos/isolators/docker/volume" --enforce_container_disk_quota="false"
--executor_registration_timeout="1mins" --executor_reregistration_timeout="2secs" --executor_shutdown_grace_period="5secs"
--fetcher_cache_dir="/tmp/Endpoint_SlaveEndpointTest_NoAuthorizer_1_dkFPfW/fetch" --fetcher_cache_size="2GB"
--frameworks_home="" --gc_delay="1weeks" --gc_disk_headroom="0.1" --hadoop_home="" --help="false"
--hostname_lookup="true" --http_command_executor="false" --http_credentials="/tmp/Endpoint_SlaveEndpointTest_NoAuthorizer_1_dkFPfW/http_credentials"
--http_heartbeat_interval="30secs" --initialize_driver_logging="true" --isolation="posix/cpu,posix/mem"
--launcher="posix" --launcher_dir="/mesos/mesos-1.4.0/_build/src" --logbufsecs="0" --logging_level="INFO"
--max_completed_executors_per_framework="150" --oversubscribed_resources_interval="15secs"
--perf_duration="10secs" --perf_interval="1mins" --port="5051" --qos_correction_interval_min="0ns"
--quiet="false" --recover="reconnect" --recovery_timeout="15mins" --registration_backoff_factor="10ms"
--resources="cpus:2;gpus:0;mem:1024;disk:1024;ports:[31000-32000]" --revocable_cpu_low_priority="true"
--runtime_dir="/tmp/Endpoint_SlaveEndpointTest_NoAuthorizer_1_dkFPfW" --sandbox_directory="/mnt/mesos/sandbox"
--strict="true" --switch_user="true" --systemd_enable_support="true" --systemd_runtime_directory="/run/systemd/system"
--version="false" --work_dir="/tmp/Endpoint_SlaveEndpointTest_NoAuthorizer_1_eHjVPf"
I0611 19:06:32.302204  4607 credentials.hpp:86] Loading credential for authentication from
'/tmp/Endpoint_SlaveEndpointTest_NoAuthorizer_1_dkFPfW/credential'
I0611 19:06:32.302462  4607 slave.cpp:281] Agent using credential for: test-principal
I0611 19:06:32.302486  4607 credentials.hpp:37] Loading credentials for authentication from
'/tmp/Endpoint_SlaveEndpointTest_NoAuthorizer_1_dkFPfW/http_credentials'
I0611 19:06:32.302830  4607 http.cpp:975] Creating default 'basic' HTTP authenticator for
realm 'mesos-agent-readonly'
I0611 19:06:32.303020  4607 http.cpp:975] Creating default 'basic' HTTP authenticator for
realm 'mesos-agent-readwrite'
I0611 19:06:32.304996  4607 slave.cpp:552] Agent resources: cpus(*):2; mem(*):1024; disk(*):1024;
ports(*):[31000-32000]
I0611 19:06:32.305135  4607 slave.cpp:560] Agent attributes: [  ]
I0611 19:06:32.305157  4607 slave.cpp:565] Agent hostname: c247261e5268
I0611 19:06:32.305361  4606 status_update_manager.cpp:177] Pausing sending status updates
I0611 19:06:32.307404  4604 state.cpp:62] Recovering state from '/tmp/Endpoint_SlaveEndpointTest_NoAuthorizer_1_eHjVPf/meta'
I0611 19:06:32.308023  4600 status_update_manager.cpp:203] Recovering status update manager
I0611 19:06:32.308326  4604 containerizer.cpp:582] Recovering containerizer
I0611 19:06:32.310449  4604 provisioner.cpp:416] Provisioner recovery complete
I0611 19:06:32.311197  4603 slave.cpp:6127] Finished recovery
I0611 19:06:32.311908  4603 slave.cpp:6309] Querying resource estimator for oversubscribable
resources
I0611 19:06:32.312425  4603 slave.cpp:6323] Received oversubscribable resources {} from the
resource estimator
I0611 19:06:32.316748  4606 process.cpp:3778] Handling HTTP event for process 'slave(761)'
with path: '/slave(761)/monitor/statistics.json'
I0611 19:06:32.318832  4603 http.cpp:1115] HTTP GET for /slave(761)/monitor/statistics.json
from 172.17.0.2:54202
I0611 19:06:32.318954  4603 http.cpp:936] Authorizing principal 'test-principal' to GET the
'/monitor/statistics.json' endpoint
I0611 19:06:32.323698  4607 slave.cpp:817] Agent terminating
[       OK ] Endpoint/SlaveEndpointTest.NoAuthorizer/1 (43 ms)
[ RUN      ] Endpoint/SlaveEndpointTest.NoAuthorizer/2
I0611 19:06:32.338966  4581 containerizer.cpp:230] Using isolation: posix/cpu,posix/mem,filesystem/posix,network/cni,environment_secret
W0611 19:06:32.339730  4581 backend.cpp:76] Failed to create 'overlay' backend: OverlayBackend
requires root privileges
W0611 19:06:32.339892  4581 backend.cpp:76] Failed to create 'bind' backend: BindBackend requires
root privileges
I0611 19:06:32.339934  4581 provisioner.cpp:255] Using default backend 'copy'
I0611 19:06:32.342388  4581 cluster.cpp:448] Creating default 'local' authorizer
I0611 19:06:32.345002  4605 slave.cpp:248] Mesos agent started on (762)@172.17.0.2:41667
I0611 19:06:32.345047  4605 slave.cpp:249] Flags at startup: --acls="" --appc_simple_discovery_uri_prefix="http://"
--appc_store_dir="/tmp/Endpoint_SlaveEndpointTest_NoAuthorizer_2_D55mjG/store/appc" --authenticate_http_readonly="true"
--authenticate_http_readwrite="true" --authenticatee="crammd5" --authentication_backoff_factor="1secs"
--authorizer="local" --cgroups_cpu_enable_pids_and_tids_count="false" --cgroups_enable_cfs="false"
--cgroups_hierarchy="/sys/fs/cgroup" --cgroups_limit_swap="false" --cgroups_root="mesos" --container_disk_watch_interval="15secs"
--containerizers="mesos" --credential="/tmp/Endpoint_SlaveEndpointTest_NoAuthorizer_2_D55mjG/credential"
--default_role="*" --disk_watch_interval="1mins" --docker="docker" --docker_kill_orphans="true"
--docker_registry="https://registry-1.docker.io" --docker_remove_delay="6hrs" --docker_socket="/var/run/docker.sock"
--docker_stop_timeout="0ns" --docker_store_dir="/tmp/Endpoint_SlaveEndpointTest_NoAuthorizer_2_D55mjG/store/docker"
--docker_volume_checkpoint_dir="/var/run/mesos/isolators/docker/volume" --enforce_container_disk_quota="false"
--executor_registration_timeout="1mins" --executor_reregistration_timeout="2secs" --executor_shutdown_grace_period="5secs"
--fetcher_cache_dir="/tmp/Endpoint_SlaveEndpointTest_NoAuthorizer_2_D55mjG/fetch" --fetcher_cache_size="2GB"
--frameworks_home="" --gc_delay="1weeks" --gc_disk_headroom="0.1" --hadoop_home="" --help="false"
--hostname_lookup="true" --http_command_executor="false" --http_credentials="/tmp/Endpoint_SlaveEndpointTest_NoAuthorizer_2_D55mjG/http_credentials"
--http_heartbeat_interval="30secs" --initialize_driver_logging="true" --isolation="posix/cpu,posix/mem"
--launcher="posix" --launcher_dir="/mesos/mesos-1.4.0/_build/src" --logbufsecs="0" --logging_level="INFO"
--max_completed_executors_per_framework="150" --oversubscribed_resources_interval="15secs"
--perf_duration="10secs" --perf_interval="1mins" --port="5051" --qos_correction_interval_min="0ns"
--quiet="false" --recover="reconnect" --recovery_timeout="15mins" --registration_backoff_factor="10ms"
--resources="cpus:2;gpus:0;mem:1024;disk:1024;ports:[31000-32000]" --revocable_cpu_low_priority="true"
--runtime_dir="/tmp/Endpoint_SlaveEndpointTest_NoAuthorizer_2_D55mjG" --sandbox_directory="/mnt/mesos/sandbox"
--strict="true" --switch_user="true" --systemd_enable_support="true" --systemd_runtime_directory="/run/systemd/system"
--version="false" --work_dir="/tmp/Endpoint_SlaveEndpointTest_NoAuthorizer_2_Gv1rMZ"
I0611 19:06:32.345834  4605 credentials.hpp:86] Loading credential for authentication from
'/tmp/Endpoint_SlaveEndpointTest_NoAuthorizer_2_D55mjG/credential'
I0611 19:06:32.346189  4605 slave.cpp:281] Agent using credential for: test-principal
I0611 19:06:32.346216  4605 credentials.hpp:37] Loading credentials for authentication from
'/tmp/Endpoint_SlaveEndpointTest_NoAuthorizer_2_D55mjG/http_credentials'
I0611 19:06:32.346650  4605 http.cpp:975] Creating default 'basic' HTTP authenticator for
realm 'mesos-agent-readonly'
I0611 19:06:32.346972  4605 http.cpp:975] Creating default 'basic' HTTP authenticator for
realm 'mesos-agent-readwrite'
I0611 19:06:32.349197  4605 slave.cpp:552] Agent resources: cpus(*):2; mem(*):1024; disk(*):1024;
ports(*):[31000-32000]
I0611 19:06:32.349339  4605 slave.cpp:560] Agent attributes: [  ]
I0611 19:06:32.349359  4605 slave.cpp:565] Agent hostname: c247261e5268
I0611 19:06:32.349587  4607 status_update_manager.cpp:177] Pausing sending status updates
I0611 19:06:32.351547  4602 state.cpp:62] Recovering state from '/tmp/Endpoint_SlaveEndpointTest_NoAuthorizer_2_Gv1rMZ/meta'
I0611 19:06:32.352077  4606 status_update_manager.cpp:203] Recovering status update manager
I0611 19:06:32.352602  4604 containerizer.cpp:582] Recovering containerizer
I0611 19:06:32.354984  4604 provisioner.cpp:416] Provisioner recovery complete
I0611 19:06:32.355660  4603 slave.cpp:6127] Finished recovery
I0611 19:06:32.356238  4603 slave.cpp:6309] Querying resource estimator for oversubscribable
resources
I0611 19:06:32.356997  4603 slave.cpp:6323] Received oversubscribable resources {} from the
resource estimator
I0611 19:06:32.361548  4607 process.cpp:3778] Handling HTTP event for process 'slave(762)'
with path: '/slave(762)/containers'
I0611 19:06:32.363886  4607 http.cpp:1115] HTTP GET for /slave(762)/containers from 172.17.0.2:54204
I0611 19:06:32.364007  4607 http.cpp:936] Authorizing principal 'test-principal' to GET the
'/containers' endpoint
I0611 19:06:32.370604  4606 slave.cpp:817] Agent terminating
[       OK ] Endpoint/SlaveEndpointTest.NoAuthorizer/2 (47 ms)
[----------] 9 tests from Endpoint/SlaveEndpointTest (413 ms total)

[----------] Global test environment tear-down
[==========] 1589 tests from 176 test cases ran. (725093 ms total)
[  PASSED  ] 1584 tests.
[  FAILED  ] 5 tests, listed below:
[  FAILED  ] DefaultExecutorCheckTest.CommandCheckDeliveredAndReconciled
[  FAILED  ] DefaultExecutorCheckTest.CommandCheckStatusChange
[  FAILED  ] DefaultExecutorCheckTest.CommandCheckSeesParentsEnv
[  FAILED  ] DefaultExecutorCheckTest.CommandCheckSharesWorkDirWithTask
[  FAILED  ] MasterTest.IgnoreOldAgentReregistration

 5 FAILED TESTS
  YOU HAVE 22 DISABLED TESTS

E0611 19:06:32.512692  4608 process.cpp:968] Failed to accept socket: future discarded
make[4]: *** [check-local] Error 1
make[4]: Leaving directory `/mesos/mesos-1.4.0/_build/src'
make[3]: *** [check-am] Error 2
make[3]: Leaving directory `/mesos/mesos-1.4.0/_build/src'
make[2]: *** [check] Error 2
make[2]: Leaving directory `/mesos/mesos-1.4.0/_build/src'
make[1]: *** [check-recursive] Error 1
make[1]: Leaving directory `/mesos/mesos-1.4.0/_build'
make: *** [distcheck] Error 1
+ docker rmi mesos-1497202469-18972
Untagged: mesos-1497202469-18972:latest
Deleted: sha256:d289a2661980ff0825c7d88db457ab8c5e4e05c81832e7890c04d50f03d1be77
Deleted: sha256:ca94be696c950539dd08e7e35ddf9bad8ef7ad9f1b94878272d4445d96681128
Deleted: sha256:9c348a4a21cd52a741df896e754bb1d861a8dcf6ad3fd547103ac0c6251b3451
Deleted: sha256:c7e22103a5a7f9ef8eae25bad15e096a7bff3a8888b67f7eccdb5c1f63640109
Deleted: sha256:320ee2c242b7236610b929284d5344677f8644584192a9f31f9081f2c28b7ba4
Deleted: sha256:8a86c963e46a861dc3d938d3257465b3db74cc8a7f9d83be70921000f28e9802
Deleted: sha256:45390d096ee486ca1a571ac9ca373a132e3814365c5b0e09d7a9ef832ef9acd5
Deleted: sha256:6237ad29b3d163a251c00024b011636e40e07a171ab3e441f49edaaa9afa6567
Deleted: sha256:4f9d3f5f46d2838f93bb7cbec910be56df7a5e90d238164b9530912be4f5af11
Deleted: sha256:186f993765d16397c5df9558041f7bf49530dd71dc706647212dc5fc87efe32e
Deleted: sha256:868331be6c51e4128752bc9ac8c0cd47b7e45bb1ee434b3eb576a19cab360119
Deleted: sha256:dc7824624d683891280f9bef81972cf87802d19070347b9e8f377ffc6caabe04
Deleted: sha256:66a661eb4101abae5cb46336435c24b04717a6becfb42794991db49984bcf60e
Deleted: sha256:d21892c8eb6e0941241ac7274fc0dbc4c9a84921ca358cbdebbaf85d2dcc27b2
Deleted: sha256:ea4a6196ba0df04fb1b2ac531f681f48b54e2e7a2aa59792413e5518fe4b70b1
Deleted: sha256:47602a7f2201e9d14d0db350c3298362f9558c53fa5820c2031ae36621e9b99e
Deleted: sha256:cbb22a9fa17915ea243e76783c8d3e738dc5d51de10230893e432926d728ac4e
Deleted: sha256:7be9ae9fa5e0d17e31d7a4cfe31d8d2cdc1bfd3c131f8930ad5d14d5434a0522
Deleted: sha256:9147362441ab8d22ab66b542ee7f75394e4a4b56a99c92c0fa36bfeab2de94ba
Deleted: sha256:22247a424c86af074b8cd65fdafa671928c69e2bc9dcab461b6bfe3e1bf582ab
Deleted: sha256:88bc9f9a3b86859faf4c2340f734b536be9d9f6a2bb5bfc8c73a183a7d944ac8
Deleted: sha256:e9133ca338ca78f31964a6e25d471634e1dfcb89dc642f756b6bfa6d1323809b
Deleted: sha256:cfa53ffa4925fe86c0d376ff62b547afc580c30fd804456e09e8face0d825d43
Deleted: sha256:f8febe534620db33fcf258261fc1ff330aa1f5c9c98692f999164f98b1c8dea0
Build step 'Execute shell' marked build as failure

Mime
View raw message