mesos-builds mailing list archives

Site index · List index
Message view « Date » · « Thread »
Top « Date » · « Thread »
From Apache Jenkins Server <jenk...@builds.apache.org>
Subject Build failed in Jenkins: Mesos-Reviewbot #18359
Date Tue, 13 Jun 2017 04:23:30 GMT
See <https://builds.apache.org/job/Mesos-Reviewbot/18359/display/redirect>

------------------------------------------
[...truncated 28.16 MB...]
W0613 04:23:23.737438  4579 backend.cpp:76] Failed to create 'bind' backend: BindBackend requires
root privileges
I0613 04:23:23.737588  4579 provisioner.cpp:255] Using default backend 'copy'
I0613 04:23:23.744024  4599 slave.cpp:248] Mesos agent started on (756)@172.17.0.2:46849
I0613 04:23:23.744065  4599 slave.cpp:249] Flags at startup: --acls="" --appc_simple_discovery_uri_prefix="http://"
--appc_store_dir="/tmp/Endpoint_SlaveEndpointTest_AuthorizedRequest_2_Eqjb4t/store/appc" --authenticate_http_readonly="true"
--authenticate_http_readwrite="true" --authenticatee="crammd5" --authentication_backoff_factor="1secs"
--authorizer="local" --cgroups_cpu_enable_pids_and_tids_count="false" --cgroups_enable_cfs="false"
--cgroups_hierarchy="/sys/fs/cgroup" --cgroups_limit_swap="false" --cgroups_root="mesos" --container_disk_watch_interval="15secs"
--containerizers="mesos" --credential="/tmp/Endpoint_SlaveEndpointTest_AuthorizedRequest_2_Eqjb4t/credential"
--default_role="*" --disk_watch_interval="1mins" --docker="docker" --docker_kill_orphans="true"
--docker_registry="https://registry-1.docker.io" --docker_remove_delay="6hrs" --docker_socket="/var/run/docker.sock"
--docker_stop_timeout="0ns" --docker_store_dir="/tmp/Endpoint_SlaveEndpointTest_AuthorizedRequest_2_Eqjb4t/store/docker"
--docker_volume_checkpoint_dir="/var/run/mesos/isolators/docker/volume" --enforce_container_disk_quota="false"
--executor_registration_timeout="1mins" --executor_reregistration_timeout="2secs" --executor_shutdown_grace_period="5secs"
--fetcher_cache_dir="/tmp/Endpoint_SlaveEndpointTest_AuthorizedRequest_2_Eqjb4t/fetch" --fetcher_cache_size="2GB"
--frameworks_home="" --gc_delay="1weeks" --gc_disk_headroom="0.1" --hadoop_home="" --help="false"
--hostname_lookup="true" --http_command_executor="false" --http_credentials="/tmp/Endpoint_SlaveEndpointTest_AuthorizedRequest_2_Eqjb4t/http_credentials"
--http_heartbeat_interval="30secs" --initialize_driver_logging="true" --isolation="posix/cpu,posix/mem"
--launcher="posix" --launcher_dir="/mesos/mesos-1.4.0/_build/src" --logbufsecs="0" --logging_level="INFO"
--max_completed_executors_per_framework="150" --oversubscribed_resources_interval="15secs"
--perf_duration="10secs" --perf_interval="1mins" --port="5051" --qos_correction_interval_min="0ns"
--quiet="false" --recover="reconnect" --recovery_timeout="15mins" --registration_backoff_factor="10ms"
--resources="cpus:2;gpus:0;mem:1024;disk:1024;ports:[31000-32000]" --revocable_cpu_low_priority="true"
--runtime_dir="/tmp/Endpoint_SlaveEndpointTest_AuthorizedRequest_2_Eqjb4t" --sandbox_directory="/mnt/mesos/sandbox"
--strict="true" --switch_user="true" --systemd_enable_support="true" --systemd_runtime_directory="/run/systemd/system"
--version="false" --work_dir="/tmp/Endpoint_SlaveEndpointTest_AuthorizedRequest_2_tcaVU7"
I0613 04:23:23.744731  4599 credentials.hpp:86] Loading credential for authentication from
'/tmp/Endpoint_SlaveEndpointTest_AuthorizedRequest_2_Eqjb4t/credential'
I0613 04:23:23.744978  4599 slave.cpp:281] Agent using credential for: test-principal
I0613 04:23:23.745008  4599 credentials.hpp:37] Loading credentials for authentication from
'/tmp/Endpoint_SlaveEndpointTest_AuthorizedRequest_2_Eqjb4t/http_credentials'
I0613 04:23:23.745344  4599 http.cpp:975] Creating default 'basic' HTTP authenticator for
realm 'mesos-agent-readonly'
I0613 04:23:23.745550  4599 http.cpp:975] Creating default 'basic' HTTP authenticator for
realm 'mesos-agent-readwrite'
I0613 04:23:23.747822  4599 slave.cpp:552] Agent resources: cpus(*):2; mem(*):1024; disk(*):1024;
ports(*):[31000-32000]
I0613 04:23:23.747963  4599 slave.cpp:560] Agent attributes: [  ]
I0613 04:23:23.747984  4599 slave.cpp:565] Agent hostname: 3fa52d99cc72
I0613 04:23:23.748314  4598 status_update_manager.cpp:177] Pausing sending status updates
I0613 04:23:23.750180  4598 state.cpp:62] Recovering state from '/tmp/Endpoint_SlaveEndpointTest_AuthorizedRequest_2_tcaVU7/meta'
I0613 04:23:23.750900  4601 status_update_manager.cpp:203] Recovering status update manager
I0613 04:23:23.751297  4601 containerizer.cpp:582] Recovering containerizer
I0613 04:23:23.753574  4598 provisioner.cpp:416] Provisioner recovery complete
I0613 04:23:23.754590  4598 slave.cpp:6127] Finished recovery
I0613 04:23:23.755295  4598 slave.cpp:6309] Querying resource estimator for oversubscribable
resources
I0613 04:23:23.756289  4598 slave.cpp:6323] Received oversubscribable resources {} from the
resource estimator
I0613 04:23:23.760792  4604 process.cpp:3778] Handling HTTP event for process 'slave(756)'
with path: '/slave(756)/containers'
I0613 04:23:23.762626  4598 http.cpp:1115] HTTP GET for /slave(756)/containers from 172.17.0.2:37020
I0613 04:23:23.762789  4598 http.cpp:936] Authorizing principal 'test-principal' to GET the
'/containers' endpoint
I0613 04:23:23.768960  4602 slave.cpp:817] Agent terminating
[       OK ] Endpoint/SlaveEndpointTest.AuthorizedRequest/2 (47 ms)
[ RUN      ] Endpoint/SlaveEndpointTest.UnauthorizedRequest/0
I0613 04:23:23.783957  4579 containerizer.cpp:230] Using isolation: posix/cpu,posix/mem,filesystem/posix,network/cni,environment_secret
W0613 04:23:23.784854  4579 backend.cpp:76] Failed to create 'overlay' backend: OverlayBackend
requires root privileges
W0613 04:23:23.785126  4579 backend.cpp:76] Failed to create 'bind' backend: BindBackend requires
root privileges
I0613 04:23:23.785200  4579 provisioner.cpp:255] Using default backend 'copy'
I0613 04:23:23.791724  4600 slave.cpp:248] Mesos agent started on (757)@172.17.0.2:46849
I0613 04:23:23.791766  4600 slave.cpp:249] Flags at startup: --acls="" --appc_simple_discovery_uri_prefix="http://"
--appc_store_dir="/tmp/Endpoint_SlaveEndpointTest_UnauthorizedRequest_0_CbND5U/store/appc"
--authenticate_http_readonly="true" --authenticate_http_readwrite="true" --authenticatee="crammd5"
--authentication_backoff_factor="1secs" --authorizer="local" --cgroups_cpu_enable_pids_and_tids_count="false"
--cgroups_enable_cfs="false" --cgroups_hierarchy="/sys/fs/cgroup" --cgroups_limit_swap="false"
--cgroups_root="mesos" --container_disk_watch_interval="15secs" --containerizers="mesos" --credential="/tmp/Endpoint_SlaveEndpointTest_UnauthorizedRequest_0_CbND5U/credential"
--default_role="*" --disk_watch_interval="1mins" --docker="docker" --docker_kill_orphans="true"
--docker_registry="https://registry-1.docker.io" --docker_remove_delay="6hrs" --docker_socket="/var/run/docker.sock"
--docker_stop_timeout="0ns" --docker_store_dir="/tmp/Endpoint_SlaveEndpointTest_UnauthorizedRequest_0_CbND5U/store/docker"
--docker_volume_checkpoint_dir="/var/run/mesos/isolators/docker/volume" --enforce_container_disk_quota="false"
--executor_registration_timeout="1mins" --executor_reregistration_timeout="2secs" --executor_shutdown_grace_period="5secs"
--fetcher_cache_dir="/tmp/Endpoint_SlaveEndpointTest_UnauthorizedRequest_0_CbND5U/fetch" --fetcher_cache_size="2GB"
--frameworks_home="" --gc_delay="1weeks" --gc_disk_headroom="0.1" --hadoop_home="" --help="false"
--hostname_lookup="true" --http_command_executor="false" --http_credentials="/tmp/Endpoint_SlaveEndpointTest_UnauthorizedRequest_0_CbND5U/http_credentials"
--http_heartbeat_interval="30secs" --initialize_driver_logging="true" --isolation="posix/cpu,posix/mem"
--launcher="posix" --launcher_dir="/mesos/mesos-1.4.0/_build/src" --logbufsecs="0" --logging_level="INFO"
--max_completed_executors_per_framework="150" --oversubscribed_resources_interval="15secs"
--perf_duration="10secs" --perf_interval="1mins" --port="5051" --qos_correction_interval_min="0ns"
--quiet="false" --recover="reconnect" --recovery_timeout="15mins" --registration_backoff_factor="10ms"
--resources="cpus:2;gpus:0;mem:1024;disk:1024;ports:[31000-32000]" --revocable_cpu_low_priority="true"
--runtime_dir="/tmp/Endpoint_SlaveEndpointTest_UnauthorizedRequest_0_CbND5U" --sandbox_directory="/mnt/mesos/sandbox"
--strict="true" --switch_user="true" --systemd_enable_support="true" --systemd_runtime_directory="/run/systemd/system"
--version="false" --work_dir="/tmp/Endpoint_SlaveEndpointTest_UnauthorizedRequest_0_N85DOy"
I0613 04:23:23.792601  4600 credentials.hpp:86] Loading credential for authentication from
'/tmp/Endpoint_SlaveEndpointTest_UnauthorizedRequest_0_CbND5U/credential'
I0613 04:23:23.793020  4600 slave.cpp:281] Agent using credential for: test-principal
I0613 04:23:23.793052  4600 credentials.hpp:37] Loading credentials for authentication from
'/tmp/Endpoint_SlaveEndpointTest_UnauthorizedRequest_0_CbND5U/http_credentials'
I0613 04:23:23.793579  4600 http.cpp:975] Creating default 'basic' HTTP authenticator for
realm 'mesos-agent-readonly'
I0613 04:23:23.793936  4600 http.cpp:975] Creating default 'basic' HTTP authenticator for
realm 'mesos-agent-readwrite'
I0613 04:23:23.796015  4600 slave.cpp:552] Agent resources: cpus(*):2; mem(*):1024; disk(*):1024;
ports(*):[31000-32000]
I0613 04:23:23.796156  4600 slave.cpp:560] Agent attributes: [  ]
I0613 04:23:23.796175  4600 slave.cpp:565] Agent hostname: 3fa52d99cc72
I0613 04:23:23.796762  4599 status_update_manager.cpp:177] Pausing sending status updates
I0613 04:23:23.798703  4602 state.cpp:62] Recovering state from '/tmp/Endpoint_SlaveEndpointTest_UnauthorizedRequest_0_N85DOy/meta'
I0613 04:23:23.799466  4605 status_update_manager.cpp:203] Recovering status update manager
I0613 04:23:23.800034  4599 containerizer.cpp:582] Recovering containerizer
I0613 04:23:23.802419  4601 provisioner.cpp:416] Provisioner recovery complete
I0613 04:23:23.803196  4604 slave.cpp:6127] Finished recovery
I0613 04:23:23.803827  4604 slave.cpp:6309] Querying resource estimator for oversubscribable
resources
I0613 04:23:23.804301  4603 slave.cpp:6323] Received oversubscribable resources {} from the
resource estimator
I0613 04:23:23.809396  4598 process.cpp:3778] Handling HTTP event for process 'slave(757)'
with path: '/slave(757)/monitor/statistics'
I0613 04:23:23.811923  4598 http.cpp:1115] HTTP GET for /slave(757)/monitor/statistics from
172.17.0.2:37022
I0613 04:23:23.812150  4598 http.cpp:936] Authorizing principal 'test-principal' to GET the
'/monitor/statistics' endpoint
I0613 04:23:23.817155  4603 slave.cpp:817] Agent terminating
[       OK ] Endpoint/SlaveEndpointTest.UnauthorizedRequest/0 (48 ms)
[ RUN      ] Endpoint/SlaveEndpointTest.UnauthorizedRequest/1
I0613 04:23:23.832439  4579 containerizer.cpp:230] Using isolation: posix/cpu,posix/mem,filesystem/posix,network/cni,environment_secret
W0613 04:23:23.833349  4579 backend.cpp:76] Failed to create 'overlay' backend: OverlayBackend
requires root privileges
W0613 04:23:23.833624  4579 backend.cpp:76] Failed to create 'bind' backend: BindBackend requires
root privileges
I0613 04:23:23.833686  4579 provisioner.cpp:255] Using default backend 'copy'
I0613 04:23:23.840159  4603 slave.cpp:248] Mesos agent started on (758)@172.17.0.2:46849
I0613 04:23:23.840200  4603 slave.cpp:249] Flags at startup: --acls="" --appc_simple_discovery_uri_prefix="http://"
--appc_store_dir="/tmp/Endpoint_SlaveEndpointTest_UnauthorizedRequest_1_IsTwCm/store/appc"
--authenticate_http_readonly="true" --authenticate_http_readwrite="true" --authenticatee="crammd5"
--authentication_backoff_factor="1secs" --authorizer="local" --cgroups_cpu_enable_pids_and_tids_count="false"
--cgroups_enable_cfs="false" --cgroups_hierarchy="/sys/fs/cgroup" --cgroups_limit_swap="false"
--cgroups_root="mesos" --container_disk_watch_interval="15secs" --containerizers="mesos" --credential="/tmp/Endpoint_SlaveEndpointTest_UnauthorizedRequest_1_IsTwCm/credential"
--default_role="*" --disk_watch_interval="1mins" --docker="docker" --docker_kill_orphans="true"
--docker_registry="https://registry-1.docker.io" --docker_remove_delay="6hrs" --docker_socket="/var/run/docker.sock"
--docker_stop_timeout="0ns" --docker_store_dir="/tmp/Endpoint_SlaveEndpointTest_UnauthorizedRequest_1_IsTwCm/store/docker"
--docker_volume_checkpoint_dir="/var/run/mesos/isolators/docker/volume" --enforce_container_disk_quota="false"
--executor_registration_timeout="1mins" --executor_reregistration_timeout="2secs" --executor_shutdown_grace_period="5secs"
--fetcher_cache_dir="/tmp/Endpoint_SlaveEndpointTest_UnauthorizedRequest_1_IsTwCm/fetch" --fetcher_cache_size="2GB"
--frameworks_home="" --gc_delay="1weeks" --gc_disk_headroom="0.1" --hadoop_home="" --help="false"
--hostname_lookup="true" --http_command_executor="false" --http_credentials="/tmp/Endpoint_SlaveEndpointTest_UnauthorizedRequest_1_IsTwCm/http_credentials"
--http_heartbeat_interval="30secs" --initialize_driver_logging="true" --isolation="posix/cpu,posix/mem"
--launcher="posix" --launcher_dir="/mesos/mesos-1.4.0/_build/src" --logbufsecs="0" --logging_level="INFO"
--max_completed_executors_per_framework="150" --oversubscribed_resources_interval="15secs"
--perf_duration="10secs" --perf_interval="1mins" --port="5051" --qos_correction_interval_min="0ns"
--quiet="false" --recover="reconnect" --recovery_timeout="15mins" --registration_backoff_factor="10ms"
--resources="cpus:2;gpus:0;mem:1024;disk:1024;ports:[31000-32000]" --revocable_cpu_low_priority="true"
--runtime_dir="/tmp/Endpoint_SlaveEndpointTest_UnauthorizedRequest_1_IsTwCm" --sandbox_directory="/mnt/mesos/sandbox"
--strict="true" --switch_user="true" --systemd_enable_support="true" --systemd_runtime_directory="/run/systemd/system"
--version="false" --work_dir="/tmp/Endpoint_SlaveEndpointTest_UnauthorizedRequest_1_Jw2Fd0"
I0613 04:23:23.840872  4603 credentials.hpp:86] Loading credential for authentication from
'/tmp/Endpoint_SlaveEndpointTest_UnauthorizedRequest_1_IsTwCm/credential'
I0613 04:23:23.841114  4603 slave.cpp:281] Agent using credential for: test-principal
I0613 04:23:23.841137  4603 credentials.hpp:37] Loading credentials for authentication from
'/tmp/Endpoint_SlaveEndpointTest_UnauthorizedRequest_1_IsTwCm/http_credentials'
I0613 04:23:23.841477  4603 http.cpp:975] Creating default 'basic' HTTP authenticator for
realm 'mesos-agent-readonly'
I0613 04:23:23.841683  4603 http.cpp:975] Creating default 'basic' HTTP authenticator for
realm 'mesos-agent-readwrite'
I0613 04:23:23.843955  4603 slave.cpp:552] Agent resources: cpus(*):2; mem(*):1024; disk(*):1024;
ports(*):[31000-32000]
I0613 04:23:23.844099  4603 slave.cpp:560] Agent attributes: [  ]
I0613 04:23:23.844120  4603 slave.cpp:565] Agent hostname: 3fa52d99cc72
I0613 04:23:23.844419  4601 status_update_manager.cpp:177] Pausing sending status updates
I0613 04:23:23.846175  4598 state.cpp:62] Recovering state from '/tmp/Endpoint_SlaveEndpointTest_UnauthorizedRequest_1_Jw2Fd0/meta'
I0613 04:23:23.846787  4602 status_update_manager.cpp:203] Recovering status update manager
I0613 04:23:23.847329  4602 containerizer.cpp:582] Recovering containerizer
I0613 04:23:23.849781  4599 provisioner.cpp:416] Provisioner recovery complete
I0613 04:23:23.850303  4600 slave.cpp:6127] Finished recovery
I0613 04:23:23.850975  4600 slave.cpp:6309] Querying resource estimator for oversubscribable
resources
I0613 04:23:23.851994  4600 slave.cpp:6323] Received oversubscribable resources {} from the
resource estimator
I0613 04:23:23.857341  4605 process.cpp:3778] Handling HTTP event for process 'slave(758)'
with path: '/slave(758)/monitor/statistics.json'
I0613 04:23:23.860025  4604 http.cpp:1115] HTTP GET for /slave(758)/monitor/statistics.json
from 172.17.0.2:37024
I0613 04:23:23.860144  4604 http.cpp:936] Authorizing principal 'test-principal' to GET the
'/monitor/statistics.json' endpoint
I0613 04:23:23.863868  4602 slave.cpp:817] Agent terminating
[       OK ] Endpoint/SlaveEndpointTest.UnauthorizedRequest/1 (46 ms)
[ RUN      ] Endpoint/SlaveEndpointTest.UnauthorizedRequest/2
I0613 04:23:23.879618  4579 containerizer.cpp:230] Using isolation: posix/cpu,posix/mem,filesystem/posix,network/cni,environment_secret
W0613 04:23:23.880527  4579 backend.cpp:76] Failed to create 'overlay' backend: OverlayBackend
requires root privileges
W0613 04:23:23.880805  4579 backend.cpp:76] Failed to create 'bind' backend: BindBackend requires
root privileges
I0613 04:23:23.880856  4579 provisioner.cpp:255] Using default backend 'copy'
I0613 04:23:23.887403  4599 slave.cpp:248] Mesos agent started on (759)@172.17.0.2:46849
I0613 04:23:23.887446  4599 slave.cpp:249] Flags at startup: --acls="" --appc_simple_discovery_uri_prefix="http://"
--appc_store_dir="/tmp/Endpoint_SlaveEndpointTest_UnauthorizedRequest_2_qlP0DO/store/appc"
--authenticate_http_readonly="true" --authenticate_http_readwrite="true" --authenticatee="crammd5"
--authentication_backoff_factor="1secs" --authorizer="local" --cgroups_cpu_enable_pids_and_tids_count="false"
--cgroups_enable_cfs="false" --cgroups_hierarchy="/sys/fs/cgroup" --cgroups_limit_swap="false"
--cgroups_root="mesos" --container_disk_watch_interval="15secs" --containerizers="mesos" --credential="/tmp/Endpoint_SlaveEndpointTest_UnauthorizedRequest_2_qlP0DO/credential"
--default_role="*" --disk_watch_interval="1mins" --docker="docker" --docker_kill_orphans="true"
--docker_registry="https://registry-1.docker.io" --docker_remove_delay="6hrs" --docker_socket="/var/run/docker.sock"
--docker_stop_timeout="0ns" --docker_store_dir="/tmp/Endpoint_SlaveEndpointTest_UnauthorizedRequest_2_qlP0DO/store/docker"
--docker_volume_checkpoint_dir="/var/run/mesos/isolators/docker/volume" --enforce_container_disk_quota="false"
--executor_registration_timeout="1mins" --executor_reregistration_timeout="2secs" --executor_shutdown_grace_period="5secs"
--fetcher_cache_dir="/tmp/Endpoint_SlaveEndpointTest_UnauthorizedRequest_2_qlP0DO/fetch" --fetcher_cache_size="2GB"
--frameworks_home="" --gc_delay="1weeks" --gc_disk_headroom="0.1" --hadoop_home="" --help="false"
--hostname_lookup="true" --http_command_executor="false" --http_credentials="/tmp/Endpoint_SlaveEndpointTest_UnauthorizedRequest_2_qlP0DO/http_credentials"
--http_heartbeat_interval="30secs" --initialize_driver_logging="true" --isolation="posix/cpu,posix/mem"
--launcher="posix" --launcher_dir="/mesos/mesos-1.4.0/_build/src" --logbufsecs="0" --logging_level="INFO"
--max_completed_executors_per_framework="150" --oversubscribed_resources_interval="15secs"
--perf_duration="10secs" --perf_interval="1mins" --port="5051" --qos_correction_interval_min="0ns"
--quiet="false" --recover="reconnect" --recovery_timeout="15mins" --registration_backoff_factor="10ms"
--resources="cpus:2;gpus:0;mem:1024;disk:1024;ports:[31000-32000]" --revocable_cpu_low_priority="true"
--runtime_dir="/tmp/Endpoint_SlaveEndpointTest_UnauthorizedRequest_2_qlP0DO" --sandbox_directory="/mnt/mesos/sandbox"
--strict="true" --switch_user="true" --systemd_enable_support="true" --systemd_runtime_directory="/run/systemd/system"
--version="false" --work_dir="/tmp/Endpoint_SlaveEndpointTest_UnauthorizedRequest_2_Foyv7r"
I0613 04:23:23.888114  4599 credentials.hpp:86] Loading credential for authentication from
'/tmp/Endpoint_SlaveEndpointTest_UnauthorizedRequest_2_qlP0DO/credential'
I0613 04:23:23.888357  4599 slave.cpp:281] Agent using credential for: test-principal
I0613 04:23:23.888381  4599 credentials.hpp:37] Loading credentials for authentication from
'/tmp/Endpoint_SlaveEndpointTest_UnauthorizedRequest_2_qlP0DO/http_credentials'
I0613 04:23:23.888720  4599 http.cpp:975] Creating default 'basic' HTTP authenticator for
realm 'mesos-agent-readonly'
I0613 04:23:23.888924  4599 http.cpp:975] Creating default 'basic' HTTP authenticator for
realm 'mesos-agent-readwrite'
I0613 04:23:23.890911  4599 slave.cpp:552] Agent resources: cpus(*):2; mem(*):1024; disk(*):1024;
ports(*):[31000-32000]
I0613 04:23:23.891047  4599 slave.cpp:560] Agent attributes: [  ]
I0613 04:23:23.891069  4599 slave.cpp:565] Agent hostname: 3fa52d99cc72
I0613 04:23:23.893463  4599 status_update_manager.cpp:177] Pausing sending status updates
I0613 04:23:23.893748  4605 state.cpp:62] Recovering state from '/tmp/Endpoint_SlaveEndpointTest_UnauthorizedRequest_2_Foyv7r/meta'
I0613 04:23:23.894748  4605 status_update_manager.cpp:203] Recovering status update manager
I0613 04:23:23.895339  4603 containerizer.cpp:582] Recovering containerizer
I0613 04:23:23.897518  4603 provisioner.cpp:416] Provisioner recovery complete
I0613 04:23:23.898164  4603 slave.cpp:6127] Finished recovery
I0613 04:23:23.898752  4603 slave.cpp:6309] Querying resource estimator for oversubscribable
resources
I0613 04:23:23.899663  4603 slave.cpp:6323] Received oversubscribable resources {} from the
resource estimator
I0613 04:23:23.903626  4599 process.cpp:3778] Handling HTTP event for process 'slave(759)'
with path: '/slave(759)/containers'
I0613 04:23:23.905486  4599 http.cpp:1115] HTTP GET for /slave(759)/containers from 172.17.0.2:37026
I0613 04:23:23.905604  4599 http.cpp:936] Authorizing principal 'test-principal' to GET the
'/containers' endpoint
I0613 04:23:23.909234  4579 slave.cpp:817] Agent terminating
[       OK ] Endpoint/SlaveEndpointTest.UnauthorizedRequest/2 (44 ms)
[ RUN      ] Endpoint/SlaveEndpointTest.NoAuthorizer/0
I0613 04:23:23.926028  4579 containerizer.cpp:230] Using isolation: posix/cpu,posix/mem,filesystem/posix,network/cni,environment_secret
W0613 04:23:23.926928  4579 backend.cpp:76] Failed to create 'overlay' backend: OverlayBackend
requires root privileges
W0613 04:23:23.927191  4579 backend.cpp:76] Failed to create 'bind' backend: BindBackend requires
root privileges
I0613 04:23:23.927240  4579 provisioner.cpp:255] Using default backend 'copy'
I0613 04:23:23.929952  4579 cluster.cpp:448] Creating default 'local' authorizer
I0613 04:23:23.932772  4605 slave.cpp:248] Mesos agent started on (760)@172.17.0.2:46849
I0613 04:23:23.932901  4605 slave.cpp:249] Flags at startup: --acls="" --appc_simple_discovery_uri_prefix="http://"
--appc_store_dir="/tmp/Endpoint_SlaveEndpointTest_NoAuthorizer_0_AAR78g/store/appc" --authenticate_http_readonly="true"
--authenticate_http_readwrite="true" --authenticatee="crammd5" --authentication_backoff_factor="1secs"
--authorizer="local" --cgroups_cpu_enable_pids_and_tids_count="false" --cgroups_enable_cfs="false"
--cgroups_hierarchy="/sys/fs/cgroup" --cgroups_limit_swap="false" --cgroups_root="mesos" --container_disk_watch_interval="15secs"
--containerizers="mesos" --credential="/tmp/Endpoint_SlaveEndpointTest_NoAuthorizer_0_AAR78g/credential"
--default_role="*" --disk_watch_interval="1mins" --docker="docker" --docker_kill_orphans="true"
--docker_registry="https://registry-1.docker.io" --docker_remove_delay="6hrs" --docker_socket="/var/run/docker.sock"
--docker_stop_timeout="0ns" --docker_store_dir="/tmp/Endpoint_SlaveEndpointTest_NoAuthorizer_0_AAR78g/store/docker"
--docker_volume_checkpoint_dir="/var/run/mesos/isolators/docker/volume" --enforce_container_disk_quota="false"
--executor_registration_timeout="1mins" --executor_reregistration_timeout="2secs" --executor_shutdown_grace_period="5secs"
--fetcher_cache_dir="/tmp/Endpoint_SlaveEndpointTest_NoAuthorizer_0_AAR78g/fetch" --fetcher_cache_size="2GB"
--frameworks_home="" --gc_delay="1weeks" --gc_disk_headroom="0.1" --hadoop_home="" --help="false"
--hostname_lookup="true" --http_command_executor="false" --http_credentials="/tmp/Endpoint_SlaveEndpointTest_NoAuthorizer_0_AAR78g/http_credentials"
--http_heartbeat_interval="30secs" --initialize_driver_logging="true" --isolation="posix/cpu,posix/mem"
--launcher="posix" --launcher_dir="/mesos/mesos-1.4.0/_build/src" --logbufsecs="0" --logging_level="INFO"
--max_completed_executors_per_framework="150" --oversubscribed_resources_interval="15secs"
--perf_duration="10secs" --perf_interval="1mins" --port="5051" --qos_correction_interval_min="0ns"
--quiet="false" --recover="reconnect" --recovery_timeout="15mins" --registration_backoff_factor="10ms"
--resources="cpus:2;gpus:0;mem:1024;disk:1024;ports:[31000-32000]" --revocable_cpu_low_priority="true"
--runtime_dir="/tmp/Endpoint_SlaveEndpointTest_NoAuthorizer_0_AAR78g" --sandbox_directory="/mnt/mesos/sandbox"
--strict="true" --switch_user="true" --systemd_enable_support="true" --systemd_runtime_directory="/run/systemd/system"
--version="false" --work_dir="/tmp/Endpoint_SlaveEndpointTest_NoAuthorizer_0_PlzkvU"
I0613 04:23:23.933967  4605 credentials.hpp:86] Loading credential for authentication from
'/tmp/Endpoint_SlaveEndpointTest_NoAuthorizer_0_AAR78g/credential'
I0613 04:23:23.934379  4605 slave.cpp:281] Agent using credential for: test-principal
I0613 04:23:23.934476  4605 credentials.hpp:37] Loading credentials for authentication from
'/tmp/Endpoint_SlaveEndpointTest_NoAuthorizer_0_AAR78g/http_credentials'
I0613 04:23:23.935070  4605 http.cpp:975] Creating default 'basic' HTTP authenticator for
realm 'mesos-agent-readonly'
I0613 04:23:23.935494  4605 http.cpp:975] Creating default 'basic' HTTP authenticator for
realm 'mesos-agent-readwrite'
I0613 04:23:23.937948  4605 slave.cpp:552] Agent resources: cpus(*):2; mem(*):1024; disk(*):1024;
ports(*):[31000-32000]
I0613 04:23:23.938189  4605 slave.cpp:560] Agent attributes: [  ]
I0613 04:23:23.938346  4605 slave.cpp:565] Agent hostname: 3fa52d99cc72
I0613 04:23:23.938664  4599 status_update_manager.cpp:177] Pausing sending status updates
I0613 04:23:23.940686  4600 state.cpp:62] Recovering state from '/tmp/Endpoint_SlaveEndpointTest_NoAuthorizer_0_PlzkvU/meta'
I0613 04:23:23.941319  4604 status_update_manager.cpp:203] Recovering status update manager
I0613 04:23:23.941669  4605 containerizer.cpp:582] Recovering containerizer
I0613 04:23:23.944031  4600 provisioner.cpp:416] Provisioner recovery complete
I0613 04:23:23.944694  4602 slave.cpp:6127] Finished recovery
I0613 04:23:23.945574  4602 slave.cpp:6309] Querying resource estimator for oversubscribable
resources
I0613 04:23:23.946367  4603 slave.cpp:6323] Received oversubscribable resources {} from the
resource estimator
I0613 04:23:23.950242  4603 process.cpp:3778] Handling HTTP event for process 'slave(760)'
with path: '/slave(760)/monitor/statistics'
I0613 04:23:23.952533  4603 http.cpp:1115] HTTP GET for /slave(760)/monitor/statistics from
172.17.0.2:37028
I0613 04:23:23.952648  4603 http.cpp:936] Authorizing principal 'test-principal' to GET the
'/monitor/statistics' endpoint
I0613 04:23:23.958622  4602 slave.cpp:817] Agent terminating
[       OK ] Endpoint/SlaveEndpointTest.NoAuthorizer/0 (48 ms)
[ RUN      ] Endpoint/SlaveEndpointTest.NoAuthorizer/1
I0613 04:23:23.973927  4579 containerizer.cpp:230] Using isolation: posix/cpu,posix/mem,filesystem/posix,network/cni,environment_secret
W0613 04:23:23.974822  4579 backend.cpp:76] Failed to create 'overlay' backend: OverlayBackend
requires root privileges
W0613 04:23:23.975085  4579 backend.cpp:76] Failed to create 'bind' backend: BindBackend requires
root privileges
I0613 04:23:23.975164  4579 provisioner.cpp:255] Using default backend 'copy'
I0613 04:23:23.977933  4579 cluster.cpp:448] Creating default 'local' authorizer
I0613 04:23:23.980764  4603 slave.cpp:248] Mesos agent started on (761)@172.17.0.2:46849
I0613 04:23:23.980806  4603 slave.cpp:249] Flags at startup: --acls="" --appc_simple_discovery_uri_prefix="http://"
--appc_store_dir="/tmp/Endpoint_SlaveEndpointTest_NoAuthorizer_1_Ic2x9J/store/appc" --authenticate_http_readonly="true"
--authenticate_http_readwrite="true" --authenticatee="crammd5" --authentication_backoff_factor="1secs"
--authorizer="local" --cgroups_cpu_enable_pids_and_tids_count="false" --cgroups_enable_cfs="false"
--cgroups_hierarchy="/sys/fs/cgroup" --cgroups_limit_swap="false" --cgroups_root="mesos" --container_disk_watch_interval="15secs"
--containerizers="mesos" --credential="/tmp/Endpoint_SlaveEndpointTest_NoAuthorizer_1_Ic2x9J/credential"
--default_role="*" --disk_watch_interval="1mins" --docker="docker" --docker_kill_orphans="true"
--docker_registry="https://registry-1.docker.io" --docker_remove_delay="6hrs" --docker_socket="/var/run/docker.sock"
--docker_stop_timeout="0ns" --docker_store_dir="/tmp/Endpoint_SlaveEndpointTest_NoAuthorizer_1_Ic2x9J/store/docker"
--docker_volume_checkpoint_dir="/var/run/mesos/isolators/docker/volume" --enforce_container_disk_quota="false"
--executor_registration_timeout="1mins" --executor_reregistration_timeout="2secs" --executor_shutdown_grace_period="5secs"
--fetcher_cache_dir="/tmp/Endpoint_SlaveEndpointTest_NoAuthorizer_1_Ic2x9J/fetch" --fetcher_cache_size="2GB"
--frameworks_home="" --gc_delay="1weeks" --gc_disk_headroom="0.1" --hadoop_home="" --help="false"
--hostname_lookup="true" --http_command_executor="false" --http_credentials="/tmp/Endpoint_SlaveEndpointTest_NoAuthorizer_1_Ic2x9J/http_credentials"
--http_heartbeat_interval="30secs" --initialize_driver_logging="true" --isolation="posix/cpu,posix/mem"
--launcher="posix" --launcher_dir="/mesos/mesos-1.4.0/_build/src" --logbufsecs="0" --logging_level="INFO"
--max_completed_executors_per_framework="150" --oversubscribed_resources_interval="15secs"
--perf_duration="10secs" --perf_interval="1mins" --port="5051" --qos_correction_interval_min="0ns"
--quiet="false" --recover="reconnect" --recovery_timeout="15mins" --registration_backoff_factor="10ms"
--resources="cpus:2;gpus:0;mem:1024;disk:1024;ports:[31000-32000]" --revocable_cpu_low_priority="true"
--runtime_dir="/tmp/Endpoint_SlaveEndpointTest_NoAuthorizer_1_Ic2x9J" --sandbox_directory="/mnt/mesos/sandbox"
--strict="true" --switch_user="true" --systemd_enable_support="true" --systemd_runtime_directory="/run/systemd/system"
--version="false" --work_dir="/tmp/Endpoint_SlaveEndpointTest_NoAuthorizer_1_b9dQnn"
I0613 04:23:23.981495  4603 credentials.hpp:86] Loading credential for authentication from
'/tmp/Endpoint_SlaveEndpointTest_NoAuthorizer_1_Ic2x9J/credential'
I0613 04:23:23.981737  4603 slave.cpp:281] Agent using credential for: test-principal
I0613 04:23:23.981760  4603 credentials.hpp:37] Loading credentials for authentication from
'/tmp/Endpoint_SlaveEndpointTest_NoAuthorizer_1_Ic2x9J/http_credentials'
I0613 04:23:23.982105  4603 http.cpp:975] Creating default 'basic' HTTP authenticator for
realm 'mesos-agent-readonly'
I0613 04:23:23.982705  4603 http.cpp:975] Creating default 'basic' HTTP authenticator for
realm 'mesos-agent-readwrite'
I0613 04:23:23.984800  4603 slave.cpp:552] Agent resources: cpus(*):2; mem(*):1024; disk(*):1024;
ports(*):[31000-32000]
I0613 04:23:23.984943  4603 slave.cpp:560] Agent attributes: [  ]
I0613 04:23:23.984962  4603 slave.cpp:565] Agent hostname: 3fa52d99cc72
I0613 04:23:23.985262  4602 status_update_manager.cpp:177] Pausing sending status updates
I0613 04:23:23.987012  4598 state.cpp:62] Recovering state from '/tmp/Endpoint_SlaveEndpointTest_NoAuthorizer_1_b9dQnn/meta'
I0613 04:23:23.987682  4600 status_update_manager.cpp:203] Recovering status update manager
I0613 04:23:23.987959  4600 containerizer.cpp:582] Recovering containerizer
I0613 04:23:23.990177  4602 provisioner.cpp:416] Provisioner recovery complete
I0613 04:23:23.990928  4605 slave.cpp:6127] Finished recovery
I0613 04:23:23.991673  4605 slave.cpp:6309] Querying resource estimator for oversubscribable
resources
I0613 04:23:23.992302  4605 slave.cpp:6323] Received oversubscribable resources {} from the
resource estimator
I0613 04:23:23.997539  4602 process.cpp:3778] Handling HTTP event for process 'slave(761)'
with path: '/slave(761)/monitor/statistics.json'
I0613 04:23:24.000166  4602 http.cpp:1115] HTTP GET for /slave(761)/monitor/statistics.json
from 172.17.0.2:37032
I0613 04:23:24.000527  4602 http.cpp:936] Authorizing principal 'test-principal' to GET the
'/monitor/statistics.json' endpoint
I0613 04:23:24.006978  4603 slave.cpp:817] Agent terminating
[       OK ] Endpoint/SlaveEndpointTest.NoAuthorizer/1 (48 ms)
[ RUN      ] Endpoint/SlaveEndpointTest.NoAuthorizer/2
I0613 04:23:24.023969  4579 containerizer.cpp:230] Using isolation: posix/cpu,posix/mem,filesystem/posix,network/cni,environment_secret
W0613 04:23:24.025037  4579 backend.cpp:76] Failed to create 'overlay' backend: OverlayBackend
requires root privileges
W0613 04:23:24.025218  4579 backend.cpp:76] Failed to create 'bind' backend: BindBackend requires
root privileges
I0613 04:23:24.025264  4579 provisioner.cpp:255] Using default backend 'copy'
I0613 04:23:24.028127  4579 cluster.cpp:448] Creating default 'local' authorizer
I0613 04:23:24.030899  4598 slave.cpp:248] Mesos agent started on (762)@172.17.0.2:46849
I0613 04:23:24.030938  4598 slave.cpp:249] Flags at startup: --acls="" --appc_simple_discovery_uri_prefix="http://"
--appc_store_dir="/tmp/Endpoint_SlaveEndpointTest_NoAuthorizer_2_4T7dFd/store/appc" --authenticate_http_readonly="true"
--authenticate_http_readwrite="true" --authenticatee="crammd5" --authentication_backoff_factor="1secs"
--authorizer="local" --cgroups_cpu_enable_pids_and_tids_count="false" --cgroups_enable_cfs="false"
--cgroups_hierarchy="/sys/fs/cgroup" --cgroups_limit_swap="false" --cgroups_root="mesos" --container_disk_watch_interval="15secs"
--containerizers="mesos" --credential="/tmp/Endpoint_SlaveEndpointTest_NoAuthorizer_2_4T7dFd/credential"
--default_role="*" --disk_watch_interval="1mins" --docker="docker" --docker_kill_orphans="true"
--docker_registry="https://registry-1.docker.io" --docker_remove_delay="6hrs" --docker_socket="/var/run/docker.sock"
--docker_stop_timeout="0ns" --docker_store_dir="/tmp/Endpoint_SlaveEndpointTest_NoAuthorizer_2_4T7dFd/store/docker"
--docker_volume_checkpoint_dir="/var/run/mesos/isolators/docker/volume" --enforce_container_disk_quota="false"
--executor_registration_timeout="1mins" --executor_reregistration_timeout="2secs" --executor_shutdown_grace_period="5secs"
--fetcher_cache_dir="/tmp/Endpoint_SlaveEndpointTest_NoAuthorizer_2_4T7dFd/fetch" --fetcher_cache_size="2GB"
--frameworks_home="" --gc_delay="1weeks" --gc_disk_headroom="0.1" --hadoop_home="" --help="false"
--hostname_lookup="true" --http_command_executor="false" --http_credentials="/tmp/Endpoint_SlaveEndpointTest_NoAuthorizer_2_4T7dFd/http_credentials"
--http_heartbeat_interval="30secs" --initialize_driver_logging="true" --isolation="posix/cpu,posix/mem"
--launcher="posix" --launcher_dir="/mesos/mesos-1.4.0/_build/src" --logbufsecs="0" --logging_level="INFO"
--max_completed_executors_per_framework="150" --oversubscribed_resources_interval="15secs"
--perf_duration="10secs" --perf_interval="1mins" --port="5051" --qos_correction_interval_min="0ns"
--quiet="false" --recover="reconnect" --recovery_timeout="15mins" --registration_backoff_factor="10ms"
--resources="cpus:2;gpus:0;mem:1024;disk:1024;ports:[31000-32000]" --revocable_cpu_low_priority="true"
--runtime_dir="/tmp/Endpoint_SlaveEndpointTest_NoAuthorizer_2_4T7dFd" --sandbox_directory="/mnt/mesos/sandbox"
--strict="true" --switch_user="true" --systemd_enable_support="true" --systemd_runtime_directory="/run/systemd/system"
--version="false" --work_dir="/tmp/Endpoint_SlaveEndpointTest_NoAuthorizer_2_5rOALQ"
I0613 04:23:24.031651  4598 credentials.hpp:86] Loading credential for authentication from
'/tmp/Endpoint_SlaveEndpointTest_NoAuthorizer_2_4T7dFd/credential'
I0613 04:23:24.031913  4598 slave.cpp:281] Agent using credential for: test-principal
I0613 04:23:24.031942  4598 credentials.hpp:37] Loading credentials for authentication from
'/tmp/Endpoint_SlaveEndpointTest_NoAuthorizer_2_4T7dFd/http_credentials'
I0613 04:23:24.032297  4598 http.cpp:975] Creating default 'basic' HTTP authenticator for
realm 'mesos-agent-readonly'
I0613 04:23:24.032493  4598 http.cpp:975] Creating default 'basic' HTTP authenticator for
realm 'mesos-agent-readwrite'
I0613 04:23:24.034514  4598 slave.cpp:552] Agent resources: cpus(*):2; mem(*):1024; disk(*):1024;
ports(*):[31000-32000]
I0613 04:23:24.034656  4598 slave.cpp:560] Agent attributes: [  ]
I0613 04:23:24.034675  4598 slave.cpp:565] Agent hostname: 3fa52d99cc72
I0613 04:23:24.034901  4604 status_update_manager.cpp:177] Pausing sending status updates
I0613 04:23:24.037221  4602 state.cpp:62] Recovering state from '/tmp/Endpoint_SlaveEndpointTest_NoAuthorizer_2_5rOALQ/meta'
I0613 04:23:24.037956  4601 status_update_manager.cpp:203] Recovering status update manager
I0613 04:23:24.038280  4604 containerizer.cpp:582] Recovering containerizer
I0613 04:23:24.040283  4601 provisioner.cpp:416] Provisioner recovery complete
I0613 04:23:24.040738  4600 slave.cpp:6127] Finished recovery
I0613 04:23:24.041510  4600 slave.cpp:6309] Querying resource estimator for oversubscribable
resources
I0613 04:23:24.041972  4604 slave.cpp:6323] Received oversubscribable resources {} from the
resource estimator
I0613 04:23:24.046108  4603 process.cpp:3778] Handling HTTP event for process 'slave(762)'
with path: '/slave(762)/containers'
I0613 04:23:24.048121  4602 http.cpp:1115] HTTP GET for /slave(762)/containers from 172.17.0.2:37036
I0613 04:23:24.048377  4602 http.cpp:936] Authorizing principal 'test-principal' to GET the
'/containers' endpoint
I0613 04:23:24.054190  4600 slave.cpp:817] Agent terminating
[       OK ] Endpoint/SlaveEndpointTest.NoAuthorizer/2 (46 ms)
[----------] 9 tests from Endpoint/SlaveEndpointTest (427 ms total)

[----------] Global test environment tear-down
[==========] 1589 tests from 176 test cases ran. (775209 ms total)
[  PASSED  ] 1583 tests.
[  FAILED  ] 6 tests, listed below:
[  FAILED  ] DefaultExecutorCheckTest.CommandCheckDeliveredAndReconciled
[  FAILED  ] DefaultExecutorCheckTest.CommandCheckStatusChange
[  FAILED  ] DefaultExecutorCheckTest.CommandCheckSeesParentsEnv
[  FAILED  ] DefaultExecutorCheckTest.CommandCheckSharesWorkDirWithTask
[  FAILED  ] FaultToleranceTest.SchedulerReregisterAfterFailoverTimeout
[  FAILED  ] PersistentVolumeEndpointsTest.ReserveAndSlaveRemoval

 6 FAILED TESTS
  YOU HAVE 22 DISABLED TESTS

E0613 04:23:24.196533  4606 process.cpp:968] Failed to accept socket: future discarded
make[4]: *** [check-local] Error 1
make[4]: Leaving directory `/mesos/mesos-1.4.0/_build/src'
make[3]: *** [check-am] Error 2
make[3]: Leaving directory `/mesos/mesos-1.4.0/_build/src'
make[2]: *** [check] Error 2
make[2]: Leaving directory `/mesos/mesos-1.4.0/_build/src'
make[1]: *** [check-recursive] Error 1
make[1]: Leaving directory `/mesos/mesos-1.4.0/_build'
make: *** [distcheck] Error 1
+ docker rmi mesos-1497320661-12781
Untagged: mesos-1497320661-12781:latest
Deleted: sha256:60962e33d7d4ed632d327e20c7daace7f3effaea1d8633aaa11655cd487fa976
Deleted: sha256:939085fa961e90ce40fa2feb0154f186676f8d6247c33c5cad12777c23b6d5f1
Deleted: sha256:fc09affae44dc35db05001dec11dc57ec2d6433d3d9f1a469de37879b3b0e11a
Deleted: sha256:22293ee5b8bbda8e7b40e7d390f29484e47a6ffbca5044789c19fcef4f188e31
Deleted: sha256:902384aed22150e62b1a9bce82684da70392e92941358e5eb5c4f7f2781e8ccd
Deleted: sha256:130c74fa9932a6aec31b4e51bea89b919e82cf85e3276ff3d03b809cf4115f9f
Deleted: sha256:e78fd5d7ef125337427a0b1384ccf990a67206dfb114cb91ffae11354e39a388
Deleted: sha256:746b4d80e6c7545f15c83e9a7dfb1f78d21876968ec87aef30c4f53e0ed25b06
Deleted: sha256:e7b298a527d33ed06a7adeba84d031bb1650e5f85517662a1dfdba4452a27b0d
Deleted: sha256:075b69ac14fb90562902290545db76088d0e7393a0c714d63b9fe34d38e7ed21
Deleted: sha256:35285b8b95fcd1f01e4bcbab3589621418c5b73ca6f398537cf1a95aeb98d210
Deleted: sha256:d6490cdf91ba2ea1f5440212de6a3e4aea35b89f03081dbf6216d253da448aef
Deleted: sha256:79aa7b55e2c061e32ee1ed2cc9bf78f2eef0180b34fbe43a218c67be63c60372
Deleted: sha256:9ac8bb1255fadbe339564feda7cb9dc252e5669d2e2338de5532a93021ac5501
Deleted: sha256:811c9484dbf8868e3b97ef0055e731759efff1ebe34cac8df92581f2a19ced97
Deleted: sha256:ab824799fdfc5d3437cc5a315b65ca7dd60ff146deb0285188f7b8a51db5b4c5
Deleted: sha256:2bd9f51ac2f11a3fa9eb0f0e3a0cd666abe7592aab7c14c4a8f2849c80aec3b9
Deleted: sha256:1babaed64ea6ddf27f9ad5344b25889472d7bd19a59bb86c612b6655087d13ee
Deleted: sha256:37f2d18afcb191145cddb155c04ade30e266a676e13eb6bfa0508f01c0615930
Deleted: sha256:07d1202a6df072becc13898dc91a054f58b723ccaf22a4575b4549f1c19b33a1
Deleted: sha256:62e67880b63551c8bb448c152927cfdd55a8dd7575fafb8c536585739f4ae6ed
Deleted: sha256:a1a6b0c7d97319529a38f4024ba1960b1a343b54c928657f9d6e7be33d39967f
Deleted: sha256:e39874fad9e39dd0c1d83080ae4c76295a2df5ed8b799f7a458e4c93aabf1595
Deleted: sha256:dc7359e97a095d835d2e99b674d0322a29470d139a77a0e7052799ebed6c62e7
Build step 'Execute shell' marked build as failure

Mime
View raw message