mesos-builds mailing list archives

Site index · List index
Message view « Date » · « Thread »
Top « Date » · « Thread »
From Apache Jenkins Server <jenk...@builds.apache.org>
Subject Build failed in Jenkins: Mesos-Buildbot » autotools,gcc,--verbose --enable-libevent --enable-ssl,GLOG_v=1 MESOS_VERBOSE=1,ubuntu:14.04,(ubuntu)&&(!ubuntu-us1)&&(!ubuntu-eu2) #3827
Date Wed, 21 Jun 2017 10:42:33 GMT
See <https://builds.apache.org/job/Mesos-Buildbot/BUILDTOOL=autotools,COMPILER=gcc,CONFIGURATION=--verbose%20--enable-libevent%20--enable-ssl,ENVIRONMENT=GLOG_v=1%20MESOS_VERBOSE=1,OS=ubuntu%3A14.04,label_exp=(ubuntu)&&(!ubuntu-us1)&&(!ubuntu-eu2)/3827/display/redirect?page=changes>

Changes:

[mpark] Prevented allocating reservation refinements to non-capable frameworks.

[mpark] Converted the resources to the "endpoint" format for V0 endpoints.

[mpark] Converted the resources to the "endpoint" format for V1 endpoints.

[mpark] Updated a `CREATE` error message mention "create" rather than "reserve".

[mpark] Placed the `convertResourceFormat` calls after resource validation.

[mpark] Added missing `RESERVATION_REFINEMENT` capability to examples and tests.

[mpark] Replaced incorrect use of `CHECK_GE`s with `CHECK_GT`.

[mpark] Fixed an error message dependent test `AgentHierarchicalRoleCapability`.

------------------------------------------
[...truncated 29.69 MB...]
[       OK ] Endpoint/SlaveEndpointTest.AuthorizedRequest/2 (49 ms)
[ RUN      ] Endpoint/SlaveEndpointTest.UnauthorizedRequest/0
I0621 10:42:20.576726  6212 containerizer.cpp:230] Using isolation: posix/cpu,posix/mem,filesystem/posix,network/cni,environment_secret
W0621 10:42:20.577486  6212 backend.cpp:76] Failed to create 'overlay' backend: OverlayBackend
requires root privileges
W0621 10:42:20.577648  6212 backend.cpp:76] Failed to create 'bind' backend: BindBackend requires
root privileges
I0621 10:42:20.577692  6212 provisioner.cpp:255] Using default backend 'copy'
I0621 10:42:20.583829 22474 slave.cpp:249] Mesos agent started on (770)@172.17.0.2:42009
I0621 10:42:20.583875 22474 slave.cpp:250] Flags at startup: --acls="" --appc_simple_discovery_uri_prefix="http://"
--appc_store_dir="/tmp/Endpoint_SlaveEndpointTest_UnauthorizedRequest_0_UsPpfV/store/appc"
--authenticate_http_executors="true" --authenticate_http_readonly="true" --authenticate_http_readwrite="true"
--authenticatee="crammd5" --authentication_backoff_factor="1secs" --authorizer="local" --cgroups_cpu_enable_pids_and_tids_count="false"
--cgroups_enable_cfs="false" --cgroups_hierarchy="/sys/fs/cgroup" --cgroups_limit_swap="false"
--cgroups_root="mesos" --container_disk_watch_interval="15secs" --containerizers="mesos" --credential="/tmp/Endpoint_SlaveEndpointTest_UnauthorizedRequest_0_UsPpfV/credential"
--default_role="*" --disk_watch_interval="1mins" --docker="docker" --docker_kill_orphans="true"
--docker_registry="https://registry-1.docker.io" --docker_remove_delay="6hrs" --docker_socket="/var/run/docker.sock"
--docker_stop_timeout="0ns" --docker_store_dir="/tmp/Endpoint_SlaveEndpointTest_UnauthorizedRequest_0_UsPpfV/store/docker"
--docker_volume_checkpoint_dir="/var/run/mesos/isolators/docker/volume" --enforce_container_disk_quota="false"
--executor_registration_timeout="1mins" --executor_reregistration_timeout="2secs" --executor_secret_key="/tmp/Endpoint_SlaveEndpointTest_UnauthorizedRequest_0_UsPpfV/executor_secret_key"
--executor_shutdown_grace_period="5secs" --fetcher_cache_dir="/tmp/Endpoint_SlaveEndpointTest_UnauthorizedRequest_0_UsPpfV/fetch"
--fetcher_cache_size="2GB" --frameworks_home="" --gc_delay="1weeks" --gc_disk_headroom="0.1"
--hadoop_home="" --help="false" --hostname_lookup="true" --http_command_executor="false" --http_credentials="/tmp/Endpoint_SlaveEndpointTest_UnauthorizedRequest_0_UsPpfV/http_credentials"
--http_heartbeat_interval="30secs" --initialize_driver_logging="true" --isolation="posix/cpu,posix/mem"
--launcher="posix" --launcher_dir="/mesos/mesos-1.4.0/_build/src" --logbufsecs="0" --logging_level="INFO"
--max_completed_executors_per_framework="150" --oversubscribed_resources_interval="15secs"
--perf_duration="10secs" --perf_interval="1mins" --port="5051" --qos_correction_interval_min="0ns"
--quiet="false" --recover="reconnect" --recovery_timeout="15mins" --registration_backoff_factor="10ms"
--resources="cpus:2;gpus:0;mem:1024;disk:1024;ports:[31000-32000]" --revocable_cpu_low_priority="true"
--runtime_dir="/tmp/Endpoint_SlaveEndpointTest_UnauthorizedRequest_0_UsPpfV" --sandbox_directory="/mnt/mesos/sandbox"
--strict="true" --switch_user="true" --systemd_enable_support="true" --systemd_runtime_directory="/run/systemd/system"
--version="false" --work_dir="/tmp/Endpoint_SlaveEndpointTest_UnauthorizedRequest_0_U8DnMX"
I0621 10:42:20.584576 22474 credentials.hpp:86] Loading credential for authentication from
'/tmp/Endpoint_SlaveEndpointTest_UnauthorizedRequest_0_UsPpfV/credential'
I0621 10:42:20.584818 22474 slave.cpp:282] Agent using credential for: test-principal
I0621 10:42:20.584841 22474 credentials.hpp:37] Loading credentials for authentication from
'/tmp/Endpoint_SlaveEndpointTest_UnauthorizedRequest_0_UsPpfV/http_credentials'
I0621 10:42:20.585247 22474 http.cpp:974] Creating default 'basic' HTTP authenticator for
realm 'mesos-agent-executor'
I0621 10:42:20.585424 22474 http.cpp:995] Creating default 'jwt' HTTP authenticator for realm
'mesos-agent-executor'
I0621 10:42:20.585621 22474 http.cpp:974] Creating default 'basic' HTTP authenticator for
realm 'mesos-agent-readonly'
I0621 10:42:20.585703 22474 http.cpp:995] Creating default 'jwt' HTTP authenticator for realm
'mesos-agent-readonly'
I0621 10:42:20.585914 22474 http.cpp:974] Creating default 'basic' HTTP authenticator for
realm 'mesos-agent-readwrite'
I0621 10:42:20.585997 22474 http.cpp:995] Creating default 'jwt' HTTP authenticator for realm
'mesos-agent-readwrite'
I0621 10:42:20.588026 22474 slave.cpp:553] Agent resources: cpus:2; mem:1024; disk:1024; ports:[31000-32000]
I0621 10:42:20.588166 22474 slave.cpp:561] Agent attributes: [  ]
I0621 10:42:20.588188 22474 slave.cpp:566] Agent hostname: 7525058a6f5d
I0621 10:42:20.590811 22473 status_update_manager.cpp:177] Pausing sending status updates
I0621 10:42:20.591075 22470 state.cpp:64] Recovering state from '/tmp/Endpoint_SlaveEndpointTest_UnauthorizedRequest_0_U8DnMX/meta'
I0621 10:42:20.591720 22470 status_update_manager.cpp:203] Recovering status update manager
I0621 10:42:20.592022 22470 containerizer.cpp:582] Recovering containerizer
I0621 10:42:20.594979 22470 provisioner.cpp:416] Provisioner recovery complete
I0621 10:42:20.595796 22470 slave.cpp:6162] Finished recovery
I0621 10:42:20.596851 22470 slave.cpp:6344] Querying resource estimator for oversubscribable
resources
I0621 10:42:20.597295 22469 slave.cpp:6358] Received oversubscribable resources {} from the
resource estimator
I0621 10:42:20.602139 22472 process.cpp:3779] Handling HTTP event for process 'slave(770)'
with path: '/slave(770)/monitor/statistics'
I0621 10:42:20.605321 22472 http.cpp:1114] HTTP GET for /slave(770)/monitor/statistics from
172.17.0.2:50306
I0621 10:42:20.605451 22472 http.cpp:935] Authorizing principal 'test-principal' to GET the
'/monitor/statistics' endpoint
I0621 10:42:20.610280 22469 slave.cpp:818] Agent terminating
[       OK ] Endpoint/SlaveEndpointTest.UnauthorizedRequest/0 (58 ms)
[ RUN      ] Endpoint/SlaveEndpointTest.UnauthorizedRequest/1
I0621 10:42:20.635653  6212 containerizer.cpp:230] Using isolation: posix/cpu,posix/mem,filesystem/posix,network/cni,environment_secret
W0621 10:42:20.636651  6212 backend.cpp:76] Failed to create 'overlay' backend: OverlayBackend
requires root privileges
W0621 10:42:20.636868  6212 backend.cpp:76] Failed to create 'bind' backend: BindBackend requires
root privileges
I0621 10:42:20.636956  6212 provisioner.cpp:255] Using default backend 'copy'
I0621 10:42:20.642172 22468 slave.cpp:249] Mesos agent started on (771)@172.17.0.2:42009
I0621 10:42:20.642225 22468 slave.cpp:250] Flags at startup: --acls="" --appc_simple_discovery_uri_prefix="http://"
--appc_store_dir="/tmp/Endpoint_SlaveEndpointTest_UnauthorizedRequest_1_suRyDL/store/appc"
--authenticate_http_executors="true" --authenticate_http_readonly="true" --authenticate_http_readwrite="true"
--authenticatee="crammd5" --authentication_backoff_factor="1secs" --authorizer="local" --cgroups_cpu_enable_pids_and_tids_count="false"
--cgroups_enable_cfs="false" --cgroups_hierarchy="/sys/fs/cgroup" --cgroups_limit_swap="false"
--cgroups_root="mesos" --container_disk_watch_interval="15secs" --containerizers="mesos" --credential="/tmp/Endpoint_SlaveEndpointTest_UnauthorizedRequest_1_suRyDL/credential"
--default_role="*" --disk_watch_interval="1mins" --docker="docker" --docker_kill_orphans="true"
--docker_registry="https://registry-1.docker.io" --docker_remove_delay="6hrs" --docker_socket="/var/run/docker.sock"
--docker_stop_timeout="0ns" --docker_store_dir="/tmp/Endpoint_SlaveEndpointTest_UnauthorizedRequest_1_suRyDL/store/docker"
--docker_volume_checkpoint_dir="/var/run/mesos/isolators/docker/volume" --enforce_container_disk_quota="false"
--executor_registration_timeout="1mins" --executor_reregistration_timeout="2secs" --executor_secret_key="/tmp/Endpoint_SlaveEndpointTest_UnauthorizedRequest_1_suRyDL/executor_secret_key"
--executor_shutdown_grace_period="5secs" --fetcher_cache_dir="/tmp/Endpoint_SlaveEndpointTest_UnauthorizedRequest_1_suRyDL/fetch"
--fetcher_cache_size="2GB" --frameworks_home="" --gc_delay="1weeks" --gc_disk_headroom="0.1"
--hadoop_home="" --help="false" --hostname_lookup="true" --http_command_executor="false" --http_credentials="/tmp/Endpoint_SlaveEndpointTest_UnauthorizedRequest_1_suRyDL/http_credentials"
--http_heartbeat_interval="30secs" --initialize_driver_logging="true" --isolation="posix/cpu,posix/mem"
--launcher="posix" --launcher_dir="/mesos/mesos-1.4.0/_build/src" --logbufsecs="0" --logging_level="INFO"
--max_completed_executors_per_framework="150" --oversubscribed_resources_interval="15secs"
--perf_duration="10secs" --perf_interval="1mins" --port="5051" --qos_correction_interval_min="0ns"
--quiet="false" --recover="reconnect" --recovery_timeout="15mins" --registration_backoff_factor="10ms"
--resources="cpus:2;gpus:0;mem:1024;disk:1024;ports:[31000-32000]" --revocable_cpu_low_priority="true"
--runtime_dir="/tmp/Endpoint_SlaveEndpointTest_UnauthorizedRequest_1_suRyDL" --sandbox_directory="/mnt/mesos/sandbox"
--strict="true" --switch_user="true" --systemd_enable_support="true" --systemd_runtime_directory="/run/systemd/system"
--version="false" --work_dir="/tmp/Endpoint_SlaveEndpointTest_UnauthorizedRequest_1_MUiY0N"
I0621 10:42:20.643046 22468 credentials.hpp:86] Loading credential for authentication from
'/tmp/Endpoint_SlaveEndpointTest_UnauthorizedRequest_1_suRyDL/credential'
I0621 10:42:20.643381 22468 slave.cpp:282] Agent using credential for: test-principal
I0621 10:42:20.643431 22468 credentials.hpp:37] Loading credentials for authentication from
'/tmp/Endpoint_SlaveEndpointTest_UnauthorizedRequest_1_suRyDL/http_credentials'
I0621 10:42:20.644040 22468 http.cpp:974] Creating default 'basic' HTTP authenticator for
realm 'mesos-agent-executor'
I0621 10:42:20.644284 22468 http.cpp:995] Creating default 'jwt' HTTP authenticator for realm
'mesos-agent-executor'
I0621 10:42:20.644568 22468 http.cpp:974] Creating default 'basic' HTTP authenticator for
realm 'mesos-agent-readonly'
I0621 10:42:20.644749 22468 http.cpp:995] Creating default 'jwt' HTTP authenticator for realm
'mesos-agent-readonly'
I0621 10:42:20.645076 22468 http.cpp:974] Creating default 'basic' HTTP authenticator for
realm 'mesos-agent-readwrite'
I0621 10:42:20.645294 22468 http.cpp:995] Creating default 'jwt' HTTP authenticator for realm
'mesos-agent-readwrite'
I0621 10:42:20.647933 22468 slave.cpp:553] Agent resources: cpus:2; mem:1024; disk:1024; ports:[31000-32000]
I0621 10:42:20.648109 22468 slave.cpp:561] Agent attributes: [  ]
I0621 10:42:20.648133 22468 slave.cpp:566] Agent hostname: 7525058a6f5d
I0621 10:42:20.648361 22474 status_update_manager.cpp:177] Pausing sending status updates
I0621 10:42:20.650704 22471 state.cpp:64] Recovering state from '/tmp/Endpoint_SlaveEndpointTest_UnauthorizedRequest_1_MUiY0N/meta'
I0621 10:42:20.651273 22471 status_update_manager.cpp:203] Recovering status update manager
I0621 10:42:20.651660 22468 containerizer.cpp:582] Recovering containerizer
I0621 10:42:20.654211 22469 provisioner.cpp:416] Provisioner recovery complete
I0621 10:42:20.654839 22467 slave.cpp:6162] Finished recovery
I0621 10:42:20.655470 22467 slave.cpp:6344] Querying resource estimator for oversubscribable
resources
I0621 10:42:20.656050 22471 slave.cpp:6358] Received oversubscribable resources {} from the
resource estimator
I0621 10:42:20.663897 22470 process.cpp:3779] Handling HTTP event for process 'slave(771)'
with path: '/slave(771)/monitor/statistics.json'
I0621 10:42:20.667392 22472 http.cpp:1114] HTTP GET for /slave(771)/monitor/statistics.json
from 172.17.0.2:50308
I0621 10:42:20.667520 22472 http.cpp:935] Authorizing principal 'test-principal' to GET the
'/monitor/statistics.json' endpoint
I0621 10:42:20.670919 22470 slave.cpp:818] Agent terminating
[       OK ] Endpoint/SlaveEndpointTest.UnauthorizedRequest/1 (74 ms)
[ RUN      ] Endpoint/SlaveEndpointTest.UnauthorizedRequest/2
I0621 10:42:20.710563  6212 containerizer.cpp:230] Using isolation: posix/cpu,posix/mem,filesystem/posix,network/cni,environment_secret
W0621 10:42:20.711410  6212 backend.cpp:76] Failed to create 'overlay' backend: OverlayBackend
requires root privileges
W0621 10:42:20.711619  6212 backend.cpp:76] Failed to create 'bind' backend: BindBackend requires
root privileges
I0621 10:42:20.711673  6212 provisioner.cpp:255] Using default backend 'copy'
I0621 10:42:20.719097 22472 slave.cpp:249] Mesos agent started on (772)@172.17.0.2:42009
I0621 10:42:20.719144 22472 slave.cpp:250] Flags at startup: --acls="" --appc_simple_discovery_uri_prefix="http://"
--appc_store_dir="/tmp/Endpoint_SlaveEndpointTest_UnauthorizedRequest_2_e70fLC/store/appc"
--authenticate_http_executors="true" --authenticate_http_readonly="true" --authenticate_http_readwrite="true"
--authenticatee="crammd5" --authentication_backoff_factor="1secs" --authorizer="local" --cgroups_cpu_enable_pids_and_tids_count="false"
--cgroups_enable_cfs="false" --cgroups_hierarchy="/sys/fs/cgroup" --cgroups_limit_swap="false"
--cgroups_root="mesos" --container_disk_watch_interval="15secs" --containerizers="mesos" --credential="/tmp/Endpoint_SlaveEndpointTest_UnauthorizedRequest_2_e70fLC/credential"
--default_role="*" --disk_watch_interval="1mins" --docker="docker" --docker_kill_orphans="true"
--docker_registry="https://registry-1.docker.io" --docker_remove_delay="6hrs" --docker_socket="/var/run/docker.sock"
--docker_stop_timeout="0ns" --docker_store_dir="/tmp/Endpoint_SlaveEndpointTest_UnauthorizedRequest_2_e70fLC/store/docker"
--docker_volume_checkpoint_dir="/var/run/mesos/isolators/docker/volume" --enforce_container_disk_quota="false"
--executor_registration_timeout="1mins" --executor_reregistration_timeout="2secs" --executor_secret_key="/tmp/Endpoint_SlaveEndpointTest_UnauthorizedRequest_2_e70fLC/executor_secret_key"
--executor_shutdown_grace_period="5secs" --fetcher_cache_dir="/tmp/Endpoint_SlaveEndpointTest_UnauthorizedRequest_2_e70fLC/fetch"
--fetcher_cache_size="2GB" --frameworks_home="" --gc_delay="1weeks" --gc_disk_headroom="0.1"
--hadoop_home="" --help="false" --hostname_lookup="true" --http_command_executor="false" --http_credentials="/tmp/Endpoint_SlaveEndpointTest_UnauthorizedRequest_2_e70fLC/http_credentials"
--http_heartbeat_interval="30secs" --initialize_driver_logging="true" --isolation="posix/cpu,posix/mem"
--launcher="posix" --launcher_dir="/mesos/mesos-1.4.0/_build/src" --logbufsecs="0" --logging_level="INFO"
--max_completed_executors_per_framework="150" --oversubscribed_resources_interval="15secs"
--perf_duration="10secs" --perf_interval="1mins" --port="5051" --qos_correction_interval_min="0ns"
--quiet="false" --recover="reconnect" --recovery_timeout="15mins" --registration_backoff_factor="10ms"
--resources="cpus:2;gpus:0;mem:1024;disk:1024;ports:[31000-32000]" --revocable_cpu_low_priority="true"
--runtime_dir="/tmp/Endpoint_SlaveEndpointTest_UnauthorizedRequest_2_e70fLC" --sandbox_directory="/mnt/mesos/sandbox"
--strict="true" --switch_user="true" --systemd_enable_support="true" --systemd_runtime_directory="/run/systemd/system"
--version="false" --work_dir="/tmp/Endpoint_SlaveEndpointTest_UnauthorizedRequest_2_6OCEWE"
I0621 10:42:20.719867 22472 credentials.hpp:86] Loading credential for authentication from
'/tmp/Endpoint_SlaveEndpointTest_UnauthorizedRequest_2_e70fLC/credential'
I0621 10:42:20.720127 22472 slave.cpp:282] Agent using credential for: test-principal
I0621 10:42:20.720151 22472 credentials.hpp:37] Loading credentials for authentication from
'/tmp/Endpoint_SlaveEndpointTest_UnauthorizedRequest_2_e70fLC/http_credentials'
I0621 10:42:20.720544 22472 http.cpp:974] Creating default 'basic' HTTP authenticator for
realm 'mesos-agent-executor'
I0621 10:42:20.720718 22472 http.cpp:995] Creating default 'jwt' HTTP authenticator for realm
'mesos-agent-executor'
I0621 10:42:20.720933 22472 http.cpp:974] Creating default 'basic' HTTP authenticator for
realm 'mesos-agent-readonly'
I0621 10:42:20.721019 22472 http.cpp:995] Creating default 'jwt' HTTP authenticator for realm
'mesos-agent-readonly'
I0621 10:42:20.721168 22472 http.cpp:974] Creating default 'basic' HTTP authenticator for
realm 'mesos-agent-readwrite'
I0621 10:42:20.721247 22472 http.cpp:995] Creating default 'jwt' HTTP authenticator for realm
'mesos-agent-readwrite'
I0621 10:42:20.723565 22472 slave.cpp:553] Agent resources: cpus:2; mem:1024; disk:1024; ports:[31000-32000]
I0621 10:42:20.723714 22472 slave.cpp:561] Agent attributes: [  ]
I0621 10:42:20.723734 22472 slave.cpp:566] Agent hostname: 7525058a6f5d
I0621 10:42:20.723976 22469 status_update_manager.cpp:177] Pausing sending status updates
I0621 10:42:20.725983 22467 state.cpp:64] Recovering state from '/tmp/Endpoint_SlaveEndpointTest_UnauthorizedRequest_2_6OCEWE/meta'
I0621 10:42:20.726539 22473 status_update_manager.cpp:203] Recovering status update manager
I0621 10:42:20.726815 22469 containerizer.cpp:582] Recovering containerizer
I0621 10:42:20.729207 22467 provisioner.cpp:416] Provisioner recovery complete
I0621 10:42:20.729682 22474 slave.cpp:6162] Finished recovery
I0621 10:42:20.730410 22474 slave.cpp:6344] Querying resource estimator for oversubscribable
resources
I0621 10:42:20.730867 22469 slave.cpp:6358] Received oversubscribable resources {} from the
resource estimator
I0621 10:42:20.734930 22474 process.cpp:3779] Handling HTTP event for process 'slave(772)'
with path: '/slave(772)/containers'
I0621 10:42:20.737814 22467 http.cpp:1114] HTTP GET for /slave(772)/containers from 172.17.0.2:50310
I0621 10:42:20.737941 22467 http.cpp:935] Authorizing principal 'test-principal' to GET the
'/containers' endpoint
I0621 10:42:20.742760 22474 slave.cpp:818] Agent terminating
[       OK ] Endpoint/SlaveEndpointTest.UnauthorizedRequest/2 (51 ms)
[ RUN      ] Endpoint/SlaveEndpointTest.NoAuthorizer/0
I0621 10:42:20.762112  6212 containerizer.cpp:230] Using isolation: posix/cpu,posix/mem,filesystem/posix,network/cni,environment_secret
W0621 10:42:20.762954  6212 backend.cpp:76] Failed to create 'overlay' backend: OverlayBackend
requires root privileges
W0621 10:42:20.763294  6212 backend.cpp:76] Failed to create 'bind' backend: BindBackend requires
root privileges
I0621 10:42:20.763358  6212 provisioner.cpp:255] Using default backend 'copy'
I0621 10:42:20.766363  6212 cluster.cpp:448] Creating default 'local' authorizer
I0621 10:42:20.769213 22469 slave.cpp:249] Mesos agent started on (773)@172.17.0.2:42009
I0621 10:42:20.769263 22469 slave.cpp:250] Flags at startup: --acls="" --appc_simple_discovery_uri_prefix="http://"
--appc_store_dir="/tmp/Endpoint_SlaveEndpointTest_NoAuthorizer_0_gOM0tu/store/appc" --authenticate_http_executors="true"
--authenticate_http_readonly="true" --authenticate_http_readwrite="true" --authenticatee="crammd5"
--authentication_backoff_factor="1secs" --authorizer="local" --cgroups_cpu_enable_pids_and_tids_count="false"
--cgroups_enable_cfs="false" --cgroups_hierarchy="/sys/fs/cgroup" --cgroups_limit_swap="false"
--cgroups_root="mesos" --container_disk_watch_interval="15secs" --containerizers="mesos" --credential="/tmp/Endpoint_SlaveEndpointTest_NoAuthorizer_0_gOM0tu/credential"
--default_role="*" --disk_watch_interval="1mins" --docker="docker" --docker_kill_orphans="true"
--docker_registry="https://registry-1.docker.io" --docker_remove_delay="6hrs" --docker_socket="/var/run/docker.sock"
--docker_stop_timeout="0ns" --docker_store_dir="/tmp/Endpoint_SlaveEndpointTest_NoAuthorizer_0_gOM0tu/store/docker"
--docker_volume_checkpoint_dir="/var/run/mesos/isolators/docker/volume" --enforce_container_disk_quota="false"
--executor_registration_timeout="1mins" --executor_reregistration_timeout="2secs" --executor_secret_key="/tmp/Endpoint_SlaveEndpointTest_NoAuthorizer_0_gOM0tu/executor_secret_key"
--executor_shutdown_grace_period="5secs" --fetcher_cache_dir="/tmp/Endpoint_SlaveEndpointTest_NoAuthorizer_0_gOM0tu/fetch"
--fetcher_cache_size="2GB" --frameworks_home="" --gc_delay="1weeks" --gc_disk_headroom="0.1"
--hadoop_home="" --help="false" --hostname_lookup="true" --http_command_executor="false" --http_credentials="/tmp/Endpoint_SlaveEndpointTest_NoAuthorizer_0_gOM0tu/http_credentials"
--http_heartbeat_interval="30secs" --initialize_driver_logging="true" --isolation="posix/cpu,posix/mem"
--launcher="posix" --launcher_dir="/mesos/mesos-1.4.0/_build/src" --logbufsecs="0" --logging_level="INFO"
--max_completed_executors_per_framework="150" --oversubscribed_resources_interval="15secs"
--perf_duration="10secs" --perf_interval="1mins" --port="5051" --qos_correction_interval_min="0ns"
--quiet="false" --recover="reconnect" --recovery_timeout="15mins" --registration_backoff_factor="10ms"
--resources="cpus:2;gpus:0;mem:1024;disk:1024;ports:[31000-32000]" --revocable_cpu_low_priority="true"
--runtime_dir="/tmp/Endpoint_SlaveEndpointTest_NoAuthorizer_0_gOM0tu" --sandbox_directory="/mnt/mesos/sandbox"
--strict="true" --switch_user="true" --systemd_enable_support="true" --systemd_runtime_directory="/run/systemd/system"
--version="false" --work_dir="/tmp/Endpoint_SlaveEndpointTest_NoAuthorizer_0_Qkf6ww"
I0621 10:42:20.770077 22469 credentials.hpp:86] Loading credential for authentication from
'/tmp/Endpoint_SlaveEndpointTest_NoAuthorizer_0_gOM0tu/credential'
I0621 10:42:20.770356 22469 slave.cpp:282] Agent using credential for: test-principal
I0621 10:42:20.770382 22469 credentials.hpp:37] Loading credentials for authentication from
'/tmp/Endpoint_SlaveEndpointTest_NoAuthorizer_0_gOM0tu/http_credentials'
I0621 10:42:20.770820 22469 http.cpp:974] Creating default 'basic' HTTP authenticator for
realm 'mesos-agent-executor'
I0621 10:42:20.771021 22469 http.cpp:995] Creating default 'jwt' HTTP authenticator for realm
'mesos-agent-executor'
I0621 10:42:20.771260 22469 http.cpp:974] Creating default 'basic' HTTP authenticator for
realm 'mesos-agent-readonly'
I0621 10:42:20.771366 22469 http.cpp:995] Creating default 'jwt' HTTP authenticator for realm
'mesos-agent-readonly'
I0621 10:42:20.771549 22469 http.cpp:974] Creating default 'basic' HTTP authenticator for
realm 'mesos-agent-readwrite'
I0621 10:42:20.771646 22469 http.cpp:995] Creating default 'jwt' HTTP authenticator for realm
'mesos-agent-readwrite'
I0621 10:42:20.773998 22469 slave.cpp:553] Agent resources: cpus:2; mem:1024; disk:1024; ports:[31000-32000]
I0621 10:42:20.774152 22469 slave.cpp:561] Agent attributes: [  ]
I0621 10:42:20.774171 22469 slave.cpp:566] Agent hostname: 7525058a6f5d
I0621 10:42:20.774468 22467 status_update_manager.cpp:177] Pausing sending status updates
I0621 10:42:20.776485 22467 state.cpp:64] Recovering state from '/tmp/Endpoint_SlaveEndpointTest_NoAuthorizer_0_Qkf6ww/meta'
I0621 10:42:20.777042 22468 status_update_manager.cpp:203] Recovering status update manager
I0621 10:42:20.777432 22472 containerizer.cpp:582] Recovering containerizer
I0621 10:42:20.779850 22474 provisioner.cpp:416] Provisioner recovery complete
I0621 10:42:20.780565 22470 slave.cpp:6162] Finished recovery
I0621 10:42:20.781294 22470 slave.cpp:6344] Querying resource estimator for oversubscribable
resources
I0621 10:42:20.781710 22471 slave.cpp:6358] Received oversubscribable resources {} from the
resource estimator
I0621 10:42:20.786257 22472 process.cpp:3779] Handling HTTP event for process 'slave(773)'
with path: '/slave(773)/monitor/statistics'
I0621 10:42:20.789361 22472 http.cpp:1114] HTTP GET for /slave(773)/monitor/statistics from
172.17.0.2:50312
I0621 10:42:20.789508 22472 http.cpp:935] Authorizing principal 'test-principal' to GET the
'/monitor/statistics' endpoint
I0621 10:42:20.796769 22473 slave.cpp:818] Agent terminating
[       OK ] Endpoint/SlaveEndpointTest.NoAuthorizer/0 (52 ms)
[ RUN      ] Endpoint/SlaveEndpointTest.NoAuthorizer/1
I0621 10:42:20.816562  6212 containerizer.cpp:230] Using isolation: posix/cpu,posix/mem,filesystem/posix,network/cni,environment_secret
W0621 10:42:20.817467  6212 backend.cpp:76] Failed to create 'overlay' backend: OverlayBackend
requires root privileges
W0621 10:42:20.817693  6212 backend.cpp:76] Failed to create 'bind' backend: BindBackend requires
root privileges
I0621 10:42:20.817751  6212 provisioner.cpp:255] Using default backend 'copy'
I0621 10:42:20.821732  6212 cluster.cpp:448] Creating default 'local' authorizer
I0621 10:42:20.825270 22471 slave.cpp:249] Mesos agent started on (774)@172.17.0.2:42009
I0621 10:42:20.825316 22471 slave.cpp:250] Flags at startup: --acls="" --appc_simple_discovery_uri_prefix="http://"
--appc_store_dir="/tmp/Endpoint_SlaveEndpointTest_NoAuthorizer_1_un3wKm/store/appc" --authenticate_http_executors="true"
--authenticate_http_readonly="true" --authenticate_http_readwrite="true" --authenticatee="crammd5"
--authentication_backoff_factor="1secs" --authorizer="local" --cgroups_cpu_enable_pids_and_tids_count="false"
--cgroups_enable_cfs="false" --cgroups_hierarchy="/sys/fs/cgroup" --cgroups_limit_swap="false"
--cgroups_root="mesos" --container_disk_watch_interval="15secs" --containerizers="mesos" --credential="/tmp/Endpoint_SlaveEndpointTest_NoAuthorizer_1_un3wKm/credential"
--default_role="*" --disk_watch_interval="1mins" --docker="docker" --docker_kill_orphans="true"
--docker_registry="https://registry-1.docker.io" --docker_remove_delay="6hrs" --docker_socket="/var/run/docker.sock"
--docker_stop_timeout="0ns" --docker_store_dir="/tmp/Endpoint_SlaveEndpointTest_NoAuthorizer_1_un3wKm/store/docker"
--docker_volume_checkpoint_dir="/var/run/mesos/isolators/docker/volume" --enforce_container_disk_quota="false"
--executor_registration_timeout="1mins" --executor_reregistration_timeout="2secs" --executor_secret_key="/tmp/Endpoint_SlaveEndpointTest_NoAuthorizer_1_un3wKm/executor_secret_key"
--executor_shutdown_grace_period="5secs" --fetcher_cache_dir="/tmp/Endpoint_SlaveEndpointTest_NoAuthorizer_1_un3wKm/fetch"
--fetcher_cache_size="2GB" --frameworks_home="" --gc_delay="1weeks" --gc_disk_headroom="0.1"
--hadoop_home="" --help="false" --hostname_lookup="true" --http_command_executor="false" --http_credentials="/tmp/Endpoint_SlaveEndpointTest_NoAuthorizer_1_un3wKm/http_credentials"
--http_heartbeat_interval="30secs" --initialize_driver_logging="true" --isolation="posix/cpu,posix/mem"
--launcher="posix" --launcher_dir="/mesos/mesos-1.4.0/_build/src" --logbufsecs="0" --logging_level="INFO"
--max_completed_executors_per_framework="150" --oversubscribed_resources_interval="15secs"
--perf_duration="10secs" --perf_interval="1mins" --port="5051" --qos_correction_interval_min="0ns"
--quiet="false" --recover="reconnect" --recovery_timeout="15mins" --registration_backoff_factor="10ms"
--resources="cpus:2;gpus:0;mem:1024;disk:1024;ports:[31000-32000]" --revocable_cpu_low_priority="true"
--runtime_dir="/tmp/Endpoint_SlaveEndpointTest_NoAuthorizer_1_un3wKm" --sandbox_directory="/mnt/mesos/sandbox"
--strict="true" --switch_user="true" --systemd_enable_support="true" --systemd_runtime_directory="/run/systemd/system"
--version="false" --work_dir="/tmp/Endpoint_SlaveEndpointTest_NoAuthorizer_1_GL17Eo"
I0621 10:42:20.826055 22471 credentials.hpp:86] Loading credential for authentication from
'/tmp/Endpoint_SlaveEndpointTest_NoAuthorizer_1_un3wKm/credential'
I0621 10:42:20.826305 22471 slave.cpp:282] Agent using credential for: test-principal
I0621 10:42:20.826328 22471 credentials.hpp:37] Loading credentials for authentication from
'/tmp/Endpoint_SlaveEndpointTest_NoAuthorizer_1_un3wKm/http_credentials'
I0621 10:42:20.826722 22471 http.cpp:974] Creating default 'basic' HTTP authenticator for
realm 'mesos-agent-executor'
I0621 10:42:20.826907 22471 http.cpp:995] Creating default 'jwt' HTTP authenticator for realm
'mesos-agent-executor'
I0621 10:42:20.827122 22471 http.cpp:974] Creating default 'basic' HTTP authenticator for
realm 'mesos-agent-readonly'
I0621 10:42:20.827210 22471 http.cpp:995] Creating default 'jwt' HTTP authenticator for realm
'mesos-agent-readonly'
I0621 10:42:20.827369 22471 http.cpp:974] Creating default 'basic' HTTP authenticator for
realm 'mesos-agent-readwrite'
I0621 10:42:20.827455 22471 http.cpp:995] Creating default 'jwt' HTTP authenticator for realm
'mesos-agent-readwrite'
I0621 10:42:20.830346 22471 slave.cpp:553] Agent resources: cpus:2; mem:1024; disk:1024; ports:[31000-32000]
I0621 10:42:20.831086 22471 slave.cpp:561] Agent attributes: [  ]
I0621 10:42:20.831521 22471 slave.cpp:566] Agent hostname: 7525058a6f5d
I0621 10:42:20.832228 22473 status_update_manager.cpp:177] Pausing sending status updates
I0621 10:42:20.834769 22468 state.cpp:64] Recovering state from '/tmp/Endpoint_SlaveEndpointTest_NoAuthorizer_1_GL17Eo/meta'
I0621 10:42:20.835353 22468 status_update_manager.cpp:203] Recovering status update manager
I0621 10:42:20.835628 22468 containerizer.cpp:582] Recovering containerizer
I0621 10:42:20.838913 22468 provisioner.cpp:416] Provisioner recovery complete
I0621 10:42:20.839834 22468 slave.cpp:6162] Finished recovery
I0621 10:42:20.840481 22468 slave.cpp:6344] Querying resource estimator for oversubscribable
resources
I0621 10:42:20.841485 22468 slave.cpp:6358] Received oversubscribable resources {} from the
resource estimator
I0621 10:42:20.845490 22471 process.cpp:3779] Handling HTTP event for process 'slave(774)'
with path: '/slave(774)/monitor/statistics.json'
I0621 10:42:20.849213 22470 http.cpp:1114] HTTP GET for /slave(774)/monitor/statistics.json
from 172.17.0.2:50314
I0621 10:42:20.849347 22470 http.cpp:935] Authorizing principal 'test-principal' to GET the
'/monitor/statistics.json' endpoint
I0621 10:42:20.856254 22470 slave.cpp:818] Agent terminating
[       OK ] Endpoint/SlaveEndpointTest.NoAuthorizer/1 (61 ms)
[ RUN      ] Endpoint/SlaveEndpointTest.NoAuthorizer/2
I0621 10:42:20.875856  6212 containerizer.cpp:230] Using isolation: posix/cpu,posix/mem,filesystem/posix,network/cni,environment_secret
W0621 10:42:20.877029  6212 backend.cpp:76] Failed to create 'overlay' backend: OverlayBackend
requires root privileges
W0621 10:42:20.877578  6212 backend.cpp:76] Failed to create 'bind' backend: BindBackend requires
root privileges
I0621 10:42:20.877949  6212 provisioner.cpp:255] Using default backend 'copy'
I0621 10:42:20.881373  6212 cluster.cpp:448] Creating default 'local' authorizer
I0621 10:42:20.884706 22472 slave.cpp:249] Mesos agent started on (775)@172.17.0.2:42009
I0621 10:42:20.884749 22472 slave.cpp:250] Flags at startup: --acls="" --appc_simple_discovery_uri_prefix="http://"
--appc_store_dir="/tmp/Endpoint_SlaveEndpointTest_NoAuthorizer_2_sirmEf/store/appc" --authenticate_http_executors="true"
--authenticate_http_readonly="true" --authenticate_http_readwrite="true" --authenticatee="crammd5"
--authentication_backoff_factor="1secs" --authorizer="local" --cgroups_cpu_enable_pids_and_tids_count="false"
--cgroups_enable_cfs="false" --cgroups_hierarchy="/sys/fs/cgroup" --cgroups_limit_swap="false"
--cgroups_root="mesos" --container_disk_watch_interval="15secs" --containerizers="mesos" --credential="/tmp/Endpoint_SlaveEndpointTest_NoAuthorizer_2_sirmEf/credential"
--default_role="*" --disk_watch_interval="1mins" --docker="docker" --docker_kill_orphans="true"
--docker_registry="https://registry-1.docker.io" --docker_remove_delay="6hrs" --docker_socket="/var/run/docker.sock"
--docker_stop_timeout="0ns" --docker_store_dir="/tmp/Endpoint_SlaveEndpointTest_NoAuthorizer_2_sirmEf/store/docker"
--docker_volume_checkpoint_dir="/var/run/mesos/isolators/docker/volume" --enforce_container_disk_quota="false"
--executor_registration_timeout="1mins" --executor_reregistration_timeout="2secs" --executor_secret_key="/tmp/Endpoint_SlaveEndpointTest_NoAuthorizer_2_sirmEf/executor_secret_key"
--executor_shutdown_grace_period="5secs" --fetcher_cache_dir="/tmp/Endpoint_SlaveEndpointTest_NoAuthorizer_2_sirmEf/fetch"
--fetcher_cache_size="2GB" --frameworks_home="" --gc_delay="1weeks" --gc_disk_headroom="0.1"
--hadoop_home="" --help="false" --hostname_lookup="true" --http_command_executor="false" --http_credentials="/tmp/Endpoint_SlaveEndpointTest_NoAuthorizer_2_sirmEf/http_credentials"
--http_heartbeat_interval="30secs" --initialize_driver_logging="true" --isolation="posix/cpu,posix/mem"
--launcher="posix" --launcher_dir="/mesos/mesos-1.4.0/_build/src" --logbufsecs="0" --logging_level="INFO"
--max_completed_executors_per_framework="150" --oversubscribed_resources_interval="15secs"
--perf_duration="10secs" --perf_interval="1mins" --port="5051" --qos_correction_interval_min="0ns"
--quiet="false" --recover="reconnect" --recovery_timeout="15mins" --registration_backoff_factor="10ms"
--resources="cpus:2;gpus:0;mem:1024;disk:1024;ports:[31000-32000]" --revocable_cpu_low_priority="true"
--runtime_dir="/tmp/Endpoint_SlaveEndpointTest_NoAuthorizer_2_sirmEf" --sandbox_directory="/mnt/mesos/sandbox"
--strict="true" --switch_user="true" --systemd_enable_support="true" --systemd_runtime_directory="/run/systemd/system"
--version="false" --work_dir="/tmp/Endpoint_SlaveEndpointTest_NoAuthorizer_2_ivz3oh"
I0621 10:42:20.885495 22472 credentials.hpp:86] Loading credential for authentication from
'/tmp/Endpoint_SlaveEndpointTest_NoAuthorizer_2_sirmEf/credential'
I0621 10:42:20.885742 22472 slave.cpp:282] Agent using credential for: test-principal
I0621 10:42:20.885766 22472 credentials.hpp:37] Loading credentials for authentication from
'/tmp/Endpoint_SlaveEndpointTest_NoAuthorizer_2_sirmEf/http_credentials'
I0621 10:42:20.886173 22472 http.cpp:974] Creating default 'basic' HTTP authenticator for
realm 'mesos-agent-executor'
I0621 10:42:20.886389 22472 http.cpp:995] Creating default 'jwt' HTTP authenticator for realm
'mesos-agent-executor'
I0621 10:42:20.886618 22472 http.cpp:974] Creating default 'basic' HTTP authenticator for
realm 'mesos-agent-readonly'
I0621 10:42:20.886728 22472 http.cpp:995] Creating default 'jwt' HTTP authenticator for realm
'mesos-agent-readonly'
I0621 10:42:20.887127 22472 http.cpp:974] Creating default 'basic' HTTP authenticator for
realm 'mesos-agent-readwrite'
I0621 10:42:20.887240 22472 http.cpp:995] Creating default 'jwt' HTTP authenticator for realm
'mesos-agent-readwrite'
I0621 10:42:20.889504 22472 slave.cpp:553] Agent resources: cpus:2; mem:1024; disk:1024; ports:[31000-32000]
I0621 10:42:20.889648 22472 slave.cpp:561] Agent attributes: [  ]
I0621 10:42:20.889669 22472 slave.cpp:566] Agent hostname: 7525058a6f5d
I0621 10:42:20.889865 22474 status_update_manager.cpp:177] Pausing sending status updates
I0621 10:42:20.891855 22469 state.cpp:64] Recovering state from '/tmp/Endpoint_SlaveEndpointTest_NoAuthorizer_2_ivz3oh/meta'
I0621 10:42:20.892606 22469 status_update_manager.cpp:203] Recovering status update manager
I0621 10:42:20.892837 22469 containerizer.cpp:582] Recovering containerizer
I0621 10:42:20.895867 22473 provisioner.cpp:416] Provisioner recovery complete
I0621 10:42:20.896718 22473 slave.cpp:6162] Finished recovery
I0621 10:42:20.897323 22473 slave.cpp:6344] Querying resource estimator for oversubscribable
resources
I0621 10:42:20.898313 22473 slave.cpp:6358] Received oversubscribable resources {} from the
resource estimator
I0621 10:42:20.902294 22470 process.cpp:3779] Handling HTTP event for process 'slave(775)'
with path: '/slave(775)/containers'
I0621 10:42:20.904893 22472 http.cpp:1114] HTTP GET for /slave(775)/containers from 172.17.0.2:50316
I0621 10:42:20.905031 22472 http.cpp:935] Authorizing principal 'test-principal' to GET the
'/containers' endpoint
I0621 10:42:20.914028  6212 slave.cpp:818] Agent terminating
[       OK ] Endpoint/SlaveEndpointTest.NoAuthorizer/2 (55 ms)
[----------] 9 tests from Endpoint/SlaveEndpointTest (517 ms total)

[----------] Global test environment tear-down
[==========] 1619 tests from 179 test cases ran. (774203 ms total)
[  PASSED  ] 1614 tests.
[  FAILED  ] 5 tests, listed below:
[  FAILED  ] CommandExecutorCheckTest.CommandCheckDeliveredAndReconciled
[  FAILED  ] DefaultExecutorCheckTest.CommandCheckDeliveredAndReconciled
[  FAILED  ] DefaultExecutorCheckTest.CommandCheckStatusChange
[  FAILED  ] DefaultExecutorCheckTest.CommandCheckSeesParentsEnv
[  FAILED  ] DefaultExecutorCheckTest.CommandCheckSharesWorkDirWithTask

 5 FAILED TESTS
  YOU HAVE 20 DISABLED TESTS

E0621 10:42:21.061687 22475 process.cpp:968] Failed to accept socket: future discarded
make[4]: *** [check-local] Error 1
make[4]: Leaving directory `/mesos/mesos-1.4.0/_build/src'
make[3]: *** [check-am] Error 2
make[3]: Leaving directory `/mesos/mesos-1.4.0/_build/src'
make[2]: *** [check] Error 2
make[2]: Leaving directory `/mesos/mesos-1.4.0/_build/src'
make[1]: *** [check-recursive] Error 1
make[1]: Leaving directory `/mesos/mesos-1.4.0/_build'
make: *** [distcheck] Error 1
+ docker rmi mesos-1498035658-1561
Untagged: mesos-1498035658-1561:latest
Deleted: sha256:5247bf05567e33118a5f9f546ae556d8fcaa4914b0c7e88a3e73f7486ff11ae1
Deleted: sha256:ceec94d4c976ff4deba5a43187d0c5bf64968fa70c93523b7a06eb9ca6e8931b
Deleted: sha256:903580a2b6963521b3b85ec015d31ed6800d10b19e39784f5f0f25a2bee7b1a5
Deleted: sha256:35e2bfa84f4b4b2982eb8887d26163dfeca86c6db7e3d9dddcc6c46ff1514614
Deleted: sha256:251d3712233aba98fe3f086a3bb76415b01a996e57baeebe12c9b09295492462
Deleted: sha256:05a3997beafeff6772ae1128908f6d884fc8d7311e8f9182334dc3ccfad949ba
Deleted: sha256:67a1cdfd7d1bd25c9475a22e42de0192c65d5112d814f3440e0bec630d281549
Deleted: sha256:607c2d7b886bbfadc1e1138bfd7da9531a5a2c07189955b6ef8d3c39976a09e8
Deleted: sha256:a06c868af5a969c702c7c9b8ef1961da5020e7126a21db39c81ec442c204171d
Deleted: sha256:9daa038a990079af471fe803fac34dadc79368569fcfc98cf26a4e2fef75b7de
Deleted: sha256:bcbd2eafea4901c2efe643c919ab5b5f8d9f193e632d8bcc089071f1ecd6625d
Deleted: sha256:4555e2a13a537cf844d9c9bd2ad7396d7447c7b4271bc4ee7ced09449be551e1
Deleted: sha256:6066db73d0bb3e046639aee7f6d44ae9d2a0408a488290c5f8ee9e6760302288
Deleted: sha256:e39748230cc937383d27adc309bf3a1abab6fcee480a5506d1236a8ad58994c9
Deleted: sha256:b9a4f41ef2d4b08f4c2c692e1c835f1baa743091de357910facb269456a27467
Deleted: sha256:658ccc117e3adfc8a136cf3521b3c2a2328117ee4904d4b00cfd1de33ff534b9
Deleted: sha256:5ab618ec856de0dbab4f6eeb873f2785b5b5a16df1f9d82acd20dac1b0a98480
Deleted: sha256:503398fb8aeaf1552be4c7128ba5fe9eee5b5b379484d4d19367829eb00ca33b
Deleted: sha256:b35c78856ac5ea141fb19209f7f984bf0d4dea5d04fc9ccfcd3348963410ec7a
Deleted: sha256:a9c616520e7358fd0fbdd7810431003cc0c4947cd0d69d9c499caeb662086e67
Deleted: sha256:50b38e25eadaa5e372856cf85f1c025361edab05cd27f0ba0f436c73435ca941
Deleted: sha256:75d4bcf3ad1c5ebfef69e4927714ab33e399ba0298b368575b0d0f738e208ca0
Deleted: sha256:40f5bf74a2cf0fe07783f5ed4c3c2f2b7af06cbfae7ae4d273f4e3e85d802a74
Deleted: sha256:69734630877cd2426669e09c81e670b29eed3904f3f04be26d8e073dd7180211
Build step 'Execute shell' marked build as failure
Not sending mail to unregistered user toenshoff@me.com

Mime
View raw message