mesos-builds mailing list archives

Site index · List index
Message view « Date » · « Thread »
Top « Date » · « Thread »
From Apache Jenkins Server <jenk...@builds.apache.org>
Subject Build failed in Jenkins: Mesos-Buildbot » cmake,clang,--verbose,GLOG_v=1 MESOS_VERBOSE=1,ubuntu:14.04,(ubuntu)&&(!ubuntu-us1)&&(!ubuntu-eu2) #3817
Date Mon, 19 Jun 2017 22:52:05 GMT
See <https://builds.apache.org/job/Mesos-Buildbot/BUILDTOOL=cmake,COMPILER=clang,CONFIGURATION=--verbose,ENVIRONMENT=GLOG_v=1%20MESOS_VERBOSE=1,OS=ubuntu%3A14.04,label_exp=(ubuntu)&&(!ubuntu-us1)&&(!ubuntu-eu2)/3817/display/redirect?page=changes>

Changes:

[yujie.jay] Fix bytes.hpp constexpr compilation failure with GCC 7.1.

------------------------------------------
[...truncated 26.40 MB...]
I0619 22:52:02.150423 30787 http.cpp:980] Authorizing principal 'test-principal' to GET the
'/monitor/statistics.json' endpoint
I0619 22:52:02.153609 30789 slave.cpp:818] Agent terminating
[       OK ] Endpoint/SlaveEndpointTest.AuthorizedRequest/1 (27 ms)
[ RUN      ] Endpoint/SlaveEndpointTest.AuthorizedRequest/2
I0619 22:52:02.163585 30773 containerizer.cpp:230] Using isolation: posix/cpu,posix/mem,filesystem/posix,network/cni,environment_secret
W0619 22:52:02.164028 30773 backend.cpp:76] Failed to create 'aufs' backend: AufsBackend requires
root privileges
W0619 22:52:02.164114 30773 backend.cpp:76] Failed to create 'bind' backend: BindBackend requires
root privileges
I0619 22:52:02.164139 30773 provisioner.cpp:255] Using default backend 'copy'
I0619 22:52:02.167394 30777 slave.cpp:249] Mesos agent started on (761)@172.17.0.3:43075
I0619 22:52:02.167438 30777 slave.cpp:250] Flags at startup: --acls="" --appc_simple_discovery_uri_prefix="http://"
--appc_store_dir="/tmp/Endpoint_SlaveEndpointTest_AuthorizedRequest_2_8OZknW/store/appc" --authenticate_http_readonly="true"
--authenticate_http_readwrite="true" --authenticatee="crammd5" --authentication_backoff_factor="1secs"
--authorizer="local" --cgroups_cpu_enable_pids_and_tids_count="false" --cgroups_enable_cfs="false"
--cgroups_hierarchy="/sys/fs/cgroup" --cgroups_limit_swap="false" --cgroups_root="mesos" --container_disk_watch_interval="15secs"
--containerizers="mesos" --credential="/tmp/Endpoint_SlaveEndpointTest_AuthorizedRequest_2_8OZknW/credential"
--default_role="*" --disk_watch_interval="1mins" --docker="docker" --docker_kill_orphans="true"
--docker_registry="https://registry-1.docker.io" --docker_remove_delay="6hrs" --docker_socket="/var/run/docker.sock"
--docker_stop_timeout="0ns" --docker_store_dir="/tmp/Endpoint_SlaveEndpointTest_AuthorizedRequest_2_8OZknW/store/docker"
--docker_volume_checkpoint_dir="/var/run/mesos/isolators/docker/volume" --enforce_container_disk_quota="false"
--executor_registration_timeout="1mins" --executor_reregistration_timeout="2secs" --executor_shutdown_grace_period="5secs"
--fetcher_cache_dir="/tmp/Endpoint_SlaveEndpointTest_AuthorizedRequest_2_8OZknW/fetch" --fetcher_cache_size="2GB"
--frameworks_home="" --gc_delay="1weeks" --gc_disk_headroom="0.1" --hadoop_home="" --help="false"
--hostname_lookup="true" --http_command_executor="false" --http_credentials="/tmp/Endpoint_SlaveEndpointTest_AuthorizedRequest_2_8OZknW/http_credentials"
--http_heartbeat_interval="30secs" --initialize_driver_logging="true" --isolation="posix/cpu,posix/mem"
--launcher="posix" --launcher_dir="/mesos/build/src" --logbufsecs="0" --logging_level="INFO"
--max_completed_executors_per_framework="150" --oversubscribed_resources_interval="15secs"
--perf_duration="10secs" --perf_interval="1mins" --port="5051" --qos_correction_interval_min="0ns"
--quiet="false" --recover="reconnect" --recovery_timeout="15mins" --registration_backoff_factor="10ms"
--resources="cpus:2;gpus:0;mem:1024;disk:1024;ports:[31000-32000]" --revocable_cpu_low_priority="true"
--runtime_dir="/tmp/Endpoint_SlaveEndpointTest_AuthorizedRequest_2_8OZknW" --sandbox_directory="/mnt/mesos/sandbox"
--strict="true" --switch_user="true" --systemd_enable_support="true" --systemd_runtime_directory="/run/systemd/system"
--version="false" --work_dir="/tmp/Endpoint_SlaveEndpointTest_AuthorizedRequest_2_9hkMPw"
I0619 22:52:02.167871 30777 credentials.hpp:86] Loading credential for authentication from
'/tmp/Endpoint_SlaveEndpointTest_AuthorizedRequest_2_8OZknW/credential'
I0619 22:52:02.168033 30777 slave.cpp:282] Agent using credential for: test-principal
I0619 22:52:02.168052 30777 credentials.hpp:37] Loading credentials for authentication from
'/tmp/Endpoint_SlaveEndpointTest_AuthorizedRequest_2_8OZknW/http_credentials'
I0619 22:52:02.168282 30777 http.cpp:1019] Creating default 'basic' HTTP authenticator for
realm 'mesos-agent-readonly'
I0619 22:52:02.168437 30777 http.cpp:1019] Creating default 'basic' HTTP authenticator for
realm 'mesos-agent-readwrite'
I0619 22:52:02.169584 30777 slave.cpp:553] Agent resources: cpus(*):2; mem(*):1024; disk(*):1024;
ports(*):[31000-32000]
I0619 22:52:02.169651 30777 slave.cpp:561] Agent attributes: [  ]
I0619 22:52:02.169661 30777 slave.cpp:566] Agent hostname: 8920c5b272a2
I0619 22:52:02.169769 30775 status_update_manager.cpp:177] Pausing sending status updates
I0619 22:52:02.170909 30795 state.cpp:62] Recovering state from '/tmp/Endpoint_SlaveEndpointTest_AuthorizedRequest_2_9hkMPw/meta'
I0619 22:52:02.171214 30781 status_update_manager.cpp:203] Recovering status update manager
I0619 22:52:02.171403 30777 containerizer.cpp:582] Recovering containerizer
I0619 22:52:02.172785 30777 provisioner.cpp:416] Provisioner recovery complete
I0619 22:52:02.173373 30792 slave.cpp:6128] Finished recovery
I0619 22:52:02.173830 30792 slave.cpp:6310] Querying resource estimator for oversubscribable
resources
I0619 22:52:02.174149 30784 slave.cpp:6324] Received oversubscribable resources {} from the
resource estimator
I0619 22:52:02.175987 30790 process.cpp:3779] Handling HTTP event for process 'slave(761)'
with path: '/slave(761)/containers'
I0619 22:52:02.177412 30794 http.cpp:1159] HTTP GET for /slave(761)/containers from 172.17.0.3:45480
I0619 22:52:02.177471 30794 http.cpp:980] Authorizing principal 'test-principal' to GET the
'/containers' endpoint
I0619 22:52:02.181182 30776 slave.cpp:818] Agent terminating
[       OK ] Endpoint/SlaveEndpointTest.AuthorizedRequest/2 (28 ms)
[ RUN      ] Endpoint/SlaveEndpointTest.UnauthorizedRequest/0
I0619 22:52:02.192456 30773 containerizer.cpp:230] Using isolation: posix/cpu,posix/mem,filesystem/posix,network/cni,environment_secret
W0619 22:52:02.193265 30773 backend.cpp:76] Failed to create 'aufs' backend: AufsBackend requires
root privileges
W0619 22:52:02.193433 30773 backend.cpp:76] Failed to create 'bind' backend: BindBackend requires
root privileges
I0619 22:52:02.193480 30773 provisioner.cpp:255] Using default backend 'copy'
I0619 22:52:02.197160 30783 slave.cpp:249] Mesos agent started on (762)@172.17.0.3:43075
I0619 22:52:02.197207 30783 slave.cpp:250] Flags at startup: --acls="" --appc_simple_discovery_uri_prefix="http://"
--appc_store_dir="/tmp/Endpoint_SlaveEndpointTest_UnauthorizedRequest_0_GRuSLA/store/appc"
--authenticate_http_readonly="true" --authenticate_http_readwrite="true" --authenticatee="crammd5"
--authentication_backoff_factor="1secs" --authorizer="local" --cgroups_cpu_enable_pids_and_tids_count="false"
--cgroups_enable_cfs="false" --cgroups_hierarchy="/sys/fs/cgroup" --cgroups_limit_swap="false"
--cgroups_root="mesos" --container_disk_watch_interval="15secs" --containerizers="mesos" --credential="/tmp/Endpoint_SlaveEndpointTest_UnauthorizedRequest_0_GRuSLA/credential"
--default_role="*" --disk_watch_interval="1mins" --docker="docker" --docker_kill_orphans="true"
--docker_registry="https://registry-1.docker.io" --docker_remove_delay="6hrs" --docker_socket="/var/run/docker.sock"
--docker_stop_timeout="0ns" --docker_store_dir="/tmp/Endpoint_SlaveEndpointTest_UnauthorizedRequest_0_GRuSLA/store/docker"
--docker_volume_checkpoint_dir="/var/run/mesos/isolators/docker/volume" --enforce_container_disk_quota="false"
--executor_registration_timeout="1mins" --executor_reregistration_timeout="2secs" --executor_shutdown_grace_period="5secs"
--fetcher_cache_dir="/tmp/Endpoint_SlaveEndpointTest_UnauthorizedRequest_0_GRuSLA/fetch" --fetcher_cache_size="2GB"
--frameworks_home="" --gc_delay="1weeks" --gc_disk_headroom="0.1" --hadoop_home="" --help="false"
--hostname_lookup="true" --http_command_executor="false" --http_credentials="/tmp/Endpoint_SlaveEndpointTest_UnauthorizedRequest_0_GRuSLA/http_credentials"
--http_heartbeat_interval="30secs" --initialize_driver_logging="true" --isolation="posix/cpu,posix/mem"
--launcher="posix" --launcher_dir="/mesos/build/src" --logbufsecs="0" --logging_level="INFO"
--max_completed_executors_per_framework="150" --oversubscribed_resources_interval="15secs"
--perf_duration="10secs" --perf_interval="1mins" --port="5051" --qos_correction_interval_min="0ns"
--quiet="false" --recover="reconnect" --recovery_timeout="15mins" --registration_backoff_factor="10ms"
--resources="cpus:2;gpus:0;mem:1024;disk:1024;ports:[31000-32000]" --revocable_cpu_low_priority="true"
--runtime_dir="/tmp/Endpoint_SlaveEndpointTest_UnauthorizedRequest_0_GRuSLA" --sandbox_directory="/mnt/mesos/sandbox"
--strict="true" --switch_user="true" --systemd_enable_support="true" --systemd_runtime_directory="/run/systemd/system"
--version="false" --work_dir="/tmp/Endpoint_SlaveEndpointTest_UnauthorizedRequest_0_XKl49a"
I0619 22:52:02.197579 30783 credentials.hpp:86] Loading credential for authentication from
'/tmp/Endpoint_SlaveEndpointTest_UnauthorizedRequest_0_GRuSLA/credential'
I0619 22:52:02.197718 30783 slave.cpp:282] Agent using credential for: test-principal
I0619 22:52:02.197736 30783 credentials.hpp:37] Loading credentials for authentication from
'/tmp/Endpoint_SlaveEndpointTest_UnauthorizedRequest_0_GRuSLA/http_credentials'
I0619 22:52:02.197921 30783 http.cpp:1019] Creating default 'basic' HTTP authenticator for
realm 'mesos-agent-readonly'
I0619 22:52:02.198040 30783 http.cpp:1019] Creating default 'basic' HTTP authenticator for
realm 'mesos-agent-readwrite'
I0619 22:52:02.199218 30783 slave.cpp:553] Agent resources: cpus(*):2; mem(*):1024; disk(*):1024;
ports(*):[31000-32000]
I0619 22:52:02.199287 30783 slave.cpp:561] Agent attributes: [  ]
I0619 22:52:02.199296 30783 slave.cpp:566] Agent hostname: 8920c5b272a2
I0619 22:52:02.199424 30776 status_update_manager.cpp:177] Pausing sending status updates
I0619 22:52:02.200742 30793 state.cpp:62] Recovering state from '/tmp/Endpoint_SlaveEndpointTest_UnauthorizedRequest_0_XKl49a/meta'
I0619 22:52:02.201014 30777 status_update_manager.cpp:203] Recovering status update manager
I0619 22:52:02.201270 30784 containerizer.cpp:582] Recovering containerizer
I0619 22:52:02.202649 30778 provisioner.cpp:416] Provisioner recovery complete
I0619 22:52:02.203018 30776 slave.cpp:6128] Finished recovery
I0619 22:52:02.203645 30776 slave.cpp:6310] Querying resource estimator for oversubscribable
resources
I0619 22:52:02.203994 30794 slave.cpp:6324] Received oversubscribable resources {} from the
resource estimator
I0619 22:52:02.205855 30786 process.cpp:3779] Handling HTTP event for process 'slave(762)'
with path: '/slave(762)/monitor/statistics'
I0619 22:52:02.206971 30795 http.cpp:1159] HTTP GET for /slave(762)/monitor/statistics from
172.17.0.3:45482
I0619 22:52:02.207046 30795 http.cpp:980] Authorizing principal 'test-principal' to GET the
'/monitor/statistics' endpoint
I0619 22:52:02.210232 30776 slave.cpp:818] Agent terminating
[       OK ] Endpoint/SlaveEndpointTest.UnauthorizedRequest/0 (28 ms)
[ RUN      ] Endpoint/SlaveEndpointTest.UnauthorizedRequest/1
I0619 22:52:02.220068 30773 containerizer.cpp:230] Using isolation: posix/cpu,posix/mem,filesystem/posix,network/cni,environment_secret
W0619 22:52:02.220516 30773 backend.cpp:76] Failed to create 'aufs' backend: AufsBackend requires
root privileges
W0619 22:52:02.220603 30773 backend.cpp:76] Failed to create 'bind' backend: BindBackend requires
root privileges
I0619 22:52:02.220629 30773 provisioner.cpp:255] Using default backend 'copy'
I0619 22:52:02.223856 30795 slave.cpp:249] Mesos agent started on (763)@172.17.0.3:43075
I0619 22:52:02.223886 30795 slave.cpp:250] Flags at startup: --acls="" --appc_simple_discovery_uri_prefix="http://"
--appc_store_dir="/tmp/Endpoint_SlaveEndpointTest_UnauthorizedRequest_1_6LFkrf/store/appc"
--authenticate_http_readonly="true" --authenticate_http_readwrite="true" --authenticatee="crammd5"
--authentication_backoff_factor="1secs" --authorizer="local" --cgroups_cpu_enable_pids_and_tids_count="false"
--cgroups_enable_cfs="false" --cgroups_hierarchy="/sys/fs/cgroup" --cgroups_limit_swap="false"
--cgroups_root="mesos" --container_disk_watch_interval="15secs" --containerizers="mesos" --credential="/tmp/Endpoint_SlaveEndpointTest_UnauthorizedRequest_1_6LFkrf/credential"
--default_role="*" --disk_watch_interval="1mins" --docker="docker" --docker_kill_orphans="true"
--docker_registry="https://registry-1.docker.io" --docker_remove_delay="6hrs" --docker_socket="/var/run/docker.sock"
--docker_stop_timeout="0ns" --docker_store_dir="/tmp/Endpoint_SlaveEndpointTest_UnauthorizedRequest_1_6LFkrf/store/docker"
--docker_volume_checkpoint_dir="/var/run/mesos/isolators/docker/volume" --enforce_container_disk_quota="false"
--executor_registration_timeout="1mins" --executor_reregistration_timeout="2secs" --executor_shutdown_grace_period="5secs"
--fetcher_cache_dir="/tmp/Endpoint_SlaveEndpointTest_UnauthorizedRequest_1_6LFkrf/fetch" --fetcher_cache_size="2GB"
--frameworks_home="" --gc_delay="1weeks" --gc_disk_headroom="0.1" --hadoop_home="" --help="false"
--hostname_lookup="true" --http_command_executor="false" --http_credentials="/tmp/Endpoint_SlaveEndpointTest_UnauthorizedRequest_1_6LFkrf/http_credentials"
--http_heartbeat_interval="30secs" --initialize_driver_logging="true" --isolation="posix/cpu,posix/mem"
--launcher="posix" --launcher_dir="/mesos/build/src" --logbufsecs="0" --logging_level="INFO"
--max_completed_executors_per_framework="150" --oversubscribed_resources_interval="15secs"
--perf_duration="10secs" --perf_interval="1mins" --port="5051" --qos_correction_interval_min="0ns"
--quiet="false" --recover="reconnect" --recovery_timeout="15mins" --registration_backoff_factor="10ms"
--resources="cpus:2;gpus:0;mem:1024;disk:1024;ports:[31000-32000]" --revocable_cpu_low_priority="true"
--runtime_dir="/tmp/Endpoint_SlaveEndpointTest_UnauthorizedRequest_1_6LFkrf" --sandbox_directory="/mnt/mesos/sandbox"
--strict="true" --switch_user="true" --systemd_enable_support="true" --systemd_runtime_directory="/run/systemd/system"
--version="false" --work_dir="/tmp/Endpoint_SlaveEndpointTest_UnauthorizedRequest_1_jnUmLP"
I0619 22:52:02.224239 30795 credentials.hpp:86] Loading credential for authentication from
'/tmp/Endpoint_SlaveEndpointTest_UnauthorizedRequest_1_6LFkrf/credential'
I0619 22:52:02.224433 30795 slave.cpp:282] Agent using credential for: test-principal
I0619 22:52:02.224457 30795 credentials.hpp:37] Loading credentials for authentication from
'/tmp/Endpoint_SlaveEndpointTest_UnauthorizedRequest_1_6LFkrf/http_credentials'
I0619 22:52:02.224650 30795 http.cpp:1019] Creating default 'basic' HTTP authenticator for
realm 'mesos-agent-readonly'
I0619 22:52:02.224797 30795 http.cpp:1019] Creating default 'basic' HTTP authenticator for
realm 'mesos-agent-readwrite'
I0619 22:52:02.225965 30795 slave.cpp:553] Agent resources: cpus(*):2; mem(*):1024; disk(*):1024;
ports(*):[31000-32000]
I0619 22:52:02.226034 30795 slave.cpp:561] Agent attributes: [  ]
I0619 22:52:02.226044 30795 slave.cpp:566] Agent hostname: 8920c5b272a2
I0619 22:52:02.226178 30788 status_update_manager.cpp:177] Pausing sending status updates
I0619 22:52:02.227644 30787 state.cpp:62] Recovering state from '/tmp/Endpoint_SlaveEndpointTest_UnauthorizedRequest_1_jnUmLP/meta'
I0619 22:52:02.227941 30796 status_update_manager.cpp:203] Recovering status update manager
I0619 22:52:02.228153 30775 containerizer.cpp:582] Recovering containerizer
I0619 22:52:02.229583 30774 provisioner.cpp:416] Provisioner recovery complete
I0619 22:52:02.229951 30786 slave.cpp:6128] Finished recovery
I0619 22:52:02.230408 30786 slave.cpp:6310] Querying resource estimator for oversubscribable
resources
I0619 22:52:02.230607 30787 slave.cpp:6324] Received oversubscribable resources {} from the
resource estimator
I0619 22:52:02.232570 30775 process.cpp:3779] Handling HTTP event for process 'slave(763)'
with path: '/slave(763)/monitor/statistics.json'
I0619 22:52:02.233762 30774 http.cpp:1159] HTTP GET for /slave(763)/monitor/statistics.json
from 172.17.0.3:45484
I0619 22:52:02.233829 30774 http.cpp:980] Authorizing principal 'test-principal' to GET the
'/monitor/statistics.json' endpoint
I0619 22:52:02.236181 30796 slave.cpp:818] Agent terminating
[       OK ] Endpoint/SlaveEndpointTest.UnauthorizedRequest/1 (26 ms)
[ RUN      ] Endpoint/SlaveEndpointTest.UnauthorizedRequest/2
I0619 22:52:02.246877 30773 containerizer.cpp:230] Using isolation: posix/cpu,posix/mem,filesystem/posix,network/cni,environment_secret
W0619 22:52:02.247335 30773 backend.cpp:76] Failed to create 'aufs' backend: AufsBackend requires
root privileges
W0619 22:52:02.247428 30773 backend.cpp:76] Failed to create 'bind' backend: BindBackend requires
root privileges
I0619 22:52:02.247454 30773 provisioner.cpp:255] Using default backend 'copy'
I0619 22:52:02.251579 30791 slave.cpp:249] Mesos agent started on (764)@172.17.0.3:43075
I0619 22:52:02.251631 30791 slave.cpp:250] Flags at startup: --acls="" --appc_simple_discovery_uri_prefix="http://"
--appc_store_dir="/tmp/Endpoint_SlaveEndpointTest_UnauthorizedRequest_2_yIyHmU/store/appc"
--authenticate_http_readonly="true" --authenticate_http_readwrite="true" --authenticatee="crammd5"
--authentication_backoff_factor="1secs" --authorizer="local" --cgroups_cpu_enable_pids_and_tids_count="false"
--cgroups_enable_cfs="false" --cgroups_hierarchy="/sys/fs/cgroup" --cgroups_limit_swap="false"
--cgroups_root="mesos" --container_disk_watch_interval="15secs" --containerizers="mesos" --credential="/tmp/Endpoint_SlaveEndpointTest_UnauthorizedRequest_2_yIyHmU/credential"
--default_role="*" --disk_watch_interval="1mins" --docker="docker" --docker_kill_orphans="true"
--docker_registry="https://registry-1.docker.io" --docker_remove_delay="6hrs" --docker_socket="/var/run/docker.sock"
--docker_stop_timeout="0ns" --docker_store_dir="/tmp/Endpoint_SlaveEndpointTest_UnauthorizedRequest_2_yIyHmU/store/docker"
--docker_volume_checkpoint_dir="/var/run/mesos/isolators/docker/volume" --enforce_container_disk_quota="false"
--executor_registration_timeout="1mins" --executor_reregistration_timeout="2secs" --executor_shutdown_grace_period="5secs"
--fetcher_cache_dir="/tmp/Endpoint_SlaveEndpointTest_UnauthorizedRequest_2_yIyHmU/fetch" --fetcher_cache_size="2GB"
--frameworks_home="" --gc_delay="1weeks" --gc_disk_headroom="0.1" --hadoop_home="" --help="false"
--hostname_lookup="true" --http_command_executor="false" --http_credentials="/tmp/Endpoint_SlaveEndpointTest_UnauthorizedRequest_2_yIyHmU/http_credentials"
--http_heartbeat_interval="30secs" --initialize_driver_logging="true" --isolation="posix/cpu,posix/mem"
--launcher="posix" --launcher_dir="/mesos/build/src" --logbufsecs="0" --logging_level="INFO"
--max_completed_executors_per_framework="150" --oversubscribed_resources_interval="15secs"
--perf_duration="10secs" --perf_interval="1mins" --port="5051" --qos_correction_interval_min="0ns"
--quiet="false" --recover="reconnect" --recovery_timeout="15mins" --registration_backoff_factor="10ms"
--resources="cpus:2;gpus:0;mem:1024;disk:1024;ports:[31000-32000]" --revocable_cpu_low_priority="true"
--runtime_dir="/tmp/Endpoint_SlaveEndpointTest_UnauthorizedRequest_2_yIyHmU" --sandbox_directory="/mnt/mesos/sandbox"
--strict="true" --switch_user="true" --systemd_enable_support="true" --systemd_runtime_directory="/run/systemd/system"
--version="false" --work_dir="/tmp/Endpoint_SlaveEndpointTest_UnauthorizedRequest_2_7obLCu"
I0619 22:52:02.252169 30791 credentials.hpp:86] Loading credential for authentication from
'/tmp/Endpoint_SlaveEndpointTest_UnauthorizedRequest_2_yIyHmU/credential'
I0619 22:52:02.252285 30791 slave.cpp:282] Agent using credential for: test-principal
I0619 22:52:02.252300 30791 credentials.hpp:37] Loading credentials for authentication from
'/tmp/Endpoint_SlaveEndpointTest_UnauthorizedRequest_2_yIyHmU/http_credentials'
I0619 22:52:02.252477 30791 http.cpp:1019] Creating default 'basic' HTTP authenticator for
realm 'mesos-agent-readonly'
I0619 22:52:02.252617 30791 http.cpp:1019] Creating default 'basic' HTTP authenticator for
realm 'mesos-agent-readwrite'
I0619 22:52:02.253815 30791 slave.cpp:553] Agent resources: cpus(*):2; mem(*):1024; disk(*):1024;
ports(*):[31000-32000]
I0619 22:52:02.253883 30791 slave.cpp:561] Agent attributes: [  ]
I0619 22:52:02.253892 30791 slave.cpp:566] Agent hostname: 8920c5b272a2
I0619 22:52:02.254051 30782 status_update_manager.cpp:177] Pausing sending status updates
I0619 22:52:02.255347 30797 state.cpp:62] Recovering state from '/tmp/Endpoint_SlaveEndpointTest_UnauthorizedRequest_2_7obLCu/meta'
I0619 22:52:02.255609 30774 status_update_manager.cpp:203] Recovering status update manager
I0619 22:52:02.255875 30786 containerizer.cpp:582] Recovering containerizer
I0619 22:52:02.257119 30781 provisioner.cpp:416] Provisioner recovery complete
I0619 22:52:02.257508 30791 slave.cpp:6128] Finished recovery
I0619 22:52:02.257910 30791 slave.cpp:6310] Querying resource estimator for oversubscribable
resources
I0619 22:52:02.258147 30779 slave.cpp:6324] Received oversubscribable resources {} from the
resource estimator
I0619 22:52:02.260191 30782 process.cpp:3779] Handling HTTP event for process 'slave(764)'
with path: '/slave(764)/containers'
I0619 22:52:02.261365 30781 http.cpp:1159] HTTP GET for /slave(764)/containers from 172.17.0.3:45486
I0619 22:52:02.261421 30781 http.cpp:980] Authorizing principal 'test-principal' to GET the
'/containers' endpoint
I0619 22:52:02.263628 30790 slave.cpp:818] Agent terminating
[       OK ] Endpoint/SlaveEndpointTest.UnauthorizedRequest/2 (27 ms)
[ RUN      ] Endpoint/SlaveEndpointTest.NoAuthorizer/0
I0619 22:52:02.274555 30773 containerizer.cpp:230] Using isolation: posix/cpu,posix/mem,filesystem/posix,network/cni,environment_secret
W0619 22:52:02.274999 30773 backend.cpp:76] Failed to create 'aufs' backend: AufsBackend requires
root privileges
W0619 22:52:02.275085 30773 backend.cpp:76] Failed to create 'bind' backend: BindBackend requires
root privileges
I0619 22:52:02.275112 30773 provisioner.cpp:255] Using default backend 'copy'
I0619 22:52:02.277346 30773 cluster.cpp:448] Creating default 'local' authorizer
I0619 22:52:02.278997 30778 slave.cpp:249] Mesos agent started on (765)@172.17.0.3:43075
I0619 22:52:02.279037 30778 slave.cpp:250] Flags at startup: --acls="" --appc_simple_discovery_uri_prefix="http://"
--appc_store_dir="/tmp/Endpoint_SlaveEndpointTest_NoAuthorizer_0_4uOpyz/store/appc" --authenticate_http_readonly="true"
--authenticate_http_readwrite="true" --authenticatee="crammd5" --authentication_backoff_factor="1secs"
--authorizer="local" --cgroups_cpu_enable_pids_and_tids_count="false" --cgroups_enable_cfs="false"
--cgroups_hierarchy="/sys/fs/cgroup" --cgroups_limit_swap="false" --cgroups_root="mesos" --container_disk_watch_interval="15secs"
--containerizers="mesos" --credential="/tmp/Endpoint_SlaveEndpointTest_NoAuthorizer_0_4uOpyz/credential"
--default_role="*" --disk_watch_interval="1mins" --docker="docker" --docker_kill_orphans="true"
--docker_registry="https://registry-1.docker.io" --docker_remove_delay="6hrs" --docker_socket="/var/run/docker.sock"
--docker_stop_timeout="0ns" --docker_store_dir="/tmp/Endpoint_SlaveEndpointTest_NoAuthorizer_0_4uOpyz/store/docker"
--docker_volume_checkpoint_dir="/var/run/mesos/isolators/docker/volume" --enforce_container_disk_quota="false"
--executor_registration_timeout="1mins" --executor_reregistration_timeout="2secs" --executor_shutdown_grace_period="5secs"
--fetcher_cache_dir="/tmp/Endpoint_SlaveEndpointTest_NoAuthorizer_0_4uOpyz/fetch" --fetcher_cache_size="2GB"
--frameworks_home="" --gc_delay="1weeks" --gc_disk_headroom="0.1" --hadoop_home="" --help="false"
--hostname_lookup="true" --http_command_executor="false" --http_credentials="/tmp/Endpoint_SlaveEndpointTest_NoAuthorizer_0_4uOpyz/http_credentials"
--http_heartbeat_interval="30secs" --initialize_driver_logging="true" --isolation="posix/cpu,posix/mem"
--launcher="posix" --launcher_dir="/mesos/build/src" --logbufsecs="0" --logging_level="INFO"
--max_completed_executors_per_framework="150" --oversubscribed_resources_interval="15secs"
--perf_duration="10secs" --perf_interval="1mins" --port="5051" --qos_correction_interval_min="0ns"
--quiet="false" --recover="reconnect" --recovery_timeout="15mins" --registration_backoff_factor="10ms"
--resources="cpus:2;gpus:0;mem:1024;disk:1024;ports:[31000-32000]" --revocable_cpu_low_priority="true"
--runtime_dir="/tmp/Endpoint_SlaveEndpointTest_NoAuthorizer_0_4uOpyz" --sandbox_directory="/mnt/mesos/sandbox"
--strict="true" --switch_user="true" --systemd_enable_support="true" --systemd_runtime_directory="/run/systemd/system"
--version="false" --work_dir="/tmp/Endpoint_SlaveEndpointTest_NoAuthorizer_0_HAUoK9"
I0619 22:52:02.279381 30778 credentials.hpp:86] Loading credential for authentication from
'/tmp/Endpoint_SlaveEndpointTest_NoAuthorizer_0_4uOpyz/credential'
I0619 22:52:02.279510 30778 slave.cpp:282] Agent using credential for: test-principal
I0619 22:52:02.279553 30778 credentials.hpp:37] Loading credentials for authentication from
'/tmp/Endpoint_SlaveEndpointTest_NoAuthorizer_0_4uOpyz/http_credentials'
I0619 22:52:02.279769 30778 http.cpp:1019] Creating default 'basic' HTTP authenticator for
realm 'mesos-agent-readonly'
I0619 22:52:02.279925 30778 http.cpp:1019] Creating default 'basic' HTTP authenticator for
realm 'mesos-agent-readwrite'
I0619 22:52:02.281158 30778 slave.cpp:553] Agent resources: cpus(*):2; mem(*):1024; disk(*):1024;
ports(*):[31000-32000]
I0619 22:52:02.281231 30778 slave.cpp:561] Agent attributes: [  ]
I0619 22:52:02.281246 30778 slave.cpp:566] Agent hostname: 8920c5b272a2
I0619 22:52:02.281361 30777 status_update_manager.cpp:177] Pausing sending status updates
I0619 22:52:02.282866 30774 state.cpp:62] Recovering state from '/tmp/Endpoint_SlaveEndpointTest_NoAuthorizer_0_HAUoK9/meta'
I0619 22:52:02.283152 30776 status_update_manager.cpp:203] Recovering status update manager
I0619 22:52:02.283326 30775 containerizer.cpp:582] Recovering containerizer
I0619 22:52:02.284911 30777 provisioner.cpp:416] Provisioner recovery complete
I0619 22:52:02.285257 30788 slave.cpp:6128] Finished recovery
I0619 22:52:02.285698 30788 slave.cpp:6310] Querying resource estimator for oversubscribable
resources
I0619 22:52:02.285990 30797 slave.cpp:6324] Received oversubscribable resources {} from the
resource estimator
I0619 22:52:02.287720 30792 process.cpp:3779] Handling HTTP event for process 'slave(765)'
with path: '/slave(765)/monitor/statistics'
I0619 22:52:02.288806 30780 http.cpp:1159] HTTP GET for /slave(765)/monitor/statistics from
172.17.0.3:45488
I0619 22:52:02.288882 30780 http.cpp:980] Authorizing principal 'test-principal' to GET the
'/monitor/statistics' endpoint
I0619 22:52:02.292228 30795 slave.cpp:818] Agent terminating
[       OK ] Endpoint/SlaveEndpointTest.NoAuthorizer/0 (28 ms)
[ RUN      ] Endpoint/SlaveEndpointTest.NoAuthorizer/1
I0619 22:52:02.303146 30773 containerizer.cpp:230] Using isolation: posix/cpu,posix/mem,filesystem/posix,network/cni,environment_secret
W0619 22:52:02.303598 30773 backend.cpp:76] Failed to create 'aufs' backend: AufsBackend requires
root privileges
W0619 22:52:02.303688 30773 backend.cpp:76] Failed to create 'bind' backend: BindBackend requires
root privileges
I0619 22:52:02.303719 30773 provisioner.cpp:255] Using default backend 'copy'
I0619 22:52:02.305467 30773 cluster.cpp:448] Creating default 'local' authorizer
I0619 22:52:02.306941 30784 slave.cpp:249] Mesos agent started on (766)@172.17.0.3:43075
I0619 22:52:02.306972 30784 slave.cpp:250] Flags at startup: --acls="" --appc_simple_discovery_uri_prefix="http://"
--appc_store_dir="/tmp/Endpoint_SlaveEndpointTest_NoAuthorizer_1_yR610e/store/appc" --authenticate_http_readonly="true"
--authenticate_http_readwrite="true" --authenticatee="crammd5" --authentication_backoff_factor="1secs"
--authorizer="local" --cgroups_cpu_enable_pids_and_tids_count="false" --cgroups_enable_cfs="false"
--cgroups_hierarchy="/sys/fs/cgroup" --cgroups_limit_swap="false" --cgroups_root="mesos" --container_disk_watch_interval="15secs"
--containerizers="mesos" --credential="/tmp/Endpoint_SlaveEndpointTest_NoAuthorizer_1_yR610e/credential"
--default_role="*" --disk_watch_interval="1mins" --docker="docker" --docker_kill_orphans="true"
--docker_registry="https://registry-1.docker.io" --docker_remove_delay="6hrs" --docker_socket="/var/run/docker.sock"
--docker_stop_timeout="0ns" --docker_store_dir="/tmp/Endpoint_SlaveEndpointTest_NoAuthorizer_1_yR610e/store/docker"
--docker_volume_checkpoint_dir="/var/run/mesos/isolators/docker/volume" --enforce_container_disk_quota="false"
--executor_registration_timeout="1mins" --executor_reregistration_timeout="2secs" --executor_shutdown_grace_period="5secs"
--fetcher_cache_dir="/tmp/Endpoint_SlaveEndpointTest_NoAuthorizer_1_yR610e/fetch" --fetcher_cache_size="2GB"
--frameworks_home="" --gc_delay="1weeks" --gc_disk_headroom="0.1" --hadoop_home="" --help="false"
--hostname_lookup="true" --http_command_executor="false" --http_credentials="/tmp/Endpoint_SlaveEndpointTest_NoAuthorizer_1_yR610e/http_credentials"
--http_heartbeat_interval="30secs" --initialize_driver_logging="true" --isolation="posix/cpu,posix/mem"
--launcher="posix" --launcher_dir="/mesos/build/src" --logbufsecs="0" --logging_level="INFO"
--max_completed_executors_per_framework="150" --oversubscribed_resources_interval="15secs"
--perf_duration="10secs" --perf_interval="1mins" --port="5051" --qos_correction_interval_min="0ns"
--quiet="false" --recover="reconnect" --recovery_timeout="15mins" --registration_backoff_factor="10ms"
--resources="cpus:2;gpus:0;mem:1024;disk:1024;ports:[31000-32000]" --revocable_cpu_low_priority="true"
--runtime_dir="/tmp/Endpoint_SlaveEndpointTest_NoAuthorizer_1_yR610e" --sandbox_directory="/mnt/mesos/sandbox"
--strict="true" --switch_user="true" --systemd_enable_support="true" --systemd_runtime_directory="/run/systemd/system"
--version="false" --work_dir="/tmp/Endpoint_SlaveEndpointTest_NoAuthorizer_1_py9K8O"
I0619 22:52:02.307293 30784 credentials.hpp:86] Loading credential for authentication from
'/tmp/Endpoint_SlaveEndpointTest_NoAuthorizer_1_yR610e/credential'
I0619 22:52:02.307422 30784 slave.cpp:282] Agent using credential for: test-principal
I0619 22:52:02.307466 30784 credentials.hpp:37] Loading credentials for authentication from
'/tmp/Endpoint_SlaveEndpointTest_NoAuthorizer_1_yR610e/http_credentials'
I0619 22:52:02.307706 30784 http.cpp:1019] Creating default 'basic' HTTP authenticator for
realm 'mesos-agent-readonly'
I0619 22:52:02.307850 30784 http.cpp:1019] Creating default 'basic' HTTP authenticator for
realm 'mesos-agent-readwrite'
I0619 22:52:02.309063 30784 slave.cpp:553] Agent resources: cpus(*):2; mem(*):1024; disk(*):1024;
ports(*):[31000-32000]
I0619 22:52:02.309136 30784 slave.cpp:561] Agent attributes: [  ]
I0619 22:52:02.309150 30784 slave.cpp:566] Agent hostname: 8920c5b272a2
I0619 22:52:02.309258 30779 status_update_manager.cpp:177] Pausing sending status updates
I0619 22:52:02.310446 30786 state.cpp:62] Recovering state from '/tmp/Endpoint_SlaveEndpointTest_NoAuthorizer_1_py9K8O/meta'
I0619 22:52:02.310675 30790 status_update_manager.cpp:203] Recovering status update manager
I0619 22:52:02.310910 30793 containerizer.cpp:582] Recovering containerizer
I0619 22:52:02.312194 30776 provisioner.cpp:416] Provisioner recovery complete
I0619 22:52:02.312630 30784 slave.cpp:6128] Finished recovery
I0619 22:52:02.313094 30784 slave.cpp:6310] Querying resource estimator for oversubscribable
resources
I0619 22:52:02.313354 30778 slave.cpp:6324] Received oversubscribable resources {} from the
resource estimator
I0619 22:52:02.315161 30791 process.cpp:3779] Handling HTTP event for process 'slave(766)'
with path: '/slave(766)/monitor/statistics.json'
I0619 22:52:02.316217 30797 http.cpp:1159] HTTP GET for /slave(766)/monitor/statistics.json
from 172.17.0.3:45490
I0619 22:52:02.316280 30797 http.cpp:980] Authorizing principal 'test-principal' to GET the
'/monitor/statistics.json' endpoint
I0619 22:52:02.319399 30793 slave.cpp:818] Agent terminating
[       OK ] Endpoint/SlaveEndpointTest.NoAuthorizer/1 (26 ms)
[ RUN      ] Endpoint/SlaveEndpointTest.NoAuthorizer/2
I0619 22:52:02.329442 30773 containerizer.cpp:230] Using isolation: posix/cpu,posix/mem,filesystem/posix,network/cni,environment_secret
W0619 22:52:02.329885 30773 backend.cpp:76] Failed to create 'aufs' backend: AufsBackend requires
root privileges
W0619 22:52:02.329972 30773 backend.cpp:76] Failed to create 'bind' backend: BindBackend requires
root privileges
I0619 22:52:02.330006 30773 provisioner.cpp:255] Using default backend 'copy'
I0619 22:52:02.331651 30773 cluster.cpp:448] Creating default 'local' authorizer
I0619 22:52:02.333081 30797 slave.cpp:249] Mesos agent started on (767)@172.17.0.3:43075
I0619 22:52:02.333107 30797 slave.cpp:250] Flags at startup: --acls="" --appc_simple_discovery_uri_prefix="http://"
--appc_store_dir="/tmp/Endpoint_SlaveEndpointTest_NoAuthorizer_2_c6yxJU/store/appc" --authenticate_http_readonly="true"
--authenticate_http_readwrite="true" --authenticatee="crammd5" --authentication_backoff_factor="1secs"
--authorizer="local" --cgroups_cpu_enable_pids_and_tids_count="false" --cgroups_enable_cfs="false"
--cgroups_hierarchy="/sys/fs/cgroup" --cgroups_limit_swap="false" --cgroups_root="mesos" --container_disk_watch_interval="15secs"
--containerizers="mesos" --credential="/tmp/Endpoint_SlaveEndpointTest_NoAuthorizer_2_c6yxJU/credential"
--default_role="*" --disk_watch_interval="1mins" --docker="docker" --docker_kill_orphans="true"
--docker_registry="https://registry-1.docker.io" --docker_remove_delay="6hrs" --docker_socket="/var/run/docker.sock"
--docker_stop_timeout="0ns" --docker_store_dir="/tmp/Endpoint_SlaveEndpointTest_NoAuthorizer_2_c6yxJU/store/docker"
--docker_volume_checkpoint_dir="/var/run/mesos/isolators/docker/volume" --enforce_container_disk_quota="false"
--executor_registration_timeout="1mins" --executor_reregistration_timeout="2secs" --executor_shutdown_grace_period="5secs"
--fetcher_cache_dir="/tmp/Endpoint_SlaveEndpointTest_NoAuthorizer_2_c6yxJU/fetch" --fetcher_cache_size="2GB"
--frameworks_home="" --gc_delay="1weeks" --gc_disk_headroom="0.1" --hadoop_home="" --help="false"
--hostname_lookup="true" --http_command_executor="false" --http_credentials="/tmp/Endpoint_SlaveEndpointTest_NoAuthorizer_2_c6yxJU/http_credentials"
--http_heartbeat_interval="30secs" --initialize_driver_logging="true" --isolation="posix/cpu,posix/mem"
--launcher="posix" --launcher_dir="/mesos/build/src" --logbufsecs="0" --logging_level="INFO"
--max_completed_executors_per_framework="150" --oversubscribed_resources_interval="15secs"
--perf_duration="10secs" --perf_interval="1mins" --port="5051" --qos_correction_interval_min="0ns"
--quiet="false" --recover="reconnect" --recovery_timeout="15mins" --registration_backoff_factor="10ms"
--resources="cpus:2;gpus:0;mem:1024;disk:1024;ports:[31000-32000]" --revocable_cpu_low_priority="true"
--runtime_dir="/tmp/Endpoint_SlaveEndpointTest_NoAuthorizer_2_c6yxJU" --sandbox_directory="/mnt/mesos/sandbox"
--strict="true" --switch_user="true" --systemd_enable_support="true" --systemd_runtime_directory="/run/systemd/system"
--version="false" --work_dir="/tmp/Endpoint_SlaveEndpointTest_NoAuthorizer_2_d4BkNu"
I0619 22:52:02.333448 30797 credentials.hpp:86] Loading credential for authentication from
'/tmp/Endpoint_SlaveEndpointTest_NoAuthorizer_2_c6yxJU/credential'
I0619 22:52:02.333580 30797 slave.cpp:282] Agent using credential for: test-principal
I0619 22:52:02.333597 30797 credentials.hpp:37] Loading credentials for authentication from
'/tmp/Endpoint_SlaveEndpointTest_NoAuthorizer_2_c6yxJU/http_credentials'
I0619 22:52:02.333791 30797 http.cpp:1019] Creating default 'basic' HTTP authenticator for
realm 'mesos-agent-readonly'
I0619 22:52:02.333923 30797 http.cpp:1019] Creating default 'basic' HTTP authenticator for
realm 'mesos-agent-readwrite'
I0619 22:52:02.335150 30797 slave.cpp:553] Agent resources: cpus(*):2; mem(*):1024; disk(*):1024;
ports(*):[31000-32000]
I0619 22:52:02.335220 30797 slave.cpp:561] Agent attributes: [  ]
I0619 22:52:02.335229 30797 slave.cpp:566] Agent hostname: 8920c5b272a2
I0619 22:52:02.335332 30791 status_update_manager.cpp:177] Pausing sending status updates
I0619 22:52:02.336508 30779 state.cpp:62] Recovering state from '/tmp/Endpoint_SlaveEndpointTest_NoAuthorizer_2_d4BkNu/meta'
I0619 22:52:02.336722 30795 status_update_manager.cpp:203] Recovering status update manager
I0619 22:52:02.336927 30781 containerizer.cpp:582] Recovering containerizer
I0619 22:52:02.338268 30791 provisioner.cpp:416] Provisioner recovery complete
I0619 22:52:02.338620 30783 slave.cpp:6128] Finished recovery
I0619 22:52:02.339081 30783 slave.cpp:6310] Querying resource estimator for oversubscribable
resources
I0619 22:52:02.339339 30780 slave.cpp:6324] Received oversubscribable resources {} from the
resource estimator
I0619 22:52:02.341217 30780 process.cpp:3779] Handling HTTP event for process 'slave(767)'
with path: '/slave(767)/containers'
I0619 22:52:02.342200 30776 http.cpp:1159] HTTP GET for /slave(767)/containers from 172.17.0.3:45492
I0619 22:52:02.342262 30776 http.cpp:980] Authorizing principal 'test-principal' to GET the
'/containers' endpoint
I0619 22:52:02.345094 30782 slave.cpp:818] Agent terminating
[       OK ] Endpoint/SlaveEndpointTest.NoAuthorizer/2 (26 ms)
[----------] 9 tests from Endpoint/SlaveEndpointTest (249 ms total)

[----------] Global test environment tear-down
[==========] 1566 tests from 170 test cases ran. (282475 ms total)
[  PASSED  ] 1565 tests.
[  FAILED  ] 1 test, listed below:
[  FAILED  ] PersistentVolumeEndpointsTest.ReserveAndSlaveRemoval

 1 FAILED TEST
  YOU HAVE 20 DISABLED TESTS

E0619 22:52:02.406631 30798 process.cpp:968] Failed to accept socket: future discarded
make[3]: *** [CMakeFiles/check] Error 1
make[3]: Leaving directory `/mesos/build'
make[2]: *** [CMakeFiles/check.dir/all] Error 2
make[2]: Leaving directory `/mesos/build'
make[1]: *** [CMakeFiles/check.dir/rule] Error 2
make[1]: Leaving directory `/mesos/build'
make: *** [check] Error 2
+ docker rmi mesos-1497910800-1388
Untagged: mesos-1497910800-1388:latest
Deleted: sha256:4bf89f13e03ae232ea1e02e3bacccd4505ff6cd3b38b55448f50581c3bfd3bf7
Deleted: sha256:9f230d5a20acc0024f13a5738a8cea66819c183ca1e7b05def3189e58a5edd35
Deleted: sha256:a555547e5d487815d4d088d279af6e45f4035f4e0636b9537453148b773a2faa
Deleted: sha256:da76a207386038ddf69194396d97a60e71fac87c5617b347ec1a2df36b5478b2
Deleted: sha256:f33d6d999c630732558f375ab61e6d89e108b02e9be1b50cd0aea9bd1ac94155
Deleted: sha256:2b6fdaaf084a16e6ac8a91605c3578298ce8c1bb1ae1c74bc89c56a3074c5aa9
Deleted: sha256:3fd07ea0c9ffddd4f39170811f4fb579563aafd252b6b5bc55d82397f5f4387d
Deleted: sha256:50763f89f0fd686fde88ed8815eee3a37127a4d1aeb30939fa6384f18815d1fa
Deleted: sha256:52b8bd97d97291aa96c81f92bd731d1745eda48bd84c4ffedb0d3e021521a753
Deleted: sha256:0e4c4be714db8a6f41420e583e6bc5c514907977c3d01a5e72245f68c7e75aed
Deleted: sha256:7aba6d8324105bc6469ee405cd6a091bc205c9157806c01d41527d5f9fcd126b
Deleted: sha256:a982484e369531885b261584dc6f56d5f16a7fdacf5275fb123cd6eed1e3d1e4
Deleted: sha256:fc9fa2500510dc0196bab03d5f6b620a01a397f9c4e79e95289e466c03a4b4d8
Deleted: sha256:7d213c80d032abbedb6f053f016099b267360ae968f30ff1d62a42f6a893a529
Deleted: sha256:3213239fbe21deb7a603fec5108bfc3b36a9af2a46dc9f3f9a28d674719c4ea0
Deleted: sha256:3c7f583c128d5dcacb5c1b84711ceb7b96340c69f28bf6e0968ced058a503a38
Deleted: sha256:7d5446e4c5d068b08a9f5a96cfd71f3377dea64d234f6afbae9d7caeef1746a4
Deleted: sha256:8e2cf52fe1c8859d4f40cb946e634253943cbd453f6e3d3e796ed7353ccc40ad
Deleted: sha256:b28e8fabc00bad41232e6b7ffd04b76e4d58a97f1e5630904b9fd241a43acb7a
Deleted: sha256:8ef79e94e1d97af524ac11815f6e771648d44976383ed9f8fd408c4a289afa1d
Deleted: sha256:e483c18eb319e0cd04681559aba50e039c4d3d2539d1a17f1b8783aecf380f46
Deleted: sha256:e631748c2a26dbf491bf625a0cfe1bc71c331b7dec96b176fa573da68b818a1a
Deleted: sha256:f2fe6f2c1aaba3e081140d112ede994fb79dd68b72592f4e55e3e07d16882514
Deleted: sha256:07515c234ba1d63bd76761dd985fbad3538096fcad122ddc2b354ab19988c81d
Build step 'Execute shell' marked build as failure
Not sending mail to unregistered user yujie.jay@gmail.com

Mime
View raw message