mesos-builds mailing list archives

Site index · List index
Message view « Date » · « Thread »
Top « Date » · « Thread »
From Apache Jenkins Server <jenk...@builds.apache.org>
Subject Build failed in Jenkins: Mesos-Reviewbot #18367
Date Tue, 13 Jun 2017 17:45:38 GMT
See <https://builds.apache.org/job/Mesos-Reviewbot/18367/display/redirect>

------------------------------------------
[...truncated 28.20 MB...]
I0613 17:45:31.544468  4612 http.cpp:975] Creating default 'basic' HTTP authenticator for
realm 'mesos-agent-readonly'
I0613 17:45:31.544735  4612 http.cpp:975] Creating default 'basic' HTTP authenticator for
realm 'mesos-agent-readwrite'
I0613 17:45:31.546994  4612 slave.cpp:552] Agent resources: cpus(*):2; mem(*):1024; disk(*):1024;
ports(*):[31000-32000]
I0613 17:45:31.547134  4612 slave.cpp:560] Agent attributes: [  ]
I0613 17:45:31.547154  4612 slave.cpp:565] Agent hostname: e7c415e0f33b
I0613 17:45:31.547543  4616 status_update_manager.cpp:177] Pausing sending status updates
I0613 17:45:31.550223  4612 state.cpp:62] Recovering state from '/tmp/Endpoint_SlaveEndpointTest_AuthorizedRequest_2_kL49FQ/meta'
I0613 17:45:31.550763  4617 status_update_manager.cpp:203] Recovering status update manager
I0613 17:45:31.551168  4616 containerizer.cpp:582] Recovering containerizer
I0613 17:45:31.553457  4618 provisioner.cpp:416] Provisioner recovery complete
I0613 17:45:31.554211  4616 slave.cpp:6127] Finished recovery
I0613 17:45:31.555152  4616 slave.cpp:6309] Querying resource estimator for oversubscribable
resources
I0613 17:45:31.555778  4616 slave.cpp:6323] Received oversubscribable resources {} from the
resource estimator
I0613 17:45:31.560307  4611 process.cpp:3778] Handling HTTP event for process 'slave(756)'
with path: '/slave(756)/containers'
I0613 17:45:31.562649  4611 http.cpp:1115] HTTP GET for /slave(756)/containers from 172.17.0.2:33382
I0613 17:45:31.562769  4611 http.cpp:936] Authorizing principal 'test-principal' to GET the
'/containers' endpoint
I0613 17:45:31.570392  4611 slave.cpp:817] Agent terminating
[       OK ] Endpoint/SlaveEndpointTest.AuthorizedRequest/2 (50 ms)
[ RUN      ] Endpoint/SlaveEndpointTest.UnauthorizedRequest/0
I0613 17:45:31.585431  4592 containerizer.cpp:230] Using isolation: posix/cpu,posix/mem,filesystem/posix,network/cni,environment_secret
W0613 17:45:31.586477  4592 backend.cpp:76] Failed to create 'overlay' backend: OverlayBackend
requires root privileges
W0613 17:45:31.586860  4592 backend.cpp:76] Failed to create 'bind' backend: BindBackend requires
root privileges
I0613 17:45:31.586920  4592 provisioner.cpp:255] Using default backend 'copy'
I0613 17:45:31.592378  4611 slave.cpp:248] Mesos agent started on (757)@172.17.0.2:44671
I0613 17:45:31.592416  4611 slave.cpp:249] Flags at startup: --acls="" --appc_simple_discovery_uri_prefix="http://"
--appc_store_dir="/tmp/Endpoint_SlaveEndpointTest_UnauthorizedRequest_0_CMydJO/store/appc"
--authenticate_http_readonly="true" --authenticate_http_readwrite="true" --authenticatee="crammd5"
--authentication_backoff_factor="1secs" --authorizer="local" --cgroups_cpu_enable_pids_and_tids_count="false"
--cgroups_enable_cfs="false" --cgroups_hierarchy="/sys/fs/cgroup" --cgroups_limit_swap="false"
--cgroups_root="mesos" --container_disk_watch_interval="15secs" --containerizers="mesos" --credential="/tmp/Endpoint_SlaveEndpointTest_UnauthorizedRequest_0_CMydJO/credential"
--default_role="*" --disk_watch_interval="1mins" --docker="docker" --docker_kill_orphans="true"
--docker_registry="https://registry-1.docker.io" --docker_remove_delay="6hrs" --docker_socket="/var/run/docker.sock"
--docker_stop_timeout="0ns" --docker_store_dir="/tmp/Endpoint_SlaveEndpointTest_UnauthorizedRequest_0_CMydJO/store/docker"
--docker_volume_checkpoint_dir="/var/run/mesos/isolators/docker/volume" --enforce_container_disk_quota="false"
--executor_registration_timeout="1mins" --executor_reregistration_timeout="2secs" --executor_shutdown_grace_period="5secs"
--fetcher_cache_dir="/tmp/Endpoint_SlaveEndpointTest_UnauthorizedRequest_0_CMydJO/fetch" --fetcher_cache_size="2GB"
--frameworks_home="" --gc_delay="1weeks" --gc_disk_headroom="0.1" --hadoop_home="" --help="false"
--hostname_lookup="true" --http_command_executor="false" --http_credentials="/tmp/Endpoint_SlaveEndpointTest_UnauthorizedRequest_0_CMydJO/http_credentials"
--http_heartbeat_interval="30secs" --initialize_driver_logging="true" --isolation="posix/cpu,posix/mem"
--launcher="posix" --launcher_dir="/mesos/mesos-1.4.0/_build/src" --logbufsecs="0" --logging_level="INFO"
--max_completed_executors_per_framework="150" --oversubscribed_resources_interval="15secs"
--perf_duration="10secs" --perf_interval="1mins" --port="5051" --qos_correction_interval_min="0ns"
--quiet="false" --recover="reconnect" --recovery_timeout="15mins" --registration_backoff_factor="10ms"
--resources="cpus:2;gpus:0;mem:1024;disk:1024;ports:[31000-32000]" --revocable_cpu_low_priority="true"
--runtime_dir="/tmp/Endpoint_SlaveEndpointTest_UnauthorizedRequest_0_CMydJO" --sandbox_directory="/mnt/mesos/sandbox"
--strict="true" --switch_user="true" --systemd_enable_support="true" --systemd_runtime_directory="/run/systemd/system"
--version="false" --work_dir="/tmp/Endpoint_SlaveEndpointTest_UnauthorizedRequest_0_qiiCt1"
I0613 17:45:31.593119  4611 credentials.hpp:86] Loading credential for authentication from
'/tmp/Endpoint_SlaveEndpointTest_UnauthorizedRequest_0_CMydJO/credential'
I0613 17:45:31.593575  4611 slave.cpp:281] Agent using credential for: test-principal
I0613 17:45:31.593621  4611 credentials.hpp:37] Loading credentials for authentication from
'/tmp/Endpoint_SlaveEndpointTest_UnauthorizedRequest_0_CMydJO/http_credentials'
I0613 17:45:31.594030  4611 http.cpp:975] Creating default 'basic' HTTP authenticator for
realm 'mesos-agent-readonly'
I0613 17:45:31.594334  4611 http.cpp:975] Creating default 'basic' HTTP authenticator for
realm 'mesos-agent-readwrite'
I0613 17:45:31.596433  4611 slave.cpp:552] Agent resources: cpus(*):2; mem(*):1024; disk(*):1024;
ports(*):[31000-32000]
I0613 17:45:31.596568  4611 slave.cpp:560] Agent attributes: [  ]
I0613 17:45:31.596590  4611 slave.cpp:565] Agent hostname: e7c415e0f33b
I0613 17:45:31.597002  4617 status_update_manager.cpp:177] Pausing sending status updates
I0613 17:45:31.599031  4618 state.cpp:62] Recovering state from '/tmp/Endpoint_SlaveEndpointTest_UnauthorizedRequest_0_qiiCt1/meta'
I0613 17:45:31.599578  4616 status_update_manager.cpp:203] Recovering status update manager
I0613 17:45:31.600020  4616 containerizer.cpp:582] Recovering containerizer
I0613 17:45:31.602320  4618 provisioner.cpp:416] Provisioner recovery complete
I0613 17:45:31.603442  4616 slave.cpp:6127] Finished recovery
I0613 17:45:31.604579  4616 slave.cpp:6309] Querying resource estimator for oversubscribable
resources
I0613 17:45:31.605351  4618 slave.cpp:6323] Received oversubscribable resources {} from the
resource estimator
I0613 17:45:31.609601  4615 process.cpp:3778] Handling HTTP event for process 'slave(757)'
with path: '/slave(757)/monitor/statistics'
I0613 17:45:31.611948  4615 http.cpp:1115] HTTP GET for /slave(757)/monitor/statistics from
172.17.0.2:33384
I0613 17:45:31.612062  4615 http.cpp:936] Authorizing principal 'test-principal' to GET the
'/monitor/statistics' endpoint
I0613 17:45:31.615738  4614 slave.cpp:817] Agent terminating
[       OK ] Endpoint/SlaveEndpointTest.UnauthorizedRequest/0 (45 ms)
[ RUN      ] Endpoint/SlaveEndpointTest.UnauthorizedRequest/1
I0613 17:45:31.631100  4592 containerizer.cpp:230] Using isolation: posix/cpu,posix/mem,filesystem/posix,network/cni,environment_secret
W0613 17:45:31.632148  4592 backend.cpp:76] Failed to create 'overlay' backend: OverlayBackend
requires root privileges
W0613 17:45:31.632334  4592 backend.cpp:76] Failed to create 'bind' backend: BindBackend requires
root privileges
I0613 17:45:31.632717  4592 provisioner.cpp:255] Using default backend 'copy'
I0613 17:45:31.639197  4613 slave.cpp:248] Mesos agent started on (758)@172.17.0.2:44671
I0613 17:45:31.639492  4613 slave.cpp:249] Flags at startup: --acls="" --appc_simple_discovery_uri_prefix="http://"
--appc_store_dir="/tmp/Endpoint_SlaveEndpointTest_UnauthorizedRequest_1_0ky28Z/store/appc"
--authenticate_http_readonly="true" --authenticate_http_readwrite="true" --authenticatee="crammd5"
--authentication_backoff_factor="1secs" --authorizer="local" --cgroups_cpu_enable_pids_and_tids_count="false"
--cgroups_enable_cfs="false" --cgroups_hierarchy="/sys/fs/cgroup" --cgroups_limit_swap="false"
--cgroups_root="mesos" --container_disk_watch_interval="15secs" --containerizers="mesos" --credential="/tmp/Endpoint_SlaveEndpointTest_UnauthorizedRequest_1_0ky28Z/credential"
--default_role="*" --disk_watch_interval="1mins" --docker="docker" --docker_kill_orphans="true"
--docker_registry="https://registry-1.docker.io" --docker_remove_delay="6hrs" --docker_socket="/var/run/docker.sock"
--docker_stop_timeout="0ns" --docker_store_dir="/tmp/Endpoint_SlaveEndpointTest_UnauthorizedRequest_1_0ky28Z/store/docker"
--docker_volume_checkpoint_dir="/var/run/mesos/isolators/docker/volume" --enforce_container_disk_quota="false"
--executor_registration_timeout="1mins" --executor_reregistration_timeout="2secs" --executor_shutdown_grace_period="5secs"
--fetcher_cache_dir="/tmp/Endpoint_SlaveEndpointTest_UnauthorizedRequest_1_0ky28Z/fetch" --fetcher_cache_size="2GB"
--frameworks_home="" --gc_delay="1weeks" --gc_disk_headroom="0.1" --hadoop_home="" --help="false"
--hostname_lookup="true" --http_command_executor="false" --http_credentials="/tmp/Endpoint_SlaveEndpointTest_UnauthorizedRequest_1_0ky28Z/http_credentials"
--http_heartbeat_interval="30secs" --initialize_driver_logging="true" --isolation="posix/cpu,posix/mem"
--launcher="posix" --launcher_dir="/mesos/mesos-1.4.0/_build/src" --logbufsecs="0" --logging_level="INFO"
--max_completed_executors_per_framework="150" --oversubscribed_resources_interval="15secs"
--perf_duration="10secs" --perf_interval="1mins" --port="5051" --qos_correction_interval_min="0ns"
--quiet="false" --recover="reconnect" --recovery_timeout="15mins" --registration_backoff_factor="10ms"
--resources="cpus:2;gpus:0;mem:1024;disk:1024;ports:[31000-32000]" --revocable_cpu_low_priority="true"
--runtime_dir="/tmp/Endpoint_SlaveEndpointTest_UnauthorizedRequest_1_0ky28Z" --sandbox_directory="/mnt/mesos/sandbox"
--strict="true" --switch_user="true" --systemd_enable_support="true" --systemd_runtime_directory="/run/systemd/system"
--version="false" --work_dir="/tmp/Endpoint_SlaveEndpointTest_UnauthorizedRequest_1_A7b2Lc"
I0613 17:45:31.640333  4613 credentials.hpp:86] Loading credential for authentication from
'/tmp/Endpoint_SlaveEndpointTest_UnauthorizedRequest_1_0ky28Z/credential'
I0613 17:45:31.640640  4613 slave.cpp:281] Agent using credential for: test-principal
I0613 17:45:31.640743  4613 credentials.hpp:37] Loading credentials for authentication from
'/tmp/Endpoint_SlaveEndpointTest_UnauthorizedRequest_1_0ky28Z/http_credentials'
I0613 17:45:31.641223  4613 http.cpp:975] Creating default 'basic' HTTP authenticator for
realm 'mesos-agent-readonly'
I0613 17:45:31.641578  4613 http.cpp:975] Creating default 'basic' HTTP authenticator for
realm 'mesos-agent-readwrite'
I0613 17:45:31.643708  4613 slave.cpp:552] Agent resources: cpus(*):2; mem(*):1024; disk(*):1024;
ports(*):[31000-32000]
I0613 17:45:31.643976  4613 slave.cpp:560] Agent attributes: [  ]
I0613 17:45:31.644052  4613 slave.cpp:565] Agent hostname: e7c415e0f33b
I0613 17:45:31.644589  4617 status_update_manager.cpp:177] Pausing sending status updates
I0613 17:45:31.646477  4612 state.cpp:62] Recovering state from '/tmp/Endpoint_SlaveEndpointTest_UnauthorizedRequest_1_A7b2Lc/meta'
I0613 17:45:31.647140  4617 status_update_manager.cpp:203] Recovering status update manager
I0613 17:45:31.648138  4618 containerizer.cpp:582] Recovering containerizer
I0613 17:45:31.650524  4618 provisioner.cpp:416] Provisioner recovery complete
I0613 17:45:31.651057  4615 slave.cpp:6127] Finished recovery
I0613 17:45:31.651674  4615 slave.cpp:6309] Querying resource estimator for oversubscribable
resources
I0613 17:45:31.652276  4615 slave.cpp:6323] Received oversubscribable resources {} from the
resource estimator
I0613 17:45:31.656532  4612 process.cpp:3778] Handling HTTP event for process 'slave(758)'
with path: '/slave(758)/monitor/statistics.json'
I0613 17:45:31.658972  4612 http.cpp:1115] HTTP GET for /slave(758)/monitor/statistics.json
from 172.17.0.2:33386
I0613 17:45:31.659090  4612 http.cpp:936] Authorizing principal 'test-principal' to GET the
'/monitor/statistics.json' endpoint
I0613 17:45:31.663311  4611 slave.cpp:817] Agent terminating
[       OK ] Endpoint/SlaveEndpointTest.UnauthorizedRequest/1 (47 ms)
[ RUN      ] Endpoint/SlaveEndpointTest.UnauthorizedRequest/2
I0613 17:45:31.678578  4592 containerizer.cpp:230] Using isolation: posix/cpu,posix/mem,filesystem/posix,network/cni,environment_secret
W0613 17:45:31.679600  4592 backend.cpp:76] Failed to create 'overlay' backend: OverlayBackend
requires root privileges
W0613 17:45:31.679966  4592 backend.cpp:76] Failed to create 'bind' backend: BindBackend requires
root privileges
I0613 17:45:31.680022  4592 provisioner.cpp:255] Using default backend 'copy'
I0613 17:45:31.686566  4616 slave.cpp:248] Mesos agent started on (759)@172.17.0.2:44671
I0613 17:45:31.686718  4616 slave.cpp:249] Flags at startup: --acls="" --appc_simple_discovery_uri_prefix="http://"
--appc_store_dir="/tmp/Endpoint_SlaveEndpointTest_UnauthorizedRequest_2_WG2y3b/store/appc"
--authenticate_http_readonly="true" --authenticate_http_readwrite="true" --authenticatee="crammd5"
--authentication_backoff_factor="1secs" --authorizer="local" --cgroups_cpu_enable_pids_and_tids_count="false"
--cgroups_enable_cfs="false" --cgroups_hierarchy="/sys/fs/cgroup" --cgroups_limit_swap="false"
--cgroups_root="mesos" --container_disk_watch_interval="15secs" --containerizers="mesos" --credential="/tmp/Endpoint_SlaveEndpointTest_UnauthorizedRequest_2_WG2y3b/credential"
--default_role="*" --disk_watch_interval="1mins" --docker="docker" --docker_kill_orphans="true"
--docker_registry="https://registry-1.docker.io" --docker_remove_delay="6hrs" --docker_socket="/var/run/docker.sock"
--docker_stop_timeout="0ns" --docker_store_dir="/tmp/Endpoint_SlaveEndpointTest_UnauthorizedRequest_2_WG2y3b/store/docker"
--docker_volume_checkpoint_dir="/var/run/mesos/isolators/docker/volume" --enforce_container_disk_quota="false"
--executor_registration_timeout="1mins" --executor_reregistration_timeout="2secs" --executor_shutdown_grace_period="5secs"
--fetcher_cache_dir="/tmp/Endpoint_SlaveEndpointTest_UnauthorizedRequest_2_WG2y3b/fetch" --fetcher_cache_size="2GB"
--frameworks_home="" --gc_delay="1weeks" --gc_disk_headroom="0.1" --hadoop_home="" --help="false"
--hostname_lookup="true" --http_command_executor="false" --http_credentials="/tmp/Endpoint_SlaveEndpointTest_UnauthorizedRequest_2_WG2y3b/http_credentials"
--http_heartbeat_interval="30secs" --initialize_driver_logging="true" --isolation="posix/cpu,posix/mem"
--launcher="posix" --launcher_dir="/mesos/mesos-1.4.0/_build/src" --logbufsecs="0" --logging_level="INFO"
--max_completed_executors_per_framework="150" --oversubscribed_resources_interval="15secs"
--perf_duration="10secs" --perf_interval="1mins" --port="5051" --qos_correction_interval_min="0ns"
--quiet="false" --recover="reconnect" --recovery_timeout="15mins" --registration_backoff_factor="10ms"
--resources="cpus:2;gpus:0;mem:1024;disk:1024;ports:[31000-32000]" --revocable_cpu_low_priority="true"
--runtime_dir="/tmp/Endpoint_SlaveEndpointTest_UnauthorizedRequest_2_WG2y3b" --sandbox_directory="/mnt/mesos/sandbox"
--strict="true" --switch_user="true" --systemd_enable_support="true" --systemd_runtime_directory="/run/systemd/system"
--version="false" --work_dir="/tmp/Endpoint_SlaveEndpointTest_UnauthorizedRequest_2_uefSyo"
I0613 17:45:31.687506  4616 credentials.hpp:86] Loading credential for authentication from
'/tmp/Endpoint_SlaveEndpointTest_UnauthorizedRequest_2_WG2y3b/credential'
I0613 17:45:31.687824  4616 slave.cpp:281] Agent using credential for: test-principal
I0613 17:45:31.687934  4616 credentials.hpp:37] Loading credentials for authentication from
'/tmp/Endpoint_SlaveEndpointTest_UnauthorizedRequest_2_WG2y3b/http_credentials'
I0613 17:45:31.688441  4616 http.cpp:975] Creating default 'basic' HTTP authenticator for
realm 'mesos-agent-readonly'
I0613 17:45:31.688769  4616 http.cpp:975] Creating default 'basic' HTTP authenticator for
realm 'mesos-agent-readwrite'
I0613 17:45:31.691120  4616 slave.cpp:552] Agent resources: cpus(*):2; mem(*):1024; disk(*):1024;
ports(*):[31000-32000]
I0613 17:45:31.691354  4616 slave.cpp:560] Agent attributes: [  ]
I0613 17:45:31.691426  4616 slave.cpp:565] Agent hostname: e7c415e0f33b
I0613 17:45:31.691766  4617 status_update_manager.cpp:177] Pausing sending status updates
I0613 17:45:31.693717  4615 state.cpp:62] Recovering state from '/tmp/Endpoint_SlaveEndpointTest_UnauthorizedRequest_2_uefSyo/meta'
I0613 17:45:31.694422  4618 status_update_manager.cpp:203] Recovering status update manager
I0613 17:45:31.694715  4611 containerizer.cpp:582] Recovering containerizer
I0613 17:45:31.696882  4611 provisioner.cpp:416] Provisioner recovery complete
I0613 17:45:31.697649  4618 slave.cpp:6127] Finished recovery
I0613 17:45:31.698458  4618 slave.cpp:6309] Querying resource estimator for oversubscribable
resources
I0613 17:45:31.698812  4614 slave.cpp:6323] Received oversubscribable resources {} from the
resource estimator
I0613 17:45:31.703274  4614 process.cpp:3778] Handling HTTP event for process 'slave(759)'
with path: '/slave(759)/containers'
I0613 17:45:31.705402  4614 http.cpp:1115] HTTP GET for /slave(759)/containers from 172.17.0.2:33388
I0613 17:45:31.705523  4614 http.cpp:936] Authorizing principal 'test-principal' to GET the
'/containers' endpoint
I0613 17:45:31.709843  4592 slave.cpp:817] Agent terminating
[       OK ] Endpoint/SlaveEndpointTest.UnauthorizedRequest/2 (47 ms)
[ RUN      ] Endpoint/SlaveEndpointTest.NoAuthorizer/0
I0613 17:45:31.725672  4592 containerizer.cpp:230] Using isolation: posix/cpu,posix/mem,filesystem/posix,network/cni,environment_secret
W0613 17:45:31.726689  4592 backend.cpp:76] Failed to create 'overlay' backend: OverlayBackend
requires root privileges
W0613 17:45:31.727067  4592 backend.cpp:76] Failed to create 'bind' backend: BindBackend requires
root privileges
I0613 17:45:31.727128  4592 provisioner.cpp:255] Using default backend 'copy'
I0613 17:45:31.729856  4592 cluster.cpp:448] Creating default 'local' authorizer
I0613 17:45:31.733942  4615 slave.cpp:248] Mesos agent started on (760)@172.17.0.2:44671
I0613 17:45:31.733989  4615 slave.cpp:249] Flags at startup: --acls="" --appc_simple_discovery_uri_prefix="http://"
--appc_store_dir="/tmp/Endpoint_SlaveEndpointTest_NoAuthorizer_0_URsoso/store/appc" --authenticate_http_readonly="true"
--authenticate_http_readwrite="true" --authenticatee="crammd5" --authentication_backoff_factor="1secs"
--authorizer="local" --cgroups_cpu_enable_pids_and_tids_count="false" --cgroups_enable_cfs="false"
--cgroups_hierarchy="/sys/fs/cgroup" --cgroups_limit_swap="false" --cgroups_root="mesos" --container_disk_watch_interval="15secs"
--containerizers="mesos" --credential="/tmp/Endpoint_SlaveEndpointTest_NoAuthorizer_0_URsoso/credential"
--default_role="*" --disk_watch_interval="1mins" --docker="docker" --docker_kill_orphans="true"
--docker_registry="https://registry-1.docker.io" --docker_remove_delay="6hrs" --docker_socket="/var/run/docker.sock"
--docker_stop_timeout="0ns" --docker_store_dir="/tmp/Endpoint_SlaveEndpointTest_NoAuthorizer_0_URsoso/store/docker"
--docker_volume_checkpoint_dir="/var/run/mesos/isolators/docker/volume" --enforce_container_disk_quota="false"
--executor_registration_timeout="1mins" --executor_reregistration_timeout="2secs" --executor_shutdown_grace_period="5secs"
--fetcher_cache_dir="/tmp/Endpoint_SlaveEndpointTest_NoAuthorizer_0_URsoso/fetch" --fetcher_cache_size="2GB"
--frameworks_home="" --gc_delay="1weeks" --gc_disk_headroom="0.1" --hadoop_home="" --help="false"
--hostname_lookup="true" --http_command_executor="false" --http_credentials="/tmp/Endpoint_SlaveEndpointTest_NoAuthorizer_0_URsoso/http_credentials"
--http_heartbeat_interval="30secs" --initialize_driver_logging="true" --isolation="posix/cpu,posix/mem"
--launcher="posix" --launcher_dir="/mesos/mesos-1.4.0/_build/src" --logbufsecs="0" --logging_level="INFO"
--max_completed_executors_per_framework="150" --oversubscribed_resources_interval="15secs"
--perf_duration="10secs" --perf_interval="1mins" --port="5051" --qos_correction_interval_min="0ns"
--quiet="false" --recover="reconnect" --recovery_timeout="15mins" --registration_backoff_factor="10ms"
--resources="cpus:2;gpus:0;mem:1024;disk:1024;ports:[31000-32000]" --revocable_cpu_low_priority="true"
--runtime_dir="/tmp/Endpoint_SlaveEndpointTest_NoAuthorizer_0_URsoso" --sandbox_directory="/mnt/mesos/sandbox"
--strict="true" --switch_user="true" --systemd_enable_support="true" --systemd_runtime_directory="/run/systemd/system"
--version="false" --work_dir="/tmp/Endpoint_SlaveEndpointTest_NoAuthorizer_0_y8o8PA"
I0613 17:45:31.734699  4615 credentials.hpp:86] Loading credential for authentication from
'/tmp/Endpoint_SlaveEndpointTest_NoAuthorizer_0_URsoso/credential'
I0613 17:45:31.735150  4615 slave.cpp:281] Agent using credential for: test-principal
I0613 17:45:31.735180  4615 credentials.hpp:37] Loading credentials for authentication from
'/tmp/Endpoint_SlaveEndpointTest_NoAuthorizer_0_URsoso/http_credentials'
I0613 17:45:31.735560  4615 http.cpp:975] Creating default 'basic' HTTP authenticator for
realm 'mesos-agent-readonly'
I0613 17:45:31.735858  4615 http.cpp:975] Creating default 'basic' HTTP authenticator for
realm 'mesos-agent-readwrite'
I0613 17:45:31.737956  4615 slave.cpp:552] Agent resources: cpus(*):2; mem(*):1024; disk(*):1024;
ports(*):[31000-32000]
I0613 17:45:31.738092  4615 slave.cpp:560] Agent attributes: [  ]
I0613 17:45:31.738111  4615 slave.cpp:565] Agent hostname: e7c415e0f33b
I0613 17:45:31.738338  4613 status_update_manager.cpp:177] Pausing sending status updates
I0613 17:45:31.740612  4615 state.cpp:62] Recovering state from '/tmp/Endpoint_SlaveEndpointTest_NoAuthorizer_0_y8o8PA/meta'
I0613 17:45:31.741166  4618 status_update_manager.cpp:203] Recovering status update manager
I0613 17:45:31.741552  4617 containerizer.cpp:582] Recovering containerizer
I0613 17:45:31.744035  4616 provisioner.cpp:416] Provisioner recovery complete
I0613 17:45:31.744945  4611 slave.cpp:6127] Finished recovery
I0613 17:45:31.745693  4611 slave.cpp:6309] Querying resource estimator for oversubscribable
resources
I0613 17:45:31.746202  4613 slave.cpp:6323] Received oversubscribable resources {} from the
resource estimator
I0613 17:45:31.750443  4614 process.cpp:3778] Handling HTTP event for process 'slave(760)'
with path: '/slave(760)/monitor/statistics'
I0613 17:45:31.752836  4614 http.cpp:1115] HTTP GET for /slave(760)/monitor/statistics from
172.17.0.2:33390
I0613 17:45:31.752952  4614 http.cpp:936] Authorizing principal 'test-principal' to GET the
'/monitor/statistics' endpoint
I0613 17:45:31.758685  4592 slave.cpp:817] Agent terminating
[       OK ] Endpoint/SlaveEndpointTest.NoAuthorizer/0 (49 ms)
[ RUN      ] Endpoint/SlaveEndpointTest.NoAuthorizer/1
I0613 17:45:31.776181  4592 containerizer.cpp:230] Using isolation: posix/cpu,posix/mem,filesystem/posix,network/cni,environment_secret
W0613 17:45:31.777318  4592 backend.cpp:76] Failed to create 'overlay' backend: OverlayBackend
requires root privileges
W0613 17:45:31.777510  4592 backend.cpp:76] Failed to create 'bind' backend: BindBackend requires
root privileges
I0613 17:45:31.777891  4592 provisioner.cpp:255] Using default backend 'copy'
I0613 17:45:31.781044  4592 cluster.cpp:448] Creating default 'local' authorizer
I0613 17:45:31.785377  4616 slave.cpp:248] Mesos agent started on (761)@172.17.0.2:44671
I0613 17:45:31.785785  4616 slave.cpp:249] Flags at startup: --acls="" --appc_simple_discovery_uri_prefix="http://"
--appc_store_dir="/tmp/Endpoint_SlaveEndpointTest_NoAuthorizer_1_w309mB/store/appc" --authenticate_http_readonly="true"
--authenticate_http_readwrite="true" --authenticatee="crammd5" --authentication_backoff_factor="1secs"
--authorizer="local" --cgroups_cpu_enable_pids_and_tids_count="false" --cgroups_enable_cfs="false"
--cgroups_hierarchy="/sys/fs/cgroup" --cgroups_limit_swap="false" --cgroups_root="mesos" --container_disk_watch_interval="15secs"
--containerizers="mesos" --credential="/tmp/Endpoint_SlaveEndpointTest_NoAuthorizer_1_w309mB/credential"
--default_role="*" --disk_watch_interval="1mins" --docker="docker" --docker_kill_orphans="true"
--docker_registry="https://registry-1.docker.io" --docker_remove_delay="6hrs" --docker_socket="/var/run/docker.sock"
--docker_stop_timeout="0ns" --docker_store_dir="/tmp/Endpoint_SlaveEndpointTest_NoAuthorizer_1_w309mB/store/docker"
--docker_volume_checkpoint_dir="/var/run/mesos/isolators/docker/volume" --enforce_container_disk_quota="false"
--executor_registration_timeout="1mins" --executor_reregistration_timeout="2secs" --executor_shutdown_grace_period="5secs"
--fetcher_cache_dir="/tmp/Endpoint_SlaveEndpointTest_NoAuthorizer_1_w309mB/fetch" --fetcher_cache_size="2GB"
--frameworks_home="" --gc_delay="1weeks" --gc_disk_headroom="0.1" --hadoop_home="" --help="false"
--hostname_lookup="true" --http_command_executor="false" --http_credentials="/tmp/Endpoint_SlaveEndpointTest_NoAuthorizer_1_w309mB/http_credentials"
--http_heartbeat_interval="30secs" --initialize_driver_logging="true" --isolation="posix/cpu,posix/mem"
--launcher="posix" --launcher_dir="/mesos/mesos-1.4.0/_build/src" --logbufsecs="0" --logging_level="INFO"
--max_completed_executors_per_framework="150" --oversubscribed_resources_interval="15secs"
--perf_duration="10secs" --perf_interval="1mins" --port="5051" --qos_correction_interval_min="0ns"
--quiet="false" --recover="reconnect" --recovery_timeout="15mins" --registration_backoff_factor="10ms"
--resources="cpus:2;gpus:0;mem:1024;disk:1024;ports:[31000-32000]" --revocable_cpu_low_priority="true"
--runtime_dir="/tmp/Endpoint_SlaveEndpointTest_NoAuthorizer_1_w309mB" --sandbox_directory="/mnt/mesos/sandbox"
--strict="true" --switch_user="true" --systemd_enable_support="true" --systemd_runtime_directory="/run/systemd/system"
--version="false" --work_dir="/tmp/Endpoint_SlaveEndpointTest_NoAuthorizer_1_clpKCN"
I0613 17:45:31.786756  4616 credentials.hpp:86] Loading credential for authentication from
'/tmp/Endpoint_SlaveEndpointTest_NoAuthorizer_1_w309mB/credential'
I0613 17:45:31.787187  4616 slave.cpp:281] Agent using credential for: test-principal
I0613 17:45:31.787325  4616 credentials.hpp:37] Loading credentials for authentication from
'/tmp/Endpoint_SlaveEndpointTest_NoAuthorizer_1_w309mB/http_credentials'
I0613 17:45:31.787979  4616 http.cpp:975] Creating default 'basic' HTTP authenticator for
realm 'mesos-agent-readonly'
I0613 17:45:31.788408  4616 http.cpp:975] Creating default 'basic' HTTP authenticator for
realm 'mesos-agent-readwrite'
I0613 17:45:31.790892  4616 slave.cpp:552] Agent resources: cpus(*):2; mem(*):1024; disk(*):1024;
ports(*):[31000-32000]
I0613 17:45:31.791240  4616 slave.cpp:560] Agent attributes: [  ]
I0613 17:45:31.791409  4616 slave.cpp:565] Agent hostname: e7c415e0f33b
I0613 17:45:31.791831  4618 status_update_manager.cpp:177] Pausing sending status updates
I0613 17:45:31.793954  4612 state.cpp:62] Recovering state from '/tmp/Endpoint_SlaveEndpointTest_NoAuthorizer_1_clpKCN/meta'
I0613 17:45:31.794720  4612 status_update_manager.cpp:203] Recovering status update manager
I0613 17:45:31.795130  4612 containerizer.cpp:582] Recovering containerizer
I0613 17:45:31.797144  4618 provisioner.cpp:416] Provisioner recovery complete
I0613 17:45:31.798053  4618 slave.cpp:6127] Finished recovery
I0613 17:45:31.798660  4618 slave.cpp:6309] Querying resource estimator for oversubscribable
resources
I0613 17:45:31.799444  4613 slave.cpp:6323] Received oversubscribable resources {} from the
resource estimator
I0613 17:45:31.804308  4613 process.cpp:3778] Handling HTTP event for process 'slave(761)'
with path: '/slave(761)/monitor/statistics.json'
I0613 17:45:31.807093  4613 http.cpp:1115] HTTP GET for /slave(761)/monitor/statistics.json
from 172.17.0.2:33392
I0613 17:45:31.807469  4613 http.cpp:936] Authorizing principal 'test-principal' to GET the
'/monitor/statistics.json' endpoint
I0613 17:45:31.814188  4614 slave.cpp:817] Agent terminating
[       OK ] Endpoint/SlaveEndpointTest.NoAuthorizer/1 (55 ms)
[ RUN      ] Endpoint/SlaveEndpointTest.NoAuthorizer/2
I0613 17:45:31.830093  4592 containerizer.cpp:230] Using isolation: posix/cpu,posix/mem,filesystem/posix,network/cni,environment_secret
W0613 17:45:31.831219  4592 backend.cpp:76] Failed to create 'overlay' backend: OverlayBackend
requires root privileges
W0613 17:45:31.831406  4592 backend.cpp:76] Failed to create 'bind' backend: BindBackend requires
root privileges
I0613 17:45:31.831908  4592 provisioner.cpp:255] Using default backend 'copy'
I0613 17:45:31.835027  4592 cluster.cpp:448] Creating default 'local' authorizer
I0613 17:45:31.838106  4613 slave.cpp:248] Mesos agent started on (762)@172.17.0.2:44671
I0613 17:45:31.838311  4613 slave.cpp:249] Flags at startup: --acls="" --appc_simple_discovery_uri_prefix="http://"
--appc_store_dir="/tmp/Endpoint_SlaveEndpointTest_NoAuthorizer_2_eMcVQO/store/appc" --authenticate_http_readonly="true"
--authenticate_http_readwrite="true" --authenticatee="crammd5" --authentication_backoff_factor="1secs"
--authorizer="local" --cgroups_cpu_enable_pids_and_tids_count="false" --cgroups_enable_cfs="false"
--cgroups_hierarchy="/sys/fs/cgroup" --cgroups_limit_swap="false" --cgroups_root="mesos" --container_disk_watch_interval="15secs"
--containerizers="mesos" --credential="/tmp/Endpoint_SlaveEndpointTest_NoAuthorizer_2_eMcVQO/credential"
--default_role="*" --disk_watch_interval="1mins" --docker="docker" --docker_kill_orphans="true"
--docker_registry="https://registry-1.docker.io" --docker_remove_delay="6hrs" --docker_socket="/var/run/docker.sock"
--docker_stop_timeout="0ns" --docker_store_dir="/tmp/Endpoint_SlaveEndpointTest_NoAuthorizer_2_eMcVQO/store/docker"
--docker_volume_checkpoint_dir="/var/run/mesos/isolators/docker/volume" --enforce_container_disk_quota="false"
--executor_registration_timeout="1mins" --executor_reregistration_timeout="2secs" --executor_shutdown_grace_period="5secs"
--fetcher_cache_dir="/tmp/Endpoint_SlaveEndpointTest_NoAuthorizer_2_eMcVQO/fetch" --fetcher_cache_size="2GB"
--frameworks_home="" --gc_delay="1weeks" --gc_disk_headroom="0.1" --hadoop_home="" --help="false"
--hostname_lookup="true" --http_command_executor="false" --http_credentials="/tmp/Endpoint_SlaveEndpointTest_NoAuthorizer_2_eMcVQO/http_credentials"
--http_heartbeat_interval="30secs" --initialize_driver_logging="true" --isolation="posix/cpu,posix/mem"
--launcher="posix" --launcher_dir="/mesos/mesos-1.4.0/_build/src" --logbufsecs="0" --logging_level="INFO"
--max_completed_executors_per_framework="150" --oversubscribed_resources_interval="15secs"
--perf_duration="10secs" --perf_interval="1mins" --port="5051" --qos_correction_interval_min="0ns"
--quiet="false" --recover="reconnect" --recovery_timeout="15mins" --registration_backoff_factor="10ms"
--resources="cpus:2;gpus:0;mem:1024;disk:1024;ports:[31000-32000]" --revocable_cpu_low_priority="true"
--runtime_dir="/tmp/Endpoint_SlaveEndpointTest_NoAuthorizer_2_eMcVQO" --sandbox_directory="/mnt/mesos/sandbox"
--strict="true" --switch_user="true" --systemd_enable_support="true" --systemd_runtime_directory="/run/systemd/system"
--version="false" --work_dir="/tmp/Endpoint_SlaveEndpointTest_NoAuthorizer_2_G29JX0"
I0613 17:45:31.839403  4613 credentials.hpp:86] Loading credential for authentication from
'/tmp/Endpoint_SlaveEndpointTest_NoAuthorizer_2_eMcVQO/credential'
I0613 17:45:31.839951  4613 slave.cpp:281] Agent using credential for: test-principal
I0613 17:45:31.840288  4613 credentials.hpp:37] Loading credentials for authentication from
'/tmp/Endpoint_SlaveEndpointTest_NoAuthorizer_2_eMcVQO/http_credentials'
I0613 17:45:31.840908  4613 http.cpp:975] Creating default 'basic' HTTP authenticator for
realm 'mesos-agent-readonly'
I0613 17:45:31.841388  4613 http.cpp:975] Creating default 'basic' HTTP authenticator for
realm 'mesos-agent-readwrite'
I0613 17:45:31.843780  4613 slave.cpp:552] Agent resources: cpus(*):2; mem(*):1024; disk(*):1024;
ports(*):[31000-32000]
I0613 17:45:31.844161  4613 slave.cpp:560] Agent attributes: [  ]
I0613 17:45:31.844298  4613 slave.cpp:565] Agent hostname: e7c415e0f33b
I0613 17:45:31.844665  4611 status_update_manager.cpp:177] Pausing sending status updates
I0613 17:45:31.846772  4611 state.cpp:62] Recovering state from '/tmp/Endpoint_SlaveEndpointTest_NoAuthorizer_2_G29JX0/meta'
I0613 17:45:31.847278  4611 status_update_manager.cpp:203] Recovering status update manager
I0613 17:45:31.847654  4611 containerizer.cpp:582] Recovering containerizer
I0613 17:45:31.850183  4611 provisioner.cpp:416] Provisioner recovery complete
I0613 17:45:31.851027  4618 slave.cpp:6127] Finished recovery
I0613 17:45:31.852015  4618 slave.cpp:6309] Querying resource estimator for oversubscribable
resources
I0613 17:45:31.852735  4615 slave.cpp:6323] Received oversubscribable resources {} from the
resource estimator
I0613 17:45:31.856814  4618 process.cpp:3778] Handling HTTP event for process 'slave(762)'
with path: '/slave(762)/containers'
I0613 17:45:31.859344  4616 http.cpp:1115] HTTP GET for /slave(762)/containers from 172.17.0.2:33394
I0613 17:45:31.859660  4616 http.cpp:936] Authorizing principal 'test-principal' to GET the
'/containers' endpoint
I0613 17:45:31.865703  4616 slave.cpp:817] Agent terminating
[       OK ] Endpoint/SlaveEndpointTest.NoAuthorizer/2 (52 ms)
[----------] 9 tests from Endpoint/SlaveEndpointTest (445 ms total)

[----------] Global test environment tear-down
../../src/tests/environment.cpp:736: Failure
Failed
Tests completed with child processes remaining:
-+- 4592 /mesos/mesos-1.4.0/_build/src/.libs/lt-mesos-tests 
 \-+- 15743 /mesos/mesos-1.4.0/_build/src/.libs/lt-mesos-containerizer launch 
   \--- 15757 /mesos/mesos-1.4.0/_build/src/.libs/lt-mesos-executor --launcher_dir=/mesos/mesos-1.4.0/_build/src

[==========] 1589 tests from 176 test cases ran. (738920 ms total)
[  PASSED  ] 1583 tests.
[  FAILED  ] 6 tests, listed below:
[  FAILED  ] DefaultExecutorCheckTest.CommandCheckDeliveredAndReconciled
[  FAILED  ] DefaultExecutorCheckTest.CommandCheckStatusChange
[  FAILED  ] DefaultExecutorCheckTest.CommandCheckSeesParentsEnv
[  FAILED  ] DefaultExecutorCheckTest.CommandCheckSharesWorkDirWithTask
[  FAILED  ] MesosContainerizerSlaveRecoveryTest.ResourceStatistics
[  FAILED  ] SlaveTest.HTTPSchedulerSlaveRestart

 6 FAILED TESTS
  YOU HAVE 22 DISABLED TESTS

E0613 17:45:32.015384  4619 process.cpp:968] Failed to accept socket: future discarded
I0613 17:45:32.090386 15776 exec.cpp:508] Agent exited, but framework has checkpointing enabled.
Waiting 15mins to reconnect with agent dac8f102-f9be-40b6-aa96-42903081a15b-S0
make[4]: *** [check-local] Error 1
make[4]: Leaving directory `/mesos/mesos-1.4.0/_build/src'
make[3]: *** [check-am] Error 2
make[3]: Leaving directory `/mesos/mesos-1.4.0/_build/src'
make[2]: *** [check] Error 2
make[2]: Leaving directory `/mesos/mesos-1.4.0/_build/src'
make[1]: *** [check-recursive] Error 1
make[1]: Leaving directory `/mesos/mesos-1.4.0/_build'
make: *** [distcheck] Error 1
+ docker rmi mesos-1497368674-15421
Untagged: mesos-1497368674-15421:latest
Deleted: sha256:dc02fcd9ddcac1ae87748979860b345ca537bc0e5e5c7a6d58b7f63443fae484
Deleted: sha256:73db530cf3dee0a1408777be59c8251ec8afdd7fc887ba2bdc9db4d327c29c81
Deleted: sha256:e43acedac9058a57837ea3a505b8c7c0063566edb848f8554e9b00bf9339ce8a
Deleted: sha256:41f4a56f3ab22225859ef8ac75d99930380a82e94dfb1f882b92293d1757917b
Deleted: sha256:bcb28a45ab8b8b38bf2b33f526c7a23d8c9b10371578230215e80f0d401a4af9
Deleted: sha256:b62edaad6048a34f507d2f12ef58fe986becbadd76ec84d586ccbfcfbdb5ccd2
Deleted: sha256:d0494d9ecd1929c0e575249c4ada53a75eb3d5e68d64bb976a859fc7c90f95ce
Deleted: sha256:f59e8a4531884421e0f687dee9903b56148f1d6c0682c8726960345d7290a9cd
Deleted: sha256:a09ddb5b3e967cee86429910c9e4d43c5795be73655ac547c7953f369ff89d45
Deleted: sha256:a6cb90fbb68df013afac54e19ab49b00d8113558965a2b3730472739baf1178a
Deleted: sha256:f11c6dbb834ca06fa47198ec94b46814a87cab0d9de0b1a896014b5156c30aa4
Deleted: sha256:2bc639afa5bd06a2d3cda86a0ca222ef1f1460af5e97a4bdf3f1f6ea134374b5
Deleted: sha256:d55478cd509bb26d01fc7c98242cd392cc270b39436853cf95228df21ad500af
Deleted: sha256:300ceb11755986ce24a839ff16c69153694a9ab1e366ebeb23a4cfd12b3594aa
Deleted: sha256:c193f4d7e2f4be5080ea85c1a521f633cb4af58dd97bb9e8f4fb75c33cb8a934
Deleted: sha256:b05d63d2e7609849625262d698fb5e3d67001b8c09981ce5fc8805bbf359d68d
Deleted: sha256:0609172c1c565c2429fd7024c9bfa735304f73411947d9c3a5c262a7994a5f87
Deleted: sha256:7e2e844b4d5c49020c82ba0674dec21dd212fc04932dd928140981356e20cc6c
Deleted: sha256:ae4c3b5a7c11ec38a34fd1063e895c165654de4b42e7f19c4eebe1e64532e20e
Deleted: sha256:718406c8cf3a4048d0e8df7dcd9883e3f56fd49cdf2b64d9f3da4d84fa9a1294
Deleted: sha256:a661abea997dffdb746efea0bf8be88af71242f7d05fdf5df6a3fc33ff1c238c
Deleted: sha256:c68d1b12d3a518d6c00d48ca427a19199f605c8c5df4f902a821e64c86c9c62b
Deleted: sha256:dd79a69bd00d915d89e59d3a2c3b915032633935c287e20f11c5af07ffc6d1b1
Deleted: sha256:cb30252b89a7f47037c6a53c7a5f6a4cc1116c959a22d0bdf0f762f5e53d245c
Build step 'Execute shell' marked build as failure

Mime
View raw message