mesos-builds mailing list archives

Site index · List index
Message view « Date » · « Thread »
Top « Date » · « Thread »
From Apache Jenkins Server <jenk...@builds.apache.org>
Subject Build failed in Jenkins: Mesos-Reviewbot #18333
Date Sat, 10 Jun 2017 17:49:30 GMT
See <https://builds.apache.org/job/Mesos-Reviewbot/18333/display/redirect>

------------------------------------------
[...truncated 28.20 MB...]
I0610 17:49:20.907023  4584 containerizer.cpp:230] Using isolation: posix/cpu,posix/mem,filesystem/posix,network/cni,environment_secret
W0610 17:49:20.907827  4584 backend.cpp:76] Failed to create 'overlay' backend: OverlayBackend
requires root privileges
W0610 17:49:20.907999  4584 backend.cpp:76] Failed to create 'bind' backend: BindBackend requires
root privileges
I0610 17:49:20.908064  4584 provisioner.cpp:255] Using default backend 'copy'
I0610 17:49:20.913493  4607 slave.cpp:248] Mesos agent started on (756)@172.17.0.2:43453
I0610 17:49:20.913537  4607 slave.cpp:249] Flags at startup: --acls="" --appc_simple_discovery_uri_prefix="http://"
--appc_store_dir="/tmp/Endpoint_SlaveEndpointTest_AuthorizedRequest_2_MweRcf/store/appc" --authenticate_http_readonly="true"
--authenticate_http_readwrite="true" --authenticatee="crammd5" --authentication_backoff_factor="1secs"
--authorizer="local" --cgroups_cpu_enable_pids_and_tids_count="false" --cgroups_enable_cfs="false"
--cgroups_hierarchy="/sys/fs/cgroup" --cgroups_limit_swap="false" --cgroups_root="mesos" --container_disk_watch_interval="15secs"
--containerizers="mesos" --credential="/tmp/Endpoint_SlaveEndpointTest_AuthorizedRequest_2_MweRcf/credential"
--default_role="*" --disk_watch_interval="1mins" --docker="docker" --docker_kill_orphans="true"
--docker_registry="https://registry-1.docker.io" --docker_remove_delay="6hrs" --docker_socket="/var/run/docker.sock"
--docker_stop_timeout="0ns" --docker_store_dir="/tmp/Endpoint_SlaveEndpointTest_AuthorizedRequest_2_MweRcf/store/docker"
--docker_volume_checkpoint_dir="/var/run/mesos/isolators/docker/volume" --enforce_container_disk_quota="false"
--executor_registration_timeout="1mins" --executor_reregistration_timeout="2secs" --executor_shutdown_grace_period="5secs"
--fetcher_cache_dir="/tmp/Endpoint_SlaveEndpointTest_AuthorizedRequest_2_MweRcf/fetch" --fetcher_cache_size="2GB"
--frameworks_home="" --gc_delay="1weeks" --gc_disk_headroom="0.1" --hadoop_home="" --help="false"
--hostname_lookup="true" --http_command_executor="false" --http_credentials="/tmp/Endpoint_SlaveEndpointTest_AuthorizedRequest_2_MweRcf/http_credentials"
--http_heartbeat_interval="30secs" --initialize_driver_logging="true" --isolation="posix/cpu,posix/mem"
--launcher="posix" --launcher_dir="/mesos/mesos-1.4.0/_build/src" --logbufsecs="0" --logging_level="INFO"
--max_completed_executors_per_framework="150" --oversubscribed_resources_interval="15secs"
--perf_duration="10secs" --perf_interval="1mins" --port="5051" --qos_correction_interval_min="0ns"
--quiet="false" --recover="reconnect" --recovery_timeout="15mins" --registration_backoff_factor="10ms"
--resources="cpus:2;gpus:0;mem:1024;disk:1024;ports:[31000-32000]" --revocable_cpu_low_priority="true"
--runtime_dir="/tmp/Endpoint_SlaveEndpointTest_AuthorizedRequest_2_MweRcf" --sandbox_directory="/mnt/mesos/sandbox"
--strict="true" --switch_user="true" --systemd_enable_support="true" --systemd_runtime_directory="/run/systemd/system"
--version="false" --work_dir="/tmp/Endpoint_SlaveEndpointTest_AuthorizedRequest_2_a3Qnof"
I0610 17:49:20.914347  4607 credentials.hpp:86] Loading credential for authentication from
'/tmp/Endpoint_SlaveEndpointTest_AuthorizedRequest_2_MweRcf/credential'
I0610 17:49:20.914636  4607 slave.cpp:281] Agent using credential for: test-principal
I0610 17:49:20.914674  4607 credentials.hpp:37] Loading credentials for authentication from
'/tmp/Endpoint_SlaveEndpointTest_AuthorizedRequest_2_MweRcf/http_credentials'
I0610 17:49:20.915118  4607 http.cpp:975] Creating default 'basic' HTTP authenticator for
realm 'mesos-agent-readonly'
I0610 17:49:20.915411  4607 http.cpp:975] Creating default 'basic' HTTP authenticator for
realm 'mesos-agent-readwrite'
I0610 17:49:20.917500  4607 slave.cpp:552] Agent resources: cpus(*):2; mem(*):1024; disk(*):1024;
ports(*):[31000-32000]
I0610 17:49:20.917642  4607 slave.cpp:560] Agent attributes: [  ]
I0610 17:49:20.917664  4607 slave.cpp:565] Agent hostname: 52658e270d6d
I0610 17:49:20.917871  4609 status_update_manager.cpp:177] Pausing sending status updates
I0610 17:49:20.919739  4608 state.cpp:62] Recovering state from '/tmp/Endpoint_SlaveEndpointTest_AuthorizedRequest_2_a3Qnof/meta'
I0610 17:49:20.920135  4605 status_update_manager.cpp:203] Recovering status update manager
I0610 17:49:20.920656  4607 containerizer.cpp:582] Recovering containerizer
I0610 17:49:20.922771  4604 provisioner.cpp:416] Provisioner recovery complete
I0610 17:49:20.923322  4608 slave.cpp:6127] Finished recovery
I0610 17:49:20.923979  4608 slave.cpp:6309] Querying resource estimator for oversubscribable
resources
I0610 17:49:20.924517  4605 slave.cpp:6323] Received oversubscribable resources {} from the
resource estimator
I0610 17:49:20.928755  4605 process.cpp:3778] Handling HTTP event for process 'slave(756)'
with path: '/slave(756)/containers'
I0610 17:49:20.930938  4608 http.cpp:1115] HTTP GET for /slave(756)/containers from 172.17.0.2:47128
I0610 17:49:20.931056  4608 http.cpp:936] Authorizing principal 'test-principal' to GET the
'/containers' endpoint
I0610 17:49:20.936952  4609 slave.cpp:817] Agent terminating
[       OK ] Endpoint/SlaveEndpointTest.AuthorizedRequest/2 (45 ms)
[ RUN      ] Endpoint/SlaveEndpointTest.UnauthorizedRequest/0
I0610 17:49:20.952170  4584 containerizer.cpp:230] Using isolation: posix/cpu,posix/mem,filesystem/posix,network/cni,environment_secret
W0610 17:49:20.952973  4584 backend.cpp:76] Failed to create 'overlay' backend: OverlayBackend
requires root privileges
W0610 17:49:20.953191  4584 backend.cpp:76] Failed to create 'bind' backend: BindBackend requires
root privileges
I0610 17:49:20.953236  4584 provisioner.cpp:255] Using default backend 'copy'
I0610 17:49:20.958463  4607 slave.cpp:248] Mesos agent started on (757)@172.17.0.2:43453
I0610 17:49:20.958509  4607 slave.cpp:249] Flags at startup: --acls="" --appc_simple_discovery_uri_prefix="http://"
--appc_store_dir="/tmp/Endpoint_SlaveEndpointTest_UnauthorizedRequest_0_OHZDRe/store/appc"
--authenticate_http_readonly="true" --authenticate_http_readwrite="true" --authenticatee="crammd5"
--authentication_backoff_factor="1secs" --authorizer="local" --cgroups_cpu_enable_pids_and_tids_count="false"
--cgroups_enable_cfs="false" --cgroups_hierarchy="/sys/fs/cgroup" --cgroups_limit_swap="false"
--cgroups_root="mesos" --container_disk_watch_interval="15secs" --containerizers="mesos" --credential="/tmp/Endpoint_SlaveEndpointTest_UnauthorizedRequest_0_OHZDRe/credential"
--default_role="*" --disk_watch_interval="1mins" --docker="docker" --docker_kill_orphans="true"
--docker_registry="https://registry-1.docker.io" --docker_remove_delay="6hrs" --docker_socket="/var/run/docker.sock"
--docker_stop_timeout="0ns" --docker_store_dir="/tmp/Endpoint_SlaveEndpointTest_UnauthorizedRequest_0_OHZDRe/store/docker"
--docker_volume_checkpoint_dir="/var/run/mesos/isolators/docker/volume" --enforce_container_disk_quota="false"
--executor_registration_timeout="1mins" --executor_reregistration_timeout="2secs" --executor_shutdown_grace_period="5secs"
--fetcher_cache_dir="/tmp/Endpoint_SlaveEndpointTest_UnauthorizedRequest_0_OHZDRe/fetch" --fetcher_cache_size="2GB"
--frameworks_home="" --gc_delay="1weeks" --gc_disk_headroom="0.1" --hadoop_home="" --help="false"
--hostname_lookup="true" --http_command_executor="false" --http_credentials="/tmp/Endpoint_SlaveEndpointTest_UnauthorizedRequest_0_OHZDRe/http_credentials"
--http_heartbeat_interval="30secs" --initialize_driver_logging="true" --isolation="posix/cpu,posix/mem"
--launcher="posix" --launcher_dir="/mesos/mesos-1.4.0/_build/src" --logbufsecs="0" --logging_level="INFO"
--max_completed_executors_per_framework="150" --oversubscribed_resources_interval="15secs"
--perf_duration="10secs" --perf_interval="1mins" --port="5051" --qos_correction_interval_min="0ns"
--quiet="false" --recover="reconnect" --recovery_timeout="15mins" --registration_backoff_factor="10ms"
--resources="cpus:2;gpus:0;mem:1024;disk:1024;ports:[31000-32000]" --revocable_cpu_low_priority="true"
--runtime_dir="/tmp/Endpoint_SlaveEndpointTest_UnauthorizedRequest_0_OHZDRe" --sandbox_directory="/mnt/mesos/sandbox"
--strict="true" --switch_user="true" --systemd_enable_support="true" --systemd_runtime_directory="/run/systemd/system"
--version="false" --work_dir="/tmp/Endpoint_SlaveEndpointTest_UnauthorizedRequest_0_QsVPVe"
I0610 17:49:20.959203  4607 credentials.hpp:86] Loading credential for authentication from
'/tmp/Endpoint_SlaveEndpointTest_UnauthorizedRequest_0_OHZDRe/credential'
I0610 17:49:20.959456  4607 slave.cpp:281] Agent using credential for: test-principal
I0610 17:49:20.959486  4607 credentials.hpp:37] Loading credentials for authentication from
'/tmp/Endpoint_SlaveEndpointTest_UnauthorizedRequest_0_OHZDRe/http_credentials'
I0610 17:49:20.959846  4607 http.cpp:975] Creating default 'basic' HTTP authenticator for
realm 'mesos-agent-readonly'
I0610 17:49:20.960073  4607 http.cpp:975] Creating default 'basic' HTTP authenticator for
realm 'mesos-agent-readwrite'
I0610 17:49:20.962061  4607 slave.cpp:552] Agent resources: cpus(*):2; mem(*):1024; disk(*):1024;
ports(*):[31000-32000]
I0610 17:49:20.962198  4607 slave.cpp:560] Agent attributes: [  ]
I0610 17:49:20.962216  4607 slave.cpp:565] Agent hostname: 52658e270d6d
I0610 17:49:20.962426  4604 status_update_manager.cpp:177] Pausing sending status updates
I0610 17:49:20.964469  4610 state.cpp:62] Recovering state from '/tmp/Endpoint_SlaveEndpointTest_UnauthorizedRequest_0_QsVPVe/meta'
I0610 17:49:20.965338  4606 status_update_manager.cpp:203] Recovering status update manager
I0610 17:49:20.965575  4606 containerizer.cpp:582] Recovering containerizer
I0610 17:49:20.967609  4610 provisioner.cpp:416] Provisioner recovery complete
I0610 17:49:20.968168  4605 slave.cpp:6127] Finished recovery
I0610 17:49:20.968956  4605 slave.cpp:6309] Querying resource estimator for oversubscribable
resources
I0610 17:49:20.969550  4610 slave.cpp:6323] Received oversubscribable resources {} from the
resource estimator
I0610 17:49:20.973420  4604 process.cpp:3778] Handling HTTP event for process 'slave(757)'
with path: '/slave(757)/monitor/statistics'
I0610 17:49:20.975299  4609 http.cpp:1115] HTTP GET for /slave(757)/monitor/statistics from
172.17.0.2:47130
I0610 17:49:20.975427  4609 http.cpp:936] Authorizing principal 'test-principal' to GET the
'/monitor/statistics' endpoint
I0610 17:49:20.978659  4603 slave.cpp:817] Agent terminating
[       OK ] Endpoint/SlaveEndpointTest.UnauthorizedRequest/0 (42 ms)
[ RUN      ] Endpoint/SlaveEndpointTest.UnauthorizedRequest/1
I0610 17:49:20.994596  4584 containerizer.cpp:230] Using isolation: posix/cpu,posix/mem,filesystem/posix,network/cni,environment_secret
W0610 17:49:20.995440  4584 backend.cpp:76] Failed to create 'overlay' backend: OverlayBackend
requires root privileges
W0610 17:49:20.995625  4584 backend.cpp:76] Failed to create 'bind' backend: BindBackend requires
root privileges
I0610 17:49:20.995669  4584 provisioner.cpp:255] Using default backend 'copy'
I0610 17:49:21.000855  4608 slave.cpp:248] Mesos agent started on (758)@172.17.0.2:43453
I0610 17:49:21.000898  4608 slave.cpp:249] Flags at startup: --acls="" --appc_simple_discovery_uri_prefix="http://"
--appc_store_dir="/tmp/Endpoint_SlaveEndpointTest_UnauthorizedRequest_1_e56cYe/store/appc"
--authenticate_http_readonly="true" --authenticate_http_readwrite="true" --authenticatee="crammd5"
--authentication_backoff_factor="1secs" --authorizer="local" --cgroups_cpu_enable_pids_and_tids_count="false"
--cgroups_enable_cfs="false" --cgroups_hierarchy="/sys/fs/cgroup" --cgroups_limit_swap="false"
--cgroups_root="mesos" --container_disk_watch_interval="15secs" --containerizers="mesos" --credential="/tmp/Endpoint_SlaveEndpointTest_UnauthorizedRequest_1_e56cYe/credential"
--default_role="*" --disk_watch_interval="1mins" --docker="docker" --docker_kill_orphans="true"
--docker_registry="https://registry-1.docker.io" --docker_remove_delay="6hrs" --docker_socket="/var/run/docker.sock"
--docker_stop_timeout="0ns" --docker_store_dir="/tmp/Endpoint_SlaveEndpointTest_UnauthorizedRequest_1_e56cYe/store/docker"
--docker_volume_checkpoint_dir="/var/run/mesos/isolators/docker/volume" --enforce_container_disk_quota="false"
--executor_registration_timeout="1mins" --executor_reregistration_timeout="2secs" --executor_shutdown_grace_period="5secs"
--fetcher_cache_dir="/tmp/Endpoint_SlaveEndpointTest_UnauthorizedRequest_1_e56cYe/fetch" --fetcher_cache_size="2GB"
--frameworks_home="" --gc_delay="1weeks" --gc_disk_headroom="0.1" --hadoop_home="" --help="false"
--hostname_lookup="true" --http_command_executor="false" --http_credentials="/tmp/Endpoint_SlaveEndpointTest_UnauthorizedRequest_1_e56cYe/http_credentials"
--http_heartbeat_interval="30secs" --initialize_driver_logging="true" --isolation="posix/cpu,posix/mem"
--launcher="posix" --launcher_dir="/mesos/mesos-1.4.0/_build/src" --logbufsecs="0" --logging_level="INFO"
--max_completed_executors_per_framework="150" --oversubscribed_resources_interval="15secs"
--perf_duration="10secs" --perf_interval="1mins" --port="5051" --qos_correction_interval_min="0ns"
--quiet="false" --recover="reconnect" --recovery_timeout="15mins" --registration_backoff_factor="10ms"
--resources="cpus:2;gpus:0;mem:1024;disk:1024;ports:[31000-32000]" --revocable_cpu_low_priority="true"
--runtime_dir="/tmp/Endpoint_SlaveEndpointTest_UnauthorizedRequest_1_e56cYe" --sandbox_directory="/mnt/mesos/sandbox"
--strict="true" --switch_user="true" --systemd_enable_support="true" --systemd_runtime_directory="/run/systemd/system"
--version="false" --work_dir="/tmp/Endpoint_SlaveEndpointTest_UnauthorizedRequest_1_oo0yVe"
I0610 17:49:21.001636  4608 credentials.hpp:86] Loading credential for authentication from
'/tmp/Endpoint_SlaveEndpointTest_UnauthorizedRequest_1_e56cYe/credential'
I0610 17:49:21.001893  4608 slave.cpp:281] Agent using credential for: test-principal
I0610 17:49:21.001917  4608 credentials.hpp:37] Loading credentials for authentication from
'/tmp/Endpoint_SlaveEndpointTest_UnauthorizedRequest_1_e56cYe/http_credentials'
I0610 17:49:21.002262  4608 http.cpp:975] Creating default 'basic' HTTP authenticator for
realm 'mesos-agent-readonly'
I0610 17:49:21.002482  4608 http.cpp:975] Creating default 'basic' HTTP authenticator for
realm 'mesos-agent-readwrite'
I0610 17:49:21.004652  4608 slave.cpp:552] Agent resources: cpus(*):2; mem(*):1024; disk(*):1024;
ports(*):[31000-32000]
I0610 17:49:21.004796  4608 slave.cpp:560] Agent attributes: [  ]
I0610 17:49:21.004817  4608 slave.cpp:565] Agent hostname: 52658e270d6d
I0610 17:49:21.005174  4606 status_update_manager.cpp:177] Pausing sending status updates
I0610 17:49:21.006908  4604 state.cpp:62] Recovering state from '/tmp/Endpoint_SlaveEndpointTest_UnauthorizedRequest_1_oo0yVe/meta'
I0610 17:49:21.007453  4609 status_update_manager.cpp:203] Recovering status update manager
I0610 17:49:21.007719  4609 containerizer.cpp:582] Recovering containerizer
I0610 17:49:21.009827  4606 provisioner.cpp:416] Provisioner recovery complete
I0610 17:49:21.010406  4605 slave.cpp:6127] Finished recovery
I0610 17:49:21.013391  4605 slave.cpp:6309] Querying resource estimator for oversubscribable
resources
I0610 17:49:21.014272  4605 slave.cpp:6323] Received oversubscribable resources {} from the
resource estimator
I0610 17:49:21.018955  4606 process.cpp:3778] Handling HTTP event for process 'slave(758)'
with path: '/slave(758)/monitor/statistics.json'
I0610 17:49:21.021131  4604 http.cpp:1115] HTTP GET for /slave(758)/monitor/statistics.json
from 172.17.0.2:47132
I0610 17:49:21.021270  4604 http.cpp:936] Authorizing principal 'test-principal' to GET the
'/monitor/statistics.json' endpoint
I0610 17:49:21.025809  4606 slave.cpp:817] Agent terminating
[       OK ] Endpoint/SlaveEndpointTest.UnauthorizedRequest/1 (47 ms)
[ RUN      ] Endpoint/SlaveEndpointTest.UnauthorizedRequest/2
I0610 17:49:21.041785  4584 containerizer.cpp:230] Using isolation: posix/cpu,posix/mem,filesystem/posix,network/cni,environment_secret
W0610 17:49:21.042578  4584 backend.cpp:76] Failed to create 'overlay' backend: OverlayBackend
requires root privileges
W0610 17:49:21.042747  4584 backend.cpp:76] Failed to create 'bind' backend: BindBackend requires
root privileges
I0610 17:49:21.042794  4584 provisioner.cpp:255] Using default backend 'copy'
I0610 17:49:21.047930  4604 slave.cpp:248] Mesos agent started on (759)@172.17.0.2:43453
I0610 17:49:21.047981  4604 slave.cpp:249] Flags at startup: --acls="" --appc_simple_discovery_uri_prefix="http://"
--appc_store_dir="/tmp/Endpoint_SlaveEndpointTest_UnauthorizedRequest_2_4JG5yf/store/appc"
--authenticate_http_readonly="true" --authenticate_http_readwrite="true" --authenticatee="crammd5"
--authentication_backoff_factor="1secs" --authorizer="local" --cgroups_cpu_enable_pids_and_tids_count="false"
--cgroups_enable_cfs="false" --cgroups_hierarchy="/sys/fs/cgroup" --cgroups_limit_swap="false"
--cgroups_root="mesos" --container_disk_watch_interval="15secs" --containerizers="mesos" --credential="/tmp/Endpoint_SlaveEndpointTest_UnauthorizedRequest_2_4JG5yf/credential"
--default_role="*" --disk_watch_interval="1mins" --docker="docker" --docker_kill_orphans="true"
--docker_registry="https://registry-1.docker.io" --docker_remove_delay="6hrs" --docker_socket="/var/run/docker.sock"
--docker_stop_timeout="0ns" --docker_store_dir="/tmp/Endpoint_SlaveEndpointTest_UnauthorizedRequest_2_4JG5yf/store/docker"
--docker_volume_checkpoint_dir="/var/run/mesos/isolators/docker/volume" --enforce_container_disk_quota="false"
--executor_registration_timeout="1mins" --executor_reregistration_timeout="2secs" --executor_shutdown_grace_period="5secs"
--fetcher_cache_dir="/tmp/Endpoint_SlaveEndpointTest_UnauthorizedRequest_2_4JG5yf/fetch" --fetcher_cache_size="2GB"
--frameworks_home="" --gc_delay="1weeks" --gc_disk_headroom="0.1" --hadoop_home="" --help="false"
--hostname_lookup="true" --http_command_executor="false" --http_credentials="/tmp/Endpoint_SlaveEndpointTest_UnauthorizedRequest_2_4JG5yf/http_credentials"
--http_heartbeat_interval="30secs" --initialize_driver_logging="true" --isolation="posix/cpu,posix/mem"
--launcher="posix" --launcher_dir="/mesos/mesos-1.4.0/_build/src" --logbufsecs="0" --logging_level="INFO"
--max_completed_executors_per_framework="150" --oversubscribed_resources_interval="15secs"
--perf_duration="10secs" --perf_interval="1mins" --port="5051" --qos_correction_interval_min="0ns"
--quiet="false" --recover="reconnect" --recovery_timeout="15mins" --registration_backoff_factor="10ms"
--resources="cpus:2;gpus:0;mem:1024;disk:1024;ports:[31000-32000]" --revocable_cpu_low_priority="true"
--runtime_dir="/tmp/Endpoint_SlaveEndpointTest_UnauthorizedRequest_2_4JG5yf" --sandbox_directory="/mnt/mesos/sandbox"
--strict="true" --switch_user="true" --systemd_enable_support="true" --systemd_runtime_directory="/run/systemd/system"
--version="false" --work_dir="/tmp/Endpoint_SlaveEndpointTest_UnauthorizedRequest_2_Qm4Jof"
I0610 17:49:21.049022  4604 credentials.hpp:86] Loading credential for authentication from
'/tmp/Endpoint_SlaveEndpointTest_UnauthorizedRequest_2_4JG5yf/credential'
I0610 17:49:21.049643  4604 slave.cpp:281] Agent using credential for: test-principal
I0610 17:49:21.049695  4604 credentials.hpp:37] Loading credentials for authentication from
'/tmp/Endpoint_SlaveEndpointTest_UnauthorizedRequest_2_4JG5yf/http_credentials'
I0610 17:49:21.050442  4604 http.cpp:975] Creating default 'basic' HTTP authenticator for
realm 'mesos-agent-readonly'
I0610 17:49:21.051015  4604 http.cpp:975] Creating default 'basic' HTTP authenticator for
realm 'mesos-agent-readwrite'
I0610 17:49:21.053735  4604 slave.cpp:552] Agent resources: cpus(*):2; mem(*):1024; disk(*):1024;
ports(*):[31000-32000]
I0610 17:49:21.053925  4604 slave.cpp:560] Agent attributes: [  ]
I0610 17:49:21.053947  4604 slave.cpp:565] Agent hostname: 52658e270d6d
I0610 17:49:21.054430  4608 status_update_manager.cpp:177] Pausing sending status updates
I0610 17:49:21.056735  4610 state.cpp:62] Recovering state from '/tmp/Endpoint_SlaveEndpointTest_UnauthorizedRequest_2_Qm4Jof/meta'
I0610 17:49:21.057173  4605 status_update_manager.cpp:203] Recovering status update manager
I0610 17:49:21.057660  4610 containerizer.cpp:582] Recovering containerizer
I0610 17:49:21.060613  4610 provisioner.cpp:416] Provisioner recovery complete
I0610 17:49:21.061465  4610 slave.cpp:6127] Finished recovery
I0610 17:49:21.062455  4610 slave.cpp:6309] Querying resource estimator for oversubscribable
resources
I0610 17:49:21.072368  4607 slave.cpp:6323] Received oversubscribable resources {} from the
resource estimator
I0610 17:49:21.076634  4607 process.cpp:3778] Handling HTTP event for process 'slave(759)'
with path: '/slave(759)/containers'
I0610 17:49:21.078667  4607 http.cpp:1115] HTTP GET for /slave(759)/containers from 172.17.0.2:47134
I0610 17:49:21.078789  4607 http.cpp:936] Authorizing principal 'test-principal' to GET the
'/containers' endpoint
I0610 17:49:21.082672  4607 slave.cpp:817] Agent terminating
[       OK ] Endpoint/SlaveEndpointTest.UnauthorizedRequest/2 (57 ms)
[ RUN      ] Endpoint/SlaveEndpointTest.NoAuthorizer/0
I0610 17:49:21.100175  4584 containerizer.cpp:230] Using isolation: posix/cpu,posix/mem,filesystem/posix,network/cni,environment_secret
W0610 17:49:21.100958  4584 backend.cpp:76] Failed to create 'overlay' backend: OverlayBackend
requires root privileges
W0610 17:49:21.101131  4584 backend.cpp:76] Failed to create 'bind' backend: BindBackend requires
root privileges
I0610 17:49:21.101179  4584 provisioner.cpp:255] Using default backend 'copy'
I0610 17:49:21.103585  4584 cluster.cpp:448] Creating default 'local' authorizer
I0610 17:49:21.106282  4603 slave.cpp:248] Mesos agent started on (760)@172.17.0.2:43453
I0610 17:49:21.106325  4603 slave.cpp:249] Flags at startup: --acls="" --appc_simple_discovery_uri_prefix="http://"
--appc_store_dir="/tmp/Endpoint_SlaveEndpointTest_NoAuthorizer_0_sQvNJg/store/appc" --authenticate_http_readonly="true"
--authenticate_http_readwrite="true" --authenticatee="crammd5" --authentication_backoff_factor="1secs"
--authorizer="local" --cgroups_cpu_enable_pids_and_tids_count="false" --cgroups_enable_cfs="false"
--cgroups_hierarchy="/sys/fs/cgroup" --cgroups_limit_swap="false" --cgroups_root="mesos" --container_disk_watch_interval="15secs"
--containerizers="mesos" --credential="/tmp/Endpoint_SlaveEndpointTest_NoAuthorizer_0_sQvNJg/credential"
--default_role="*" --disk_watch_interval="1mins" --docker="docker" --docker_kill_orphans="true"
--docker_registry="https://registry-1.docker.io" --docker_remove_delay="6hrs" --docker_socket="/var/run/docker.sock"
--docker_stop_timeout="0ns" --docker_store_dir="/tmp/Endpoint_SlaveEndpointTest_NoAuthorizer_0_sQvNJg/store/docker"
--docker_volume_checkpoint_dir="/var/run/mesos/isolators/docker/volume" --enforce_container_disk_quota="false"
--executor_registration_timeout="1mins" --executor_reregistration_timeout="2secs" --executor_shutdown_grace_period="5secs"
--fetcher_cache_dir="/tmp/Endpoint_SlaveEndpointTest_NoAuthorizer_0_sQvNJg/fetch" --fetcher_cache_size="2GB"
--frameworks_home="" --gc_delay="1weeks" --gc_disk_headroom="0.1" --hadoop_home="" --help="false"
--hostname_lookup="true" --http_command_executor="false" --http_credentials="/tmp/Endpoint_SlaveEndpointTest_NoAuthorizer_0_sQvNJg/http_credentials"
--http_heartbeat_interval="30secs" --initialize_driver_logging="true" --isolation="posix/cpu,posix/mem"
--launcher="posix" --launcher_dir="/mesos/mesos-1.4.0/_build/src" --logbufsecs="0" --logging_level="INFO"
--max_completed_executors_per_framework="150" --oversubscribed_resources_interval="15secs"
--perf_duration="10secs" --perf_interval="1mins" --port="5051" --qos_correction_interval_min="0ns"
--quiet="false" --recover="reconnect" --recovery_timeout="15mins" --registration_backoff_factor="10ms"
--resources="cpus:2;gpus:0;mem:1024;disk:1024;ports:[31000-32000]" --revocable_cpu_low_priority="true"
--runtime_dir="/tmp/Endpoint_SlaveEndpointTest_NoAuthorizer_0_sQvNJg" --sandbox_directory="/mnt/mesos/sandbox"
--strict="true" --switch_user="true" --systemd_enable_support="true" --systemd_runtime_directory="/run/systemd/system"
--version="false" --work_dir="/tmp/Endpoint_SlaveEndpointTest_NoAuthorizer_0_uPC9pg"
I0610 17:49:21.107327  4603 credentials.hpp:86] Loading credential for authentication from
'/tmp/Endpoint_SlaveEndpointTest_NoAuthorizer_0_sQvNJg/credential'
I0610 17:49:21.107789  4603 slave.cpp:281] Agent using credential for: test-principal
I0610 17:49:21.107867  4603 credentials.hpp:37] Loading credentials for authentication from
'/tmp/Endpoint_SlaveEndpointTest_NoAuthorizer_0_sQvNJg/http_credentials'
I0610 17:49:21.108382  4603 http.cpp:975] Creating default 'basic' HTTP authenticator for
realm 'mesos-agent-readonly'
I0610 17:49:21.108762  4603 http.cpp:975] Creating default 'basic' HTTP authenticator for
realm 'mesos-agent-readwrite'
I0610 17:49:21.110888  4603 slave.cpp:552] Agent resources: cpus(*):2; mem(*):1024; disk(*):1024;
ports(*):[31000-32000]
I0610 17:49:21.111027  4603 slave.cpp:560] Agent attributes: [  ]
I0610 17:49:21.111109  4603 slave.cpp:565] Agent hostname: 52658e270d6d
I0610 17:49:21.111517  4608 status_update_manager.cpp:177] Pausing sending status updates
I0610 17:49:21.113468  4604 state.cpp:62] Recovering state from '/tmp/Endpoint_SlaveEndpointTest_NoAuthorizer_0_uPC9pg/meta'
I0610 17:49:21.114017  4606 status_update_manager.cpp:203] Recovering status update manager
I0610 17:49:21.114488  4607 containerizer.cpp:582] Recovering containerizer
I0610 17:49:21.116701  4603 provisioner.cpp:416] Provisioner recovery complete
I0610 17:49:21.117635  4610 slave.cpp:6127] Finished recovery
I0610 17:49:21.118394  4610 slave.cpp:6309] Querying resource estimator for oversubscribable
resources
I0610 17:49:21.119102  4604 slave.cpp:6323] Received oversubscribable resources {} from the
resource estimator
I0610 17:49:21.124370  4609 process.cpp:3778] Handling HTTP event for process 'slave(760)'
with path: '/slave(760)/monitor/statistics'
I0610 17:49:21.127414  4603 http.cpp:1115] HTTP GET for /slave(760)/monitor/statistics from
172.17.0.2:47136
I0610 17:49:21.127614  4603 http.cpp:936] Authorizing principal 'test-principal' to GET the
'/monitor/statistics' endpoint
I0610 17:49:21.133726  4609 slave.cpp:817] Agent terminating
[       OK ] Endpoint/SlaveEndpointTest.NoAuthorizer/0 (49 ms)
[ RUN      ] Endpoint/SlaveEndpointTest.NoAuthorizer/1
I0610 17:49:21.150622  4584 containerizer.cpp:230] Using isolation: posix/cpu,posix/mem,filesystem/posix,network/cni,environment_secret
W0610 17:49:21.151408  4584 backend.cpp:76] Failed to create 'overlay' backend: OverlayBackend
requires root privileges
W0610 17:49:21.151577  4584 backend.cpp:76] Failed to create 'bind' backend: BindBackend requires
root privileges
I0610 17:49:21.151623  4584 provisioner.cpp:255] Using default backend 'copy'
I0610 17:49:21.154106  4584 cluster.cpp:448] Creating default 'local' authorizer
I0610 17:49:21.156759  4610 slave.cpp:248] Mesos agent started on (761)@172.17.0.2:43453
I0610 17:49:21.156800  4610 slave.cpp:249] Flags at startup: --acls="" --appc_simple_discovery_uri_prefix="http://"
--appc_store_dir="/tmp/Endpoint_SlaveEndpointTest_NoAuthorizer_1_uvyCri/store/appc" --authenticate_http_readonly="true"
--authenticate_http_readwrite="true" --authenticatee="crammd5" --authentication_backoff_factor="1secs"
--authorizer="local" --cgroups_cpu_enable_pids_and_tids_count="false" --cgroups_enable_cfs="false"
--cgroups_hierarchy="/sys/fs/cgroup" --cgroups_limit_swap="false" --cgroups_root="mesos" --container_disk_watch_interval="15secs"
--containerizers="mesos" --credential="/tmp/Endpoint_SlaveEndpointTest_NoAuthorizer_1_uvyCri/credential"
--default_role="*" --disk_watch_interval="1mins" --docker="docker" --docker_kill_orphans="true"
--docker_registry="https://registry-1.docker.io" --docker_remove_delay="6hrs" --docker_socket="/var/run/docker.sock"
--docker_stop_timeout="0ns" --docker_store_dir="/tmp/Endpoint_SlaveEndpointTest_NoAuthorizer_1_uvyCri/store/docker"
--docker_volume_checkpoint_dir="/var/run/mesos/isolators/docker/volume" --enforce_container_disk_quota="false"
--executor_registration_timeout="1mins" --executor_reregistration_timeout="2secs" --executor_shutdown_grace_period="5secs"
--fetcher_cache_dir="/tmp/Endpoint_SlaveEndpointTest_NoAuthorizer_1_uvyCri/fetch" --fetcher_cache_size="2GB"
--frameworks_home="" --gc_delay="1weeks" --gc_disk_headroom="0.1" --hadoop_home="" --help="false"
--hostname_lookup="true" --http_command_executor="false" --http_credentials="/tmp/Endpoint_SlaveEndpointTest_NoAuthorizer_1_uvyCri/http_credentials"
--http_heartbeat_interval="30secs" --initialize_driver_logging="true" --isolation="posix/cpu,posix/mem"
--launcher="posix" --launcher_dir="/mesos/mesos-1.4.0/_build/src" --logbufsecs="0" --logging_level="INFO"
--max_completed_executors_per_framework="150" --oversubscribed_resources_interval="15secs"
--perf_duration="10secs" --perf_interval="1mins" --port="5051" --qos_correction_interval_min="0ns"
--quiet="false" --recover="reconnect" --recovery_timeout="15mins" --registration_backoff_factor="10ms"
--resources="cpus:2;gpus:0;mem:1024;disk:1024;ports:[31000-32000]" --revocable_cpu_low_priority="true"
--runtime_dir="/tmp/Endpoint_SlaveEndpointTest_NoAuthorizer_1_uvyCri" --sandbox_directory="/mnt/mesos/sandbox"
--strict="true" --switch_user="true" --systemd_enable_support="true" --systemd_runtime_directory="/run/systemd/system"
--version="false" --work_dir="/tmp/Endpoint_SlaveEndpointTest_NoAuthorizer_1_ECFYZh"
I0610 17:49:21.157523  4610 credentials.hpp:86] Loading credential for authentication from
'/tmp/Endpoint_SlaveEndpointTest_NoAuthorizer_1_uvyCri/credential'
I0610 17:49:21.157780  4610 slave.cpp:281] Agent using credential for: test-principal
I0610 17:49:21.157810  4610 credentials.hpp:37] Loading credentials for authentication from
'/tmp/Endpoint_SlaveEndpointTest_NoAuthorizer_1_uvyCri/http_credentials'
I0610 17:49:21.158200  4610 http.cpp:975] Creating default 'basic' HTTP authenticator for
realm 'mesos-agent-readonly'
I0610 17:49:21.158432  4610 http.cpp:975] Creating default 'basic' HTTP authenticator for
realm 'mesos-agent-readwrite'
I0610 17:49:21.160441  4610 slave.cpp:552] Agent resources: cpus(*):2; mem(*):1024; disk(*):1024;
ports(*):[31000-32000]
I0610 17:49:21.160580  4610 slave.cpp:560] Agent attributes: [  ]
I0610 17:49:21.160600  4610 slave.cpp:565] Agent hostname: 52658e270d6d
I0610 17:49:21.160897  4603 status_update_manager.cpp:177] Pausing sending status updates
I0610 17:49:21.162736  4609 state.cpp:62] Recovering state from '/tmp/Endpoint_SlaveEndpointTest_NoAuthorizer_1_ECFYZh/meta'
I0610 17:49:21.163566  4605 status_update_manager.cpp:203] Recovering status update manager
I0610 17:49:21.164011  4604 containerizer.cpp:582] Recovering containerizer
I0610 17:49:21.166687  4603 provisioner.cpp:416] Provisioner recovery complete
I0610 17:49:21.167476  4606 slave.cpp:6127] Finished recovery
I0610 17:49:21.168207  4606 slave.cpp:6309] Querying resource estimator for oversubscribable
resources
I0610 17:49:21.168637  4608 slave.cpp:6323] Received oversubscribable resources {} from the
resource estimator
I0610 17:49:21.172519  4605 process.cpp:3778] Handling HTTP event for process 'slave(761)'
with path: '/slave(761)/monitor/statistics.json'
I0610 17:49:21.174537  4604 http.cpp:1115] HTTP GET for /slave(761)/monitor/statistics.json
from 172.17.0.2:47138
I0610 17:49:21.174664  4604 http.cpp:936] Authorizing principal 'test-principal' to GET the
'/monitor/statistics.json' endpoint
I0610 17:49:21.180058  4584 slave.cpp:817] Agent terminating
[       OK ] Endpoint/SlaveEndpointTest.NoAuthorizer/1 (45 ms)
[ RUN      ] Endpoint/SlaveEndpointTest.NoAuthorizer/2
I0610 17:49:21.195207  4584 containerizer.cpp:230] Using isolation: posix/cpu,posix/mem,filesystem/posix,network/cni,environment_secret
W0610 17:49:21.196056  4584 backend.cpp:76] Failed to create 'overlay' backend: OverlayBackend
requires root privileges
W0610 17:49:21.196239  4584 backend.cpp:76] Failed to create 'bind' backend: BindBackend requires
root privileges
I0610 17:49:21.196287  4584 provisioner.cpp:255] Using default backend 'copy'
I0610 17:49:21.198911  4584 cluster.cpp:448] Creating default 'local' authorizer
I0610 17:49:21.201743  4609 slave.cpp:248] Mesos agent started on (762)@172.17.0.2:43453
I0610 17:49:21.201786  4609 slave.cpp:249] Flags at startup: --acls="" --appc_simple_discovery_uri_prefix="http://"
--appc_store_dir="/tmp/Endpoint_SlaveEndpointTest_NoAuthorizer_2_o87SDk/store/appc" --authenticate_http_readonly="true"
--authenticate_http_readwrite="true" --authenticatee="crammd5" --authentication_backoff_factor="1secs"
--authorizer="local" --cgroups_cpu_enable_pids_and_tids_count="false" --cgroups_enable_cfs="false"
--cgroups_hierarchy="/sys/fs/cgroup" --cgroups_limit_swap="false" --cgroups_root="mesos" --container_disk_watch_interval="15secs"
--containerizers="mesos" --credential="/tmp/Endpoint_SlaveEndpointTest_NoAuthorizer_2_o87SDk/credential"
--default_role="*" --disk_watch_interval="1mins" --docker="docker" --docker_kill_orphans="true"
--docker_registry="https://registry-1.docker.io" --docker_remove_delay="6hrs" --docker_socket="/var/run/docker.sock"
--docker_stop_timeout="0ns" --docker_store_dir="/tmp/Endpoint_SlaveEndpointTest_NoAuthorizer_2_o87SDk/store/docker"
--docker_volume_checkpoint_dir="/var/run/mesos/isolators/docker/volume" --enforce_container_disk_quota="false"
--executor_registration_timeout="1mins" --executor_reregistration_timeout="2secs" --executor_shutdown_grace_period="5secs"
--fetcher_cache_dir="/tmp/Endpoint_SlaveEndpointTest_NoAuthorizer_2_o87SDk/fetch" --fetcher_cache_size="2GB"
--frameworks_home="" --gc_delay="1weeks" --gc_disk_headroom="0.1" --hadoop_home="" --help="false"
--hostname_lookup="true" --http_command_executor="false" --http_credentials="/tmp/Endpoint_SlaveEndpointTest_NoAuthorizer_2_o87SDk/http_credentials"
--http_heartbeat_interval="30secs" --initialize_driver_logging="true" --isolation="posix/cpu,posix/mem"
--launcher="posix" --launcher_dir="/mesos/mesos-1.4.0/_build/src" --logbufsecs="0" --logging_level="INFO"
--max_completed_executors_per_framework="150" --oversubscribed_resources_interval="15secs"
--perf_duration="10secs" --perf_interval="1mins" --port="5051" --qos_correction_interval_min="0ns"
--quiet="false" --recover="reconnect" --recovery_timeout="15mins" --registration_backoff_factor="10ms"
--resources="cpus:2;gpus:0;mem:1024;disk:1024;ports:[31000-32000]" --revocable_cpu_low_priority="true"
--runtime_dir="/tmp/Endpoint_SlaveEndpointTest_NoAuthorizer_2_o87SDk" --sandbox_directory="/mnt/mesos/sandbox"
--strict="true" --switch_user="true" --systemd_enable_support="true" --systemd_runtime_directory="/run/systemd/system"
--version="false" --work_dir="/tmp/Endpoint_SlaveEndpointTest_NoAuthorizer_2_GZIM4j"
I0610 17:49:21.202719  4609 credentials.hpp:86] Loading credential for authentication from
'/tmp/Endpoint_SlaveEndpointTest_NoAuthorizer_2_o87SDk/credential'
I0610 17:49:21.203269  4609 slave.cpp:281] Agent using credential for: test-principal
I0610 17:49:21.203307  4609 credentials.hpp:37] Loading credentials for authentication from
'/tmp/Endpoint_SlaveEndpointTest_NoAuthorizer_2_o87SDk/http_credentials'
I0610 17:49:21.203944  4609 http.cpp:975] Creating default 'basic' HTTP authenticator for
realm 'mesos-agent-readonly'
I0610 17:49:21.204442  4609 http.cpp:975] Creating default 'basic' HTTP authenticator for
realm 'mesos-agent-readwrite'
I0610 17:49:21.206662  4609 slave.cpp:552] Agent resources: cpus(*):2; mem(*):1024; disk(*):1024;
ports(*):[31000-32000]
I0610 17:49:21.206804  4609 slave.cpp:560] Agent attributes: [  ]
I0610 17:49:21.206822  4609 slave.cpp:565] Agent hostname: 52658e270d6d
I0610 17:49:21.207278  4605 status_update_manager.cpp:177] Pausing sending status updates
I0610 17:49:21.209846  4605 state.cpp:62] Recovering state from '/tmp/Endpoint_SlaveEndpointTest_NoAuthorizer_2_GZIM4j/meta'
I0610 17:49:21.210525  4605 status_update_manager.cpp:203] Recovering status update manager
I0610 17:49:21.210932  4604 containerizer.cpp:582] Recovering containerizer
I0610 17:49:21.213205  4606 provisioner.cpp:416] Provisioner recovery complete
I0610 17:49:21.213809  4603 slave.cpp:6127] Finished recovery
I0610 17:49:21.214757  4603 slave.cpp:6309] Querying resource estimator for oversubscribable
resources
I0610 17:49:21.215175  4603 slave.cpp:6323] Received oversubscribable resources {} from the
resource estimator
I0610 17:49:21.219327  4607 process.cpp:3778] Handling HTTP event for process 'slave(762)'
with path: '/slave(762)/containers'
I0610 17:49:21.221217  4603 http.cpp:1115] HTTP GET for /slave(762)/containers from 172.17.0.2:47140
I0610 17:49:21.221441  4603 http.cpp:936] Authorizing principal 'test-principal' to GET the
'/containers' endpoint
I0610 17:49:21.226806  4606 slave.cpp:817] Agent terminating
[       OK ] Endpoint/SlaveEndpointTest.NoAuthorizer/2 (47 ms)
[----------] 9 tests from Endpoint/SlaveEndpointTest (434 ms total)

[----------] Global test environment tear-down
[==========] 1589 tests from 176 test cases ran. (710717 ms total)
[  PASSED  ] 1585 tests.
[  FAILED  ] 4 tests, listed below:
[  FAILED  ] DefaultExecutorCheckTest.CommandCheckDeliveredAndReconciled
[  FAILED  ] DefaultExecutorCheckTest.CommandCheckStatusChange
[  FAILED  ] DefaultExecutorCheckTest.CommandCheckSeesParentsEnv
[  FAILED  ] DefaultExecutorCheckTest.CommandCheckSharesWorkDirWithTask

 4 FAILED TESTS
  YOU HAVE 22 DISABLED TESTS

E0610 17:49:21.373330  4611 process.cpp:968] Failed to accept socket: future discarded
make[4]: *** [check-local] Error 1
make[4]: Leaving directory `/mesos/mesos-1.4.0/_build/src'
make[3]: *** [check-am] Error 2
make[3]: Leaving directory `/mesos/mesos-1.4.0/_build/src'
make[2]: *** [check] Error 2
make[2]: Leaving directory `/mesos/mesos-1.4.0/_build/src'
make[1]: *** [check-recursive] Error 1
make[1]: Leaving directory `/mesos/mesos-1.4.0/_build'
make: *** [distcheck] Error 1
+ docker rmi mesos-1497111271-28323
Untagged: mesos-1497111271-28323:latest
Deleted: sha256:0ad9f663a3c7e20cdc37a9e7ce50e64a4363443a809163e43d6369af1b5e040d
Deleted: sha256:6439133b63ef2ddf963ca792c780bfbae65344b90a2d7634a3a07a2071ae197e
Deleted: sha256:7d97c717934b3e927e7542dcb33252dda7d290f87f32618883a73e124ff7e35c
Deleted: sha256:858c7bb9e762344facb1ee9719eb7e753d449198dbe70caa3d435b12396f2dca
Deleted: sha256:0792fd757a7d79167eea59aab793489074936bf9ad1e5ec57ee99d309d238f5f
Deleted: sha256:979fdb459f11781d6a4941e393f4b023cffcba0d4cb39281e74aca000e988f9b
Deleted: sha256:ac5807a059a4d6da6ca43de0906c7bead225070cfcf85000e412481e6f83fab1
Deleted: sha256:7489caae24ae58c1d1db5a41f2fc97aa7b50c3a29bb5239ee90c145514a2462a
Deleted: sha256:9aa06a895b489813121b630dd067026413b819bdec9e2cafbe0213b6cb4e35aa
Deleted: sha256:980d0f58148bf32c612d3a7ff315bd46db1df65c19c2a51da3f1b97f8ae963e4
Deleted: sha256:1fa42f87ae3f0eaaa81a78dbed88d6aef5b6b15ee838b1b9a78aa39f86639990
Deleted: sha256:31972a1658a382bbb4a8b7e6ee9b0475cfae9816a760741020e4cd57a2bf5a69
Deleted: sha256:7db629c6fe30dfef91e6f92cad25889d906ed8ac7e3dad3f331a340f0d10912e
Deleted: sha256:7ddc134f8c93f50a46ed9ce0920bf6bb3499a0906783d0fa21468670b4a0f3f2
Deleted: sha256:a15e54991859cf47609e63d0f80c3e3db22daf735f8b080ecfde58c44a1740ad
Deleted: sha256:6c0973fdb1ebc3a3fce8eb74870ebd78b0a6c32ec95d2598ae385226e7cc76f8
Deleted: sha256:a668ba062d1e3f14a8d004f6dacdac32c10856fd3e994f877882e3f1b22536de
Deleted: sha256:4c92631a2e6b277b2e77819efa65509100637a8491aaf40d9dca3c15fa7b5862
Deleted: sha256:535f9f8260655aafd09e484f2dad6abb42fdebb2b476f4335aad4414cb9a3e49
Deleted: sha256:f4fe82aa8aa9e37760da66cf8ee32b0b250340f7211c2b6881ab81ee082deec7
Deleted: sha256:2cbb22d14041baca49677ca1e6782ffd18bcf8ac2987b13d3e1ce597ac5f339d
Deleted: sha256:816bfc5d88bfdac815884fb0a4673d31db66e14ae9cf23da068e9df982dbc626
Deleted: sha256:b5dacf925c1530ad5efa69c2836a049aa47c5d10b2d354f9fb94ba58f4127adc
Deleted: sha256:737e33966bcfac44e0365e7be093652c4eb2fc3d75dea7875cedae906f4f9b9a
Build step 'Execute shell' marked build as failure

Mime
View raw message