mesos-builds mailing list archives

Site index · List index
Message view « Date » · « Thread »
Top « Date » · « Thread »
From Apache Jenkins Server <jenk...@builds.apache.org>
Subject Build failed in Jenkins: Mesos-Buildbot » autotools,gcc,--verbose,GLOG_v=1 MESOS_VERBOSE=1,centos:7,(ubuntu)&&(!ubuntu-us1)&&(!ubuntu-eu2) #3770
Date Tue, 06 Jun 2017 21:15:56 GMT
See <https://builds.apache.org/job/Mesos-Buildbot/BUILDTOOL=autotools,COMPILER=gcc,CONFIGURATION=--verbose,ENVIRONMENT=GLOG_v=1%20MESOS_VERBOSE=1,OS=centos%3A7,label_exp=(ubuntu)&&(!ubuntu-us1)&&(!ubuntu-eu2)/3770/display/redirect?page=changes>

Changes:

[xujyan] Cleaned up use of 'this' pointers in dispatched callback.

------------------------------------------
[...truncated 27.98 MB...]
I0606 21:15:41.203784  5356 provisioner.cpp:255] Using default backend 'copy'
I0606 21:15:41.210072  5380 slave.cpp:248] Mesos agent started on (753)@172.17.0.2:46707
I0606 21:15:41.210114  5380 slave.cpp:249] Flags at startup: --acls="" --appc_simple_discovery_uri_prefix="http://"
--appc_store_dir="/tmp/Endpoint_SlaveEndpointTest_AuthorizedRequest_2_EzkUCl/store/appc" --authenticate_http_readonly="true"
--authenticate_http_readwrite="true" --authenticatee="crammd5" --authentication_backoff_factor="1secs"
--authorizer="local" --cgroups_cpu_enable_pids_and_tids_count="false" --cgroups_enable_cfs="false"
--cgroups_hierarchy="/sys/fs/cgroup" --cgroups_limit_swap="false" --cgroups_root="mesos" --container_disk_watch_interval="15secs"
--containerizers="mesos" --credential="/tmp/Endpoint_SlaveEndpointTest_AuthorizedRequest_2_EzkUCl/credential"
--default_role="*" --disk_watch_interval="1mins" --docker="docker" --docker_kill_orphans="true"
--docker_registry="https://registry-1.docker.io" --docker_remove_delay="6hrs" --docker_socket="/var/run/docker.sock"
--docker_stop_timeout="0ns" --docker_store_dir="/tmp/Endpoint_SlaveEndpointTest_AuthorizedRequest_2_EzkUCl/store/docker"
--docker_volume_checkpoint_dir="/var/run/mesos/isolators/docker/volume" --enforce_container_disk_quota="false"
--executor_registration_timeout="1mins" --executor_reregistration_timeout="2secs" --executor_shutdown_grace_period="5secs"
--fetcher_cache_dir="/tmp/Endpoint_SlaveEndpointTest_AuthorizedRequest_2_EzkUCl/fetch" --fetcher_cache_size="2GB"
--frameworks_home="" --gc_delay="1weeks" --gc_disk_headroom="0.1" --hadoop_home="" --help="false"
--hostname_lookup="true" --http_command_executor="false" --http_credentials="/tmp/Endpoint_SlaveEndpointTest_AuthorizedRequest_2_EzkUCl/http_credentials"
--http_heartbeat_interval="30secs" --initialize_driver_logging="true" --isolation="posix/cpu,posix/mem"
--launcher="posix" --launcher_dir="/mesos/mesos-1.4.0/_build/src" --logbufsecs="0" --logging_level="INFO"
--max_completed_executors_per_framework="150" --oversubscribed_resources_interval="15secs"
--perf_duration="10secs" --perf_interval="1mins" --port="5051" --qos_correction_interval_min="0ns"
--quiet="false" --recover="reconnect" --recovery_timeout="15mins" --registration_backoff_factor="10ms"
--resources="cpus:2;gpus:0;mem:1024;disk:1024;ports:[31000-32000]" --revocable_cpu_low_priority="true"
--runtime_dir="/tmp/Endpoint_SlaveEndpointTest_AuthorizedRequest_2_EzkUCl" --sandbox_directory="/mnt/mesos/sandbox"
--strict="true" --switch_user="true" --systemd_enable_support="true" --systemd_runtime_directory="/run/systemd/system"
--version="false" --work_dir="/tmp/Endpoint_SlaveEndpointTest_AuthorizedRequest_2_SAoDEv"
I0606 21:15:41.210816  5380 credentials.hpp:86] Loading credential for authentication from
'/tmp/Endpoint_SlaveEndpointTest_AuthorizedRequest_2_EzkUCl/credential'
I0606 21:15:41.211067  5380 slave.cpp:281] Agent using credential for: test-principal
I0606 21:15:41.211092  5380 credentials.hpp:37] Loading credentials for authentication from
'/tmp/Endpoint_SlaveEndpointTest_AuthorizedRequest_2_EzkUCl/http_credentials'
I0606 21:15:41.211436  5380 http.cpp:975] Creating default 'basic' HTTP authenticator for
realm 'mesos-agent-readonly'
I0606 21:15:41.211648  5380 http.cpp:975] Creating default 'basic' HTTP authenticator for
realm 'mesos-agent-readwrite'
I0606 21:15:41.213618  5380 slave.cpp:552] Agent resources: cpus(*):2; mem(*):1024; disk(*):1024;
ports(*):[31000-32000]
I0606 21:15:41.213755  5380 slave.cpp:560] Agent attributes: [  ]
I0606 21:15:41.213776  5380 slave.cpp:565] Agent hostname: cd4183ff8627
I0606 21:15:41.214284  5382 status_update_manager.cpp:177] Pausing sending status updates
I0606 21:15:41.216006  5376 state.cpp:62] Recovering state from '/tmp/Endpoint_SlaveEndpointTest_AuthorizedRequest_2_SAoDEv/meta'
I0606 21:15:41.216487  5380 status_update_manager.cpp:203] Recovering status update manager
I0606 21:15:41.216749  5382 containerizer.cpp:582] Recovering containerizer
I0606 21:15:41.219018  5376 provisioner.cpp:416] Provisioner recovery complete
I0606 21:15:41.219571  5379 slave.cpp:6127] Finished recovery
I0606 21:15:41.220228  5379 slave.cpp:6309] Querying resource estimator for oversubscribable
resources
I0606 21:15:41.220713  5380 slave.cpp:6323] Received oversubscribable resources {} from the
resource estimator
I0606 21:15:41.224741  5377 process.cpp:3778] Handling HTTP event for process 'slave(753)'
with path: '/slave(753)/containers'
I0606 21:15:41.226824  5377 http.cpp:1115] HTTP GET for /slave(753)/containers from 172.17.0.2:36882
I0606 21:15:41.226948  5377 http.cpp:936] Authorizing principal 'test-principal' to GET the
'/containers' endpoint
I0606 21:15:41.232586  5356 slave.cpp:817] Agent terminating
[       OK ] Endpoint/SlaveEndpointTest.AuthorizedRequest/2 (44 ms)
[ RUN      ] Endpoint/SlaveEndpointTest.UnauthorizedRequest/0
I0606 21:15:41.247941  5356 containerizer.cpp:230] Using isolation: posix/cpu,posix/mem,filesystem/posix,network/cni,environment_secret
W0606 21:15:41.248775  5356 backend.cpp:76] Failed to create 'overlay' backend: OverlayBackend
requires root privileges
W0606 21:15:41.248978  5356 backend.cpp:76] Failed to create 'bind' backend: BindBackend requires
root privileges
I0606 21:15:41.249027  5356 provisioner.cpp:255] Using default backend 'copy'
I0606 21:15:41.254562  5378 slave.cpp:248] Mesos agent started on (754)@172.17.0.2:46707
I0606 21:15:41.254606  5378 slave.cpp:249] Flags at startup: --acls="" --appc_simple_discovery_uri_prefix="http://"
--appc_store_dir="/tmp/Endpoint_SlaveEndpointTest_UnauthorizedRequest_0_wB1VUH/store/appc"
--authenticate_http_readonly="true" --authenticate_http_readwrite="true" --authenticatee="crammd5"
--authentication_backoff_factor="1secs" --authorizer="local" --cgroups_cpu_enable_pids_and_tids_count="false"
--cgroups_enable_cfs="false" --cgroups_hierarchy="/sys/fs/cgroup" --cgroups_limit_swap="false"
--cgroups_root="mesos" --container_disk_watch_interval="15secs" --containerizers="mesos" --credential="/tmp/Endpoint_SlaveEndpointTest_UnauthorizedRequest_0_wB1VUH/credential"
--default_role="*" --disk_watch_interval="1mins" --docker="docker" --docker_kill_orphans="true"
--docker_registry="https://registry-1.docker.io" --docker_remove_delay="6hrs" --docker_socket="/var/run/docker.sock"
--docker_stop_timeout="0ns" --docker_store_dir="/tmp/Endpoint_SlaveEndpointTest_UnauthorizedRequest_0_wB1VUH/store/docker"
--docker_volume_checkpoint_dir="/var/run/mesos/isolators/docker/volume" --enforce_container_disk_quota="false"
--executor_registration_timeout="1mins" --executor_reregistration_timeout="2secs" --executor_shutdown_grace_period="5secs"
--fetcher_cache_dir="/tmp/Endpoint_SlaveEndpointTest_UnauthorizedRequest_0_wB1VUH/fetch" --fetcher_cache_size="2GB"
--frameworks_home="" --gc_delay="1weeks" --gc_disk_headroom="0.1" --hadoop_home="" --help="false"
--hostname_lookup="true" --http_command_executor="false" --http_credentials="/tmp/Endpoint_SlaveEndpointTest_UnauthorizedRequest_0_wB1VUH/http_credentials"
--http_heartbeat_interval="30secs" --initialize_driver_logging="true" --isolation="posix/cpu,posix/mem"
--launcher="posix" --launcher_dir="/mesos/mesos-1.4.0/_build/src" --logbufsecs="0" --logging_level="INFO"
--max_completed_executors_per_framework="150" --oversubscribed_resources_interval="15secs"
--perf_duration="10secs" --perf_interval="1mins" --port="5051" --qos_correction_interval_min="0ns"
--quiet="false" --recover="reconnect" --recovery_timeout="15mins" --registration_backoff_factor="10ms"
--resources="cpus:2;gpus:0;mem:1024;disk:1024;ports:[31000-32000]" --revocable_cpu_low_priority="true"
--runtime_dir="/tmp/Endpoint_SlaveEndpointTest_UnauthorizedRequest_0_wB1VUH" --sandbox_directory="/mnt/mesos/sandbox"
--strict="true" --switch_user="true" --systemd_enable_support="true" --systemd_runtime_directory="/run/systemd/system"
--version="false" --work_dir="/tmp/Endpoint_SlaveEndpointTest_UnauthorizedRequest_0_U1VkPR"
I0606 21:15:41.255326  5378 credentials.hpp:86] Loading credential for authentication from
'/tmp/Endpoint_SlaveEndpointTest_UnauthorizedRequest_0_wB1VUH/credential'
I0606 21:15:41.255575  5378 slave.cpp:281] Agent using credential for: test-principal
I0606 21:15:41.255599  5378 credentials.hpp:37] Loading credentials for authentication from
'/tmp/Endpoint_SlaveEndpointTest_UnauthorizedRequest_0_wB1VUH/http_credentials'
I0606 21:15:41.255952  5378 http.cpp:975] Creating default 'basic' HTTP authenticator for
realm 'mesos-agent-readonly'
I0606 21:15:41.256176  5378 http.cpp:975] Creating default 'basic' HTTP authenticator for
realm 'mesos-agent-readwrite'
I0606 21:15:41.258159  5378 slave.cpp:552] Agent resources: cpus(*):2; mem(*):1024; disk(*):1024;
ports(*):[31000-32000]
I0606 21:15:41.258296  5378 slave.cpp:560] Agent attributes: [  ]
I0606 21:15:41.258318  5378 slave.cpp:565] Agent hostname: cd4183ff8627
I0606 21:15:41.258556  5379 status_update_manager.cpp:177] Pausing sending status updates
I0606 21:15:41.260468  5375 state.cpp:62] Recovering state from '/tmp/Endpoint_SlaveEndpointTest_UnauthorizedRequest_0_U1VkPR/meta'
I0606 21:15:41.261189  5375 status_update_manager.cpp:203] Recovering status update manager
I0606 21:15:41.261503  5375 containerizer.cpp:582] Recovering containerizer
I0606 21:15:41.264353  5375 provisioner.cpp:416] Provisioner recovery complete
I0606 21:15:41.265014  5381 slave.cpp:6127] Finished recovery
I0606 21:15:41.265805  5381 slave.cpp:6309] Querying resource estimator for oversubscribable
resources
I0606 21:15:41.266347  5380 slave.cpp:6323] Received oversubscribable resources {} from the
resource estimator
I0606 21:15:41.270341  5375 process.cpp:3778] Handling HTTP event for process 'slave(754)'
with path: '/slave(754)/monitor/statistics'
I0606 21:15:41.272786  5375 http.cpp:1115] HTTP GET for /slave(754)/monitor/statistics from
172.17.0.2:36884
I0606 21:15:41.272907  5375 http.cpp:936] Authorizing principal 'test-principal' to GET the
'/monitor/statistics' endpoint
I0606 21:15:41.277359  5382 slave.cpp:817] Agent terminating
[       OK ] Endpoint/SlaveEndpointTest.UnauthorizedRequest/0 (44 ms)
[ RUN      ] Endpoint/SlaveEndpointTest.UnauthorizedRequest/1
I0606 21:15:41.292937  5356 containerizer.cpp:230] Using isolation: posix/cpu,posix/mem,filesystem/posix,network/cni,environment_secret
W0606 21:15:41.293784  5356 backend.cpp:76] Failed to create 'overlay' backend: OverlayBackend
requires root privileges
W0606 21:15:41.294009  5356 backend.cpp:76] Failed to create 'bind' backend: BindBackend requires
root privileges
I0606 21:15:41.294061  5356 provisioner.cpp:255] Using default backend 'copy'
I0606 21:15:41.299141  5382 slave.cpp:248] Mesos agent started on (755)@172.17.0.2:46707
I0606 21:15:41.299180  5382 slave.cpp:249] Flags at startup: --acls="" --appc_simple_discovery_uri_prefix="http://"
--appc_store_dir="/tmp/Endpoint_SlaveEndpointTest_UnauthorizedRequest_1_8Ir6F4/store/appc"
--authenticate_http_readonly="true" --authenticate_http_readwrite="true" --authenticatee="crammd5"
--authentication_backoff_factor="1secs" --authorizer="local" --cgroups_cpu_enable_pids_and_tids_count="false"
--cgroups_enable_cfs="false" --cgroups_hierarchy="/sys/fs/cgroup" --cgroups_limit_swap="false"
--cgroups_root="mesos" --container_disk_watch_interval="15secs" --containerizers="mesos" --credential="/tmp/Endpoint_SlaveEndpointTest_UnauthorizedRequest_1_8Ir6F4/credential"
--default_role="*" --disk_watch_interval="1mins" --docker="docker" --docker_kill_orphans="true"
--docker_registry="https://registry-1.docker.io" --docker_remove_delay="6hrs" --docker_socket="/var/run/docker.sock"
--docker_stop_timeout="0ns" --docker_store_dir="/tmp/Endpoint_SlaveEndpointTest_UnauthorizedRequest_1_8Ir6F4/store/docker"
--docker_volume_checkpoint_dir="/var/run/mesos/isolators/docker/volume" --enforce_container_disk_quota="false"
--executor_registration_timeout="1mins" --executor_reregistration_timeout="2secs" --executor_shutdown_grace_period="5secs"
--fetcher_cache_dir="/tmp/Endpoint_SlaveEndpointTest_UnauthorizedRequest_1_8Ir6F4/fetch" --fetcher_cache_size="2GB"
--frameworks_home="" --gc_delay="1weeks" --gc_disk_headroom="0.1" --hadoop_home="" --help="false"
--hostname_lookup="true" --http_command_executor="false" --http_credentials="/tmp/Endpoint_SlaveEndpointTest_UnauthorizedRequest_1_8Ir6F4/http_credentials"
--http_heartbeat_interval="30secs" --initialize_driver_logging="true" --isolation="posix/cpu,posix/mem"
--launcher="posix" --launcher_dir="/mesos/mesos-1.4.0/_build/src" --logbufsecs="0" --logging_level="INFO"
--max_completed_executors_per_framework="150" --oversubscribed_resources_interval="15secs"
--perf_duration="10secs" --perf_interval="1mins" --port="5051" --qos_correction_interval_min="0ns"
--quiet="false" --recover="reconnect" --recovery_timeout="15mins" --registration_backoff_factor="10ms"
--resources="cpus:2;gpus:0;mem:1024;disk:1024;ports:[31000-32000]" --revocable_cpu_low_priority="true"
--runtime_dir="/tmp/Endpoint_SlaveEndpointTest_UnauthorizedRequest_1_8Ir6F4" --sandbox_directory="/mnt/mesos/sandbox"
--strict="true" --switch_user="true" --systemd_enable_support="true" --systemd_runtime_directory="/run/systemd/system"
--version="false" --work_dir="/tmp/Endpoint_SlaveEndpointTest_UnauthorizedRequest_1_a6Jfte"
I0606 21:15:41.299917  5382 credentials.hpp:86] Loading credential for authentication from
'/tmp/Endpoint_SlaveEndpointTest_UnauthorizedRequest_1_8Ir6F4/credential'
I0606 21:15:41.300192  5382 slave.cpp:281] Agent using credential for: test-principal
I0606 21:15:41.300220  5382 credentials.hpp:37] Loading credentials for authentication from
'/tmp/Endpoint_SlaveEndpointTest_UnauthorizedRequest_1_8Ir6F4/http_credentials'
I0606 21:15:41.300597  5382 http.cpp:975] Creating default 'basic' HTTP authenticator for
realm 'mesos-agent-readonly'
I0606 21:15:41.300843  5382 http.cpp:975] Creating default 'basic' HTTP authenticator for
realm 'mesos-agent-readwrite'
I0606 21:15:41.302902  5382 slave.cpp:552] Agent resources: cpus(*):2; mem(*):1024; disk(*):1024;
ports(*):[31000-32000]
I0606 21:15:41.303043  5382 slave.cpp:560] Agent attributes: [  ]
I0606 21:15:41.303062  5382 slave.cpp:565] Agent hostname: cd4183ff8627
I0606 21:15:41.303422  5381 status_update_manager.cpp:177] Pausing sending status updates
I0606 21:15:41.305346  5375 state.cpp:62] Recovering state from '/tmp/Endpoint_SlaveEndpointTest_UnauthorizedRequest_1_a6Jfte/meta'
I0606 21:15:41.306027  5378 status_update_manager.cpp:203] Recovering status update manager
I0606 21:15:41.306258  5379 containerizer.cpp:582] Recovering containerizer
I0606 21:15:41.308472  5382 provisioner.cpp:416] Provisioner recovery complete
I0606 21:15:41.309151  5380 slave.cpp:6127] Finished recovery
I0606 21:15:41.309923  5380 slave.cpp:6309] Querying resource estimator for oversubscribable
resources
I0606 21:15:41.310513  5381 slave.cpp:6323] Received oversubscribable resources {} from the
resource estimator
I0606 21:15:41.314519  5377 process.cpp:3778] Handling HTTP event for process 'slave(755)'
with path: '/slave(755)/monitor/statistics.json'
I0606 21:15:41.316542  5375 http.cpp:1115] HTTP GET for /slave(755)/monitor/statistics.json
from 172.17.0.2:36886
I0606 21:15:41.316664  5375 http.cpp:936] Authorizing principal 'test-principal' to GET the
'/monitor/statistics.json' endpoint
I0606 21:15:41.320719  5376 slave.cpp:817] Agent terminating
[       OK ] Endpoint/SlaveEndpointTest.UnauthorizedRequest/1 (42 ms)
[ RUN      ] Endpoint/SlaveEndpointTest.UnauthorizedRequest/2
I0606 21:15:41.337146  5356 containerizer.cpp:230] Using isolation: posix/cpu,posix/mem,filesystem/posix,network/cni,environment_secret
W0606 21:15:41.338101  5356 backend.cpp:76] Failed to create 'overlay' backend: OverlayBackend
requires root privileges
W0606 21:15:41.338459  5356 backend.cpp:76] Failed to create 'bind' backend: BindBackend requires
root privileges
I0606 21:15:41.338520  5356 provisioner.cpp:255] Using default backend 'copy'
I0606 21:15:41.343606  5375 slave.cpp:248] Mesos agent started on (756)@172.17.0.2:46707
I0606 21:15:41.343648  5375 slave.cpp:249] Flags at startup: --acls="" --appc_simple_discovery_uri_prefix="http://"
--appc_store_dir="/tmp/Endpoint_SlaveEndpointTest_UnauthorizedRequest_2_KGOZTr/store/appc"
--authenticate_http_readonly="true" --authenticate_http_readwrite="true" --authenticatee="crammd5"
--authentication_backoff_factor="1secs" --authorizer="local" --cgroups_cpu_enable_pids_and_tids_count="false"
--cgroups_enable_cfs="false" --cgroups_hierarchy="/sys/fs/cgroup" --cgroups_limit_swap="false"
--cgroups_root="mesos" --container_disk_watch_interval="15secs" --containerizers="mesos" --credential="/tmp/Endpoint_SlaveEndpointTest_UnauthorizedRequest_2_KGOZTr/credential"
--default_role="*" --disk_watch_interval="1mins" --docker="docker" --docker_kill_orphans="true"
--docker_registry="https://registry-1.docker.io" --docker_remove_delay="6hrs" --docker_socket="/var/run/docker.sock"
--docker_stop_timeout="0ns" --docker_store_dir="/tmp/Endpoint_SlaveEndpointTest_UnauthorizedRequest_2_KGOZTr/store/docker"
--docker_volume_checkpoint_dir="/var/run/mesos/isolators/docker/volume" --enforce_container_disk_quota="false"
--executor_registration_timeout="1mins" --executor_reregistration_timeout="2secs" --executor_shutdown_grace_period="5secs"
--fetcher_cache_dir="/tmp/Endpoint_SlaveEndpointTest_UnauthorizedRequest_2_KGOZTr/fetch" --fetcher_cache_size="2GB"
--frameworks_home="" --gc_delay="1weeks" --gc_disk_headroom="0.1" --hadoop_home="" --help="false"
--hostname_lookup="true" --http_command_executor="false" --http_credentials="/tmp/Endpoint_SlaveEndpointTest_UnauthorizedRequest_2_KGOZTr/http_credentials"
--http_heartbeat_interval="30secs" --initialize_driver_logging="true" --isolation="posix/cpu,posix/mem"
--launcher="posix" --launcher_dir="/mesos/mesos-1.4.0/_build/src" --logbufsecs="0" --logging_level="INFO"
--max_completed_executors_per_framework="150" --oversubscribed_resources_interval="15secs"
--perf_duration="10secs" --perf_interval="1mins" --port="5051" --qos_correction_interval_min="0ns"
--quiet="false" --recover="reconnect" --recovery_timeout="15mins" --registration_backoff_factor="10ms"
--resources="cpus:2;gpus:0;mem:1024;disk:1024;ports:[31000-32000]" --revocable_cpu_low_priority="true"
--runtime_dir="/tmp/Endpoint_SlaveEndpointTest_UnauthorizedRequest_2_KGOZTr" --sandbox_directory="/mnt/mesos/sandbox"
--strict="true" --switch_user="true" --systemd_enable_support="true" --systemd_runtime_directory="/run/systemd/system"
--version="false" --work_dir="/tmp/Endpoint_SlaveEndpointTest_UnauthorizedRequest_2_aItWzB"
I0606 21:15:41.344399  5375 credentials.hpp:86] Loading credential for authentication from
'/tmp/Endpoint_SlaveEndpointTest_UnauthorizedRequest_2_KGOZTr/credential'
I0606 21:15:41.344657  5375 slave.cpp:281] Agent using credential for: test-principal
I0606 21:15:41.344682  5375 credentials.hpp:37] Loading credentials for authentication from
'/tmp/Endpoint_SlaveEndpointTest_UnauthorizedRequest_2_KGOZTr/http_credentials'
I0606 21:15:41.345036  5375 http.cpp:975] Creating default 'basic' HTTP authenticator for
realm 'mesos-agent-readonly'
I0606 21:15:41.345262  5375 http.cpp:975] Creating default 'basic' HTTP authenticator for
realm 'mesos-agent-readwrite'
I0606 21:15:41.347270  5375 slave.cpp:552] Agent resources: cpus(*):2; mem(*):1024; disk(*):1024;
ports(*):[31000-32000]
I0606 21:15:41.347409  5375 slave.cpp:560] Agent attributes: [  ]
I0606 21:15:41.347431  5375 slave.cpp:565] Agent hostname: cd4183ff8627
I0606 21:15:41.347659  5380 status_update_manager.cpp:177] Pausing sending status updates
I0606 21:15:41.349642  5382 state.cpp:62] Recovering state from '/tmp/Endpoint_SlaveEndpointTest_UnauthorizedRequest_2_aItWzB/meta'
I0606 21:15:41.350188  5376 status_update_manager.cpp:203] Recovering status update manager
I0606 21:15:41.350484  5378 containerizer.cpp:582] Recovering containerizer
I0606 21:15:41.352669  5375 provisioner.cpp:416] Provisioner recovery complete
I0606 21:15:41.353358  5380 slave.cpp:6127] Finished recovery
I0606 21:15:41.354022  5380 slave.cpp:6309] Querying resource estimator for oversubscribable
resources
I0606 21:15:41.354408  5379 slave.cpp:6323] Received oversubscribable resources {} from the
resource estimator
I0606 21:15:41.358786  5379 process.cpp:3778] Handling HTTP event for process 'slave(756)'
with path: '/slave(756)/containers'
I0606 21:15:41.360646  5380 http.cpp:1115] HTTP GET for /slave(756)/containers from 172.17.0.2:36888
I0606 21:15:41.360765  5380 http.cpp:936] Authorizing principal 'test-principal' to GET the
'/containers' endpoint
I0606 21:15:41.364274  5382 slave.cpp:817] Agent terminating
[       OK ] Endpoint/SlaveEndpointTest.UnauthorizedRequest/2 (41 ms)
[ RUN      ] Endpoint/SlaveEndpointTest.NoAuthorizer/0
I0606 21:15:41.379478  5356 containerizer.cpp:230] Using isolation: posix/cpu,posix/mem,filesystem/posix,network/cni,environment_secret
W0606 21:15:41.380431  5356 backend.cpp:76] Failed to create 'overlay' backend: OverlayBackend
requires root privileges
W0606 21:15:41.380743  5356 backend.cpp:76] Failed to create 'bind' backend: BindBackend requires
root privileges
I0606 21:15:41.380803  5356 provisioner.cpp:255] Using default backend 'copy'
I0606 21:15:41.383401  5356 cluster.cpp:448] Creating default 'local' authorizer
I0606 21:15:41.387583  5380 slave.cpp:248] Mesos agent started on (757)@172.17.0.2:46707
I0606 21:15:41.387624  5380 slave.cpp:249] Flags at startup: --acls="" --appc_simple_discovery_uri_prefix="http://"
--appc_store_dir="/tmp/Endpoint_SlaveEndpointTest_NoAuthorizer_0_4ESqzP/store/appc" --authenticate_http_readonly="true"
--authenticate_http_readwrite="true" --authenticatee="crammd5" --authentication_backoff_factor="1secs"
--authorizer="local" --cgroups_cpu_enable_pids_and_tids_count="false" --cgroups_enable_cfs="false"
--cgroups_hierarchy="/sys/fs/cgroup" --cgroups_limit_swap="false" --cgroups_root="mesos" --container_disk_watch_interval="15secs"
--containerizers="mesos" --credential="/tmp/Endpoint_SlaveEndpointTest_NoAuthorizer_0_4ESqzP/credential"
--default_role="*" --disk_watch_interval="1mins" --docker="docker" --docker_kill_orphans="true"
--docker_registry="https://registry-1.docker.io" --docker_remove_delay="6hrs" --docker_socket="/var/run/docker.sock"
--docker_stop_timeout="0ns" --docker_store_dir="/tmp/Endpoint_SlaveEndpointTest_NoAuthorizer_0_4ESqzP/store/docker"
--docker_volume_checkpoint_dir="/var/run/mesos/isolators/docker/volume" --enforce_container_disk_quota="false"
--executor_registration_timeout="1mins" --executor_reregistration_timeout="2secs" --executor_shutdown_grace_period="5secs"
--fetcher_cache_dir="/tmp/Endpoint_SlaveEndpointTest_NoAuthorizer_0_4ESqzP/fetch" --fetcher_cache_size="2GB"
--frameworks_home="" --gc_delay="1weeks" --gc_disk_headroom="0.1" --hadoop_home="" --help="false"
--hostname_lookup="true" --http_command_executor="false" --http_credentials="/tmp/Endpoint_SlaveEndpointTest_NoAuthorizer_0_4ESqzP/http_credentials"
--http_heartbeat_interval="30secs" --initialize_driver_logging="true" --isolation="posix/cpu,posix/mem"
--launcher="posix" --launcher_dir="/mesos/mesos-1.4.0/_build/src" --logbufsecs="0" --logging_level="INFO"
--max_completed_executors_per_framework="150" --oversubscribed_resources_interval="15secs"
--perf_duration="10secs" --perf_interval="1mins" --port="5051" --qos_correction_interval_min="0ns"
--quiet="false" --recover="reconnect" --recovery_timeout="15mins" --registration_backoff_factor="10ms"
--resources="cpus:2;gpus:0;mem:1024;disk:1024;ports:[31000-32000]" --revocable_cpu_low_priority="true"
--runtime_dir="/tmp/Endpoint_SlaveEndpointTest_NoAuthorizer_0_4ESqzP" --sandbox_directory="/mnt/mesos/sandbox"
--strict="true" --switch_user="true" --systemd_enable_support="true" --systemd_runtime_directory="/run/systemd/system"
--version="false" --work_dir="/tmp/Endpoint_SlaveEndpointTest_NoAuthorizer_0_ecqA8Y"
I0606 21:15:41.388320  5380 credentials.hpp:86] Loading credential for authentication from
'/tmp/Endpoint_SlaveEndpointTest_NoAuthorizer_0_4ESqzP/credential'
I0606 21:15:41.388578  5380 slave.cpp:281] Agent using credential for: test-principal
I0606 21:15:41.388602  5380 credentials.hpp:37] Loading credentials for authentication from
'/tmp/Endpoint_SlaveEndpointTest_NoAuthorizer_0_4ESqzP/http_credentials'
I0606 21:15:41.388950  5380 http.cpp:975] Creating default 'basic' HTTP authenticator for
realm 'mesos-agent-readonly'
I0606 21:15:41.389163  5380 http.cpp:975] Creating default 'basic' HTTP authenticator for
realm 'mesos-agent-readwrite'
I0606 21:15:41.391160  5380 slave.cpp:552] Agent resources: cpus(*):2; mem(*):1024; disk(*):1024;
ports(*):[31000-32000]
I0606 21:15:41.391301  5380 slave.cpp:560] Agent attributes: [  ]
I0606 21:15:41.391326  5380 slave.cpp:565] Agent hostname: cd4183ff8627
I0606 21:15:41.393828  5380 status_update_manager.cpp:177] Pausing sending status updates
I0606 21:15:41.394134  5378 state.cpp:62] Recovering state from '/tmp/Endpoint_SlaveEndpointTest_NoAuthorizer_0_ecqA8Y/meta'
I0606 21:15:41.394660  5378 status_update_manager.cpp:203] Recovering status update manager
I0606 21:15:41.395043  5378 containerizer.cpp:582] Recovering containerizer
I0606 21:15:41.397243  5376 provisioner.cpp:416] Provisioner recovery complete
I0606 21:15:41.397778  5381 slave.cpp:6127] Finished recovery
I0606 21:15:41.398414  5381 slave.cpp:6309] Querying resource estimator for oversubscribable
resources
I0606 21:15:41.398763  5382 slave.cpp:6323] Received oversubscribable resources {} from the
resource estimator
I0606 21:15:41.402663  5381 process.cpp:3778] Handling HTTP event for process 'slave(757)'
with path: '/slave(757)/monitor/statistics'
I0606 21:15:41.404702  5379 http.cpp:1115] HTTP GET for /slave(757)/monitor/statistics from
172.17.0.2:36890
I0606 21:15:41.404826  5379 http.cpp:936] Authorizing principal 'test-principal' to GET the
'/monitor/statistics' endpoint
I0606 21:15:41.410315  5356 slave.cpp:817] Agent terminating
[       OK ] Endpoint/SlaveEndpointTest.NoAuthorizer/0 (46 ms)
[ RUN      ] Endpoint/SlaveEndpointTest.NoAuthorizer/1
I0606 21:15:41.430578  5356 containerizer.cpp:230] Using isolation: posix/cpu,posix/mem,filesystem/posix,network/cni,environment_secret
W0606 21:15:41.431730  5356 backend.cpp:76] Failed to create 'overlay' backend: OverlayBackend
requires root privileges
W0606 21:15:41.431962  5356 backend.cpp:76] Failed to create 'bind' backend: BindBackend requires
root privileges
I0606 21:15:41.432126  5356 provisioner.cpp:255] Using default backend 'copy'
I0606 21:15:41.435390  5356 cluster.cpp:448] Creating default 'local' authorizer
I0606 21:15:41.439611  5376 slave.cpp:248] Mesos agent started on (758)@172.17.0.2:46707
I0606 21:15:41.439652  5376 slave.cpp:249] Flags at startup: --acls="" --appc_simple_discovery_uri_prefix="http://"
--appc_store_dir="/tmp/Endpoint_SlaveEndpointTest_NoAuthorizer_1_maKwJd/store/appc" --authenticate_http_readonly="true"
--authenticate_http_readwrite="true" --authenticatee="crammd5" --authentication_backoff_factor="1secs"
--authorizer="local" --cgroups_cpu_enable_pids_and_tids_count="false" --cgroups_enable_cfs="false"
--cgroups_hierarchy="/sys/fs/cgroup" --cgroups_limit_swap="false" --cgroups_root="mesos" --container_disk_watch_interval="15secs"
--containerizers="mesos" --credential="/tmp/Endpoint_SlaveEndpointTest_NoAuthorizer_1_maKwJd/credential"
--default_role="*" --disk_watch_interval="1mins" --docker="docker" --docker_kill_orphans="true"
--docker_registry="https://registry-1.docker.io" --docker_remove_delay="6hrs" --docker_socket="/var/run/docker.sock"
--docker_stop_timeout="0ns" --docker_store_dir="/tmp/Endpoint_SlaveEndpointTest_NoAuthorizer_1_maKwJd/store/docker"
--docker_volume_checkpoint_dir="/var/run/mesos/isolators/docker/volume" --enforce_container_disk_quota="false"
--executor_registration_timeout="1mins" --executor_reregistration_timeout="2secs" --executor_shutdown_grace_period="5secs"
--fetcher_cache_dir="/tmp/Endpoint_SlaveEndpointTest_NoAuthorizer_1_maKwJd/fetch" --fetcher_cache_size="2GB"
--frameworks_home="" --gc_delay="1weeks" --gc_disk_headroom="0.1" --hadoop_home="" --help="false"
--hostname_lookup="true" --http_command_executor="false" --http_credentials="/tmp/Endpoint_SlaveEndpointTest_NoAuthorizer_1_maKwJd/http_credentials"
--http_heartbeat_interval="30secs" --initialize_driver_logging="true" --isolation="posix/cpu,posix/mem"
--launcher="posix" --launcher_dir="/mesos/mesos-1.4.0/_build/src" --logbufsecs="0" --logging_level="INFO"
--max_completed_executors_per_framework="150" --oversubscribed_resources_interval="15secs"
--perf_duration="10secs" --perf_interval="1mins" --port="5051" --qos_correction_interval_min="0ns"
--quiet="false" --recover="reconnect" --recovery_timeout="15mins" --registration_backoff_factor="10ms"
--resources="cpus:2;gpus:0;mem:1024;disk:1024;ports:[31000-32000]" --revocable_cpu_low_priority="true"
--runtime_dir="/tmp/Endpoint_SlaveEndpointTest_NoAuthorizer_1_maKwJd" --sandbox_directory="/mnt/mesos/sandbox"
--strict="true" --switch_user="true" --systemd_enable_support="true" --systemd_runtime_directory="/run/systemd/system"
--version="false" --work_dir="/tmp/Endpoint_SlaveEndpointTest_NoAuthorizer_1_84zIan"
I0606 21:15:41.440448  5376 credentials.hpp:86] Loading credential for authentication from
'/tmp/Endpoint_SlaveEndpointTest_NoAuthorizer_1_maKwJd/credential'
I0606 21:15:41.440763  5376 slave.cpp:281] Agent using credential for: test-principal
I0606 21:15:41.440790  5376 credentials.hpp:37] Loading credentials for authentication from
'/tmp/Endpoint_SlaveEndpointTest_NoAuthorizer_1_maKwJd/http_credentials'
I0606 21:15:41.441197  5376 http.cpp:975] Creating default 'basic' HTTP authenticator for
realm 'mesos-agent-readonly'
I0606 21:15:41.441479  5376 http.cpp:975] Creating default 'basic' HTTP authenticator for
realm 'mesos-agent-readwrite'
I0606 21:15:41.443608  5376 slave.cpp:552] Agent resources: cpus(*):2; mem(*):1024; disk(*):1024;
ports(*):[31000-32000]
I0606 21:15:41.443750  5376 slave.cpp:560] Agent attributes: [  ]
I0606 21:15:41.443769  5376 slave.cpp:565] Agent hostname: cd4183ff8627
I0606 21:15:41.444103  5377 status_update_manager.cpp:177] Pausing sending status updates
I0606 21:15:41.446172  5379 state.cpp:62] Recovering state from '/tmp/Endpoint_SlaveEndpointTest_NoAuthorizer_1_84zIan/meta'
I0606 21:15:41.446619  5382 status_update_manager.cpp:203] Recovering status update manager
I0606 21:15:41.446898  5382 containerizer.cpp:582] Recovering containerizer
I0606 21:15:41.449050  5375 provisioner.cpp:416] Provisioner recovery complete
I0606 21:15:41.449640  5382 slave.cpp:6127] Finished recovery
I0606 21:15:41.450302  5382 slave.cpp:6309] Querying resource estimator for oversubscribable
resources
I0606 21:15:41.450779  5376 slave.cpp:6323] Received oversubscribable resources {} from the
resource estimator
I0606 21:15:41.454821  5381 process.cpp:3778] Handling HTTP event for process 'slave(758)'
with path: '/slave(758)/monitor/statistics.json'
I0606 21:15:41.456924  5377 http.cpp:1115] HTTP GET for /slave(758)/monitor/statistics.json
from 172.17.0.2:36892
I0606 21:15:41.457042  5377 http.cpp:936] Authorizing principal 'test-principal' to GET the
'/monitor/statistics.json' endpoint
I0606 21:15:41.461719  5377 slave.cpp:817] Agent terminating
[       OK ] Endpoint/SlaveEndpointTest.NoAuthorizer/1 (51 ms)
[ RUN      ] Endpoint/SlaveEndpointTest.NoAuthorizer/2
I0606 21:15:41.477955  5356 containerizer.cpp:230] Using isolation: posix/cpu,posix/mem,filesystem/posix,network/cni,environment_secret
W0606 21:15:41.478912  5356 backend.cpp:76] Failed to create 'overlay' backend: OverlayBackend
requires root privileges
W0606 21:15:41.479094  5356 backend.cpp:76] Failed to create 'bind' backend: BindBackend requires
root privileges
I0606 21:15:41.479138  5356 provisioner.cpp:255] Using default backend 'copy'
I0606 21:15:41.481676  5356 cluster.cpp:448] Creating default 'local' authorizer
I0606 21:15:41.484568  5377 slave.cpp:248] Mesos agent started on (759)@172.17.0.2:46707
I0606 21:15:41.484607  5377 slave.cpp:249] Flags at startup: --acls="" --appc_simple_discovery_uri_prefix="http://"
--appc_store_dir="/tmp/Endpoint_SlaveEndpointTest_NoAuthorizer_2_EzIlqC/store/appc" --authenticate_http_readonly="true"
--authenticate_http_readwrite="true" --authenticatee="crammd5" --authentication_backoff_factor="1secs"
--authorizer="local" --cgroups_cpu_enable_pids_and_tids_count="false" --cgroups_enable_cfs="false"
--cgroups_hierarchy="/sys/fs/cgroup" --cgroups_limit_swap="false" --cgroups_root="mesos" --container_disk_watch_interval="15secs"
--containerizers="mesos" --credential="/tmp/Endpoint_SlaveEndpointTest_NoAuthorizer_2_EzIlqC/credential"
--default_role="*" --disk_watch_interval="1mins" --docker="docker" --docker_kill_orphans="true"
--docker_registry="https://registry-1.docker.io" --docker_remove_delay="6hrs" --docker_socket="/var/run/docker.sock"
--docker_stop_timeout="0ns" --docker_store_dir="/tmp/Endpoint_SlaveEndpointTest_NoAuthorizer_2_EzIlqC/store/docker"
--docker_volume_checkpoint_dir="/var/run/mesos/isolators/docker/volume" --enforce_container_disk_quota="false"
--executor_registration_timeout="1mins" --executor_reregistration_timeout="2secs" --executor_shutdown_grace_period="5secs"
--fetcher_cache_dir="/tmp/Endpoint_SlaveEndpointTest_NoAuthorizer_2_EzIlqC/fetch" --fetcher_cache_size="2GB"
--frameworks_home="" --gc_delay="1weeks" --gc_disk_headroom="0.1" --hadoop_home="" --help="false"
--hostname_lookup="true" --http_command_executor="false" --http_credentials="/tmp/Endpoint_SlaveEndpointTest_NoAuthorizer_2_EzIlqC/http_credentials"
--http_heartbeat_interval="30secs" --initialize_driver_logging="true" --isolation="posix/cpu,posix/mem"
--launcher="posix" --launcher_dir="/mesos/mesos-1.4.0/_build/src" --logbufsecs="0" --logging_level="INFO"
--max_completed_executors_per_framework="150" --oversubscribed_resources_interval="15secs"
--perf_duration="10secs" --perf_interval="1mins" --port="5051" --qos_correction_interval_min="0ns"
--quiet="false" --recover="reconnect" --recovery_timeout="15mins" --registration_backoff_factor="10ms"
--resources="cpus:2;gpus:0;mem:1024;disk:1024;ports:[31000-32000]" --revocable_cpu_low_priority="true"
--runtime_dir="/tmp/Endpoint_SlaveEndpointTest_NoAuthorizer_2_EzIlqC" --sandbox_directory="/mnt/mesos/sandbox"
--strict="true" --switch_user="true" --systemd_enable_support="true" --systemd_runtime_directory="/run/systemd/system"
--version="false" --work_dir="/tmp/Endpoint_SlaveEndpointTest_NoAuthorizer_2_Q1YzJL"
I0606 21:15:41.485342  5377 credentials.hpp:86] Loading credential for authentication from
'/tmp/Endpoint_SlaveEndpointTest_NoAuthorizer_2_EzIlqC/credential'
I0606 21:15:41.485622  5377 slave.cpp:281] Agent using credential for: test-principal
I0606 21:15:41.485654  5377 credentials.hpp:37] Loading credentials for authentication from
'/tmp/Endpoint_SlaveEndpointTest_NoAuthorizer_2_EzIlqC/http_credentials'
I0606 21:15:41.486033  5377 http.cpp:975] Creating default 'basic' HTTP authenticator for
realm 'mesos-agent-readonly'
I0606 21:15:41.486274  5377 http.cpp:975] Creating default 'basic' HTTP authenticator for
realm 'mesos-agent-readwrite'
I0606 21:15:41.488297  5377 slave.cpp:552] Agent resources: cpus(*):2; mem(*):1024; disk(*):1024;
ports(*):[31000-32000]
I0606 21:15:41.488435  5377 slave.cpp:560] Agent attributes: [  ]
I0606 21:15:41.488456  5377 slave.cpp:565] Agent hostname: cd4183ff8627
I0606 21:15:41.488842  5375 status_update_manager.cpp:177] Pausing sending status updates
I0606 21:15:41.490813  5382 state.cpp:62] Recovering state from '/tmp/Endpoint_SlaveEndpointTest_NoAuthorizer_2_Q1YzJL/meta'
I0606 21:15:41.491385  5378 status_update_manager.cpp:203] Recovering status update manager
I0606 21:15:41.491778  5375 containerizer.cpp:582] Recovering containerizer
I0606 21:15:41.494035  5381 provisioner.cpp:416] Provisioner recovery complete
I0606 21:15:41.494767  5380 slave.cpp:6127] Finished recovery
I0606 21:15:41.495476  5380 slave.cpp:6309] Querying resource estimator for oversubscribable
resources
I0606 21:15:41.495935  5381 slave.cpp:6323] Received oversubscribable resources {} from the
resource estimator
I0606 21:15:41.499825  5375 process.cpp:3778] Handling HTTP event for process 'slave(759)'
with path: '/slave(759)/containers'
I0606 21:15:41.501932  5381 http.cpp:1115] HTTP GET for /slave(759)/containers from 172.17.0.2:36894
I0606 21:15:41.502064  5381 http.cpp:936] Authorizing principal 'test-principal' to GET the
'/containers' endpoint
I0606 21:15:41.507764  5378 slave.cpp:817] Agent terminating
[       OK ] Endpoint/SlaveEndpointTest.NoAuthorizer/2 (46 ms)
[----------] 9 tests from Endpoint/SlaveEndpointTest (411 ms total)

[----------] Global test environment tear-down
[==========] 1585 tests from 176 test cases ran. (748796 ms total)
[  PASSED  ] 1580 tests.
[  FAILED  ] 5 tests, listed below:
[  FAILED  ] CommandExecutorCheckTest.CommandCheckDeliveredAndReconciled
[  FAILED  ] DefaultExecutorCheckTest.CommandCheckDeliveredAndReconciled
[  FAILED  ] DefaultExecutorCheckTest.CommandCheckStatusChange
[  FAILED  ] DefaultExecutorCheckTest.CommandCheckSeesParentsEnv
[  FAILED  ] DefaultExecutorCheckTest.CommandCheckSharesWorkDirWithTask

 5 FAILED TESTS
  YOU HAVE 22 DISABLED TESTS

E0606 21:15:41.662946  5383 process.cpp:968] Failed to accept socket: future discarded
make[4]: *** [check-local] Error 1
make[4]: Leaving directory `/mesos/mesos-1.4.0/_build/src'
make[3]: *** [check-am] Error 2
make[3]: Leaving directory `/mesos/mesos-1.4.0/_build/src'
make[2]: *** [check] Error 2
make[2]: Leaving directory `/mesos/mesos-1.4.0/_build/src'
make[1]: *** [check-recursive] Error 1
make[1]: Leaving directory `/mesos/mesos-1.4.0/_build'
make: *** [distcheck] Error 1
+ docker rmi mesos-1496778738-31700
Untagged: mesos-1496778738-31700:latest
Deleted: sha256:ef55273f58adcd554bdaeb06e078e40399cd6d5fdb46823424aedb1919f98f23
Deleted: sha256:98af9a109123e5183c91e15b01f0a712d8e2e66062e1bb2727ee629b64628b91
Deleted: sha256:5be0943dee33dd707c752692ea7bada79f177e9058e83ca92705fa6ba488c4bd
Deleted: sha256:752363613f243ca076a557aca4dd8a0d31cac43ac4819629523a6c77a937e65e
Deleted: sha256:492e11e7c4f5afd579913cda742128f463048075d23bff82961f9f4dba11bc47
Deleted: sha256:dc726ca77834367fad5475c27fbfdd013bd914593b417ede80ac9954de304794
Deleted: sha256:c496932a93fddec0c72362bd3b1c15f42ce7bf72631d47ebef4d14589ef7c3f3
Deleted: sha256:de1eaf99339e8d9102c9e94f733cf612b44e77ca5000955b5f1e0dfabe2175be
Deleted: sha256:be128decbd6ed0ba8ff815c83cb623b70ef27aa482cba049150f95d8ba978537
Deleted: sha256:10efffcd5bcfa9bb1177c5c171b4f38cbb8637f984547bea6c166f4fad41e02f
Deleted: sha256:3db6a870c42d06836337c42e1b05df380bed8f23f5eca77ad82e76f4e2d2ec43
Deleted: sha256:cf099046569f251766de57dae003be397610484319bd45edae7f6bb34b9d33f1
Deleted: sha256:f16a43cb91e0cfbcbc2630fff3d165ecb4920c17ee4135e5cb5b596a26f721dc
Deleted: sha256:129fb0919b5c3e1c71c66d4d256d506d8a00f5d8cd19f0896d78e009541c313b
Deleted: sha256:f8ce2a9ae4a132ed53c533d98298af97418b487d6e2625826b697a7cebd782db
Deleted: sha256:fab4619e6dc239272708fbe4eb78b38498b6d0c0d14dbbddfdbc8a7c87f4c7ee
Deleted: sha256:983593e49692dbbcdcbd0cb96b0e9abb46e692b2b30dadfaaa8e3f66135c31bf
Deleted: sha256:baf720319ac8a46b4bdd1fa72fa4442029d88c8c543a94d55f0c4f83621fb483
Deleted: sha256:ba48019e8fb8235b49a82b7b09f9126e373711b91d73865ab4822270cca33efd
Deleted: sha256:92d383ffdb8a8733fd213051c71cf1faa77135a7ef4480f0983a228b7fcc6259
Deleted: sha256:3255b9ed0cf187ebb1ed65385853b6949c0c3d9679bae8e5cdb30d77dd0f9fe8
Deleted: sha256:b83892afafb4364975045439f31c80c3d89d485cc7c53ec05b583c99d5de8d12
Deleted: sha256:afa5b322652ced040b1aa0a36eb7cc38f149541da4cfab2aa7f6a44b69ca500d
Deleted: sha256:86fb671575ce0e400e716d5ad0ac677618184d924d3651a9b584a59b0abe2c01
Deleted: sha256:f2ba09e9db894e8a2b3f3fdbc3bb7272bd08f1a4ef520cda4baa940d6f4c74e6
Build step 'Execute shell' marked build as failure
Not sending mail to unregistered user xujyan@apple.com

Mime
View raw message