mesos-builds mailing list archives

Site index · List index
Message view « Date » · « Thread »
Top « Date » · « Thread »
From Apache Jenkins Server <jenk...@builds.apache.org>
Subject Build failed in Jenkins: Mesos-Reviewbot #18386
Date Wed, 14 Jun 2017 22:58:20 GMT
See <https://builds.apache.org/job/Mesos-Reviewbot/18386/display/redirect>

------------------------------------------
[...truncated 28.45 MB...]
I0614 22:58:12.697398  4577 containerizer.cpp:230] Using isolation: posix/cpu,posix/mem,filesystem/posix,network/cni,environment_secret
W0614 22:58:12.698217  4577 backend.cpp:76] Failed to create 'overlay' backend: OverlayBackend
requires root privileges
W0614 22:58:12.698402  4577 backend.cpp:76] Failed to create 'bind' backend: BindBackend requires
root privileges
I0614 22:58:12.698447  4577 provisioner.cpp:255] Using default backend 'copy'
I0614 22:58:12.704742  4596 slave.cpp:248] Mesos agent started on (763)@172.17.0.2:44725
I0614 22:58:12.704829  4596 slave.cpp:249] Flags at startup: --acls="" --appc_simple_discovery_uri_prefix="http://"
--appc_store_dir="/tmp/Endpoint_SlaveEndpointTest_AuthorizedRequest_2_mSIKEc/store/appc" --authenticate_http_readonly="true"
--authenticate_http_readwrite="true" --authenticatee="crammd5" --authentication_backoff_factor="1secs"
--authorizer="local" --cgroups_cpu_enable_pids_and_tids_count="false" --cgroups_enable_cfs="false"
--cgroups_hierarchy="/sys/fs/cgroup" --cgroups_limit_swap="false" --cgroups_root="mesos" --container_disk_watch_interval="15secs"
--containerizers="mesos" --credential="/tmp/Endpoint_SlaveEndpointTest_AuthorizedRequest_2_mSIKEc/credential"
--default_role="*" --disk_watch_interval="1mins" --docker="docker" --docker_kill_orphans="true"
--docker_registry="https://registry-1.docker.io" --docker_remove_delay="6hrs" --docker_socket="/var/run/docker.sock"
--docker_stop_timeout="0ns" --docker_store_dir="/tmp/Endpoint_SlaveEndpointTest_AuthorizedRequest_2_mSIKEc/store/docker"
--docker_volume_checkpoint_dir="/var/run/mesos/isolators/docker/volume" --enforce_container_disk_quota="false"
--executor_registration_timeout="1mins" --executor_reregistration_timeout="2secs" --executor_shutdown_grace_period="5secs"
--fetcher_cache_dir="/tmp/Endpoint_SlaveEndpointTest_AuthorizedRequest_2_mSIKEc/fetch" --fetcher_cache_size="2GB"
--frameworks_home="" --gc_delay="1weeks" --gc_disk_headroom="0.1" --hadoop_home="" --help="false"
--hostname_lookup="true" --http_command_executor="false" --http_credentials="/tmp/Endpoint_SlaveEndpointTest_AuthorizedRequest_2_mSIKEc/http_credentials"
--http_heartbeat_interval="30secs" --initialize_driver_logging="true" --isolation="posix/cpu,posix/mem"
--launcher="posix" --launcher_dir="/mesos/mesos-1.4.0/_build/src" --logbufsecs="0" --logging_level="INFO"
--max_completed_executors_per_framework="150" --oversubscribed_resources_interval="15secs"
--perf_duration="10secs" --perf_interval="1mins" --port="5051" --qos_correction_interval_min="0ns"
--quiet="false" --recover="reconnect" --recovery_timeout="15mins" --registration_backoff_factor="10ms"
--resources="cpus:2;gpus:0;mem:1024;disk:1024;ports:[31000-32000]" --revocable_cpu_low_priority="true"
--runtime_dir="/tmp/Endpoint_SlaveEndpointTest_AuthorizedRequest_2_mSIKEc" --sandbox_directory="/mnt/mesos/sandbox"
--strict="true" --switch_user="true" --systemd_enable_support="true" --systemd_runtime_directory="/run/systemd/system"
--version="false" --work_dir="/tmp/Endpoint_SlaveEndpointTest_AuthorizedRequest_2_ZaG6sc"
I0614 22:58:12.705978  4596 credentials.hpp:86] Loading credential for authentication from
'/tmp/Endpoint_SlaveEndpointTest_AuthorizedRequest_2_mSIKEc/credential'
I0614 22:58:12.706609  4596 slave.cpp:281] Agent using credential for: test-principal
I0614 22:58:12.707011  4596 credentials.hpp:37] Loading credentials for authentication from
'/tmp/Endpoint_SlaveEndpointTest_AuthorizedRequest_2_mSIKEc/http_credentials'
I0614 22:58:12.707836  4596 http.cpp:975] Creating default 'basic' HTTP authenticator for
realm 'mesos-agent-readonly'
I0614 22:58:12.708269  4596 http.cpp:975] Creating default 'basic' HTTP authenticator for
realm 'mesos-agent-readwrite'
I0614 22:58:12.710886  4596 slave.cpp:552] Agent resources: cpus(*):2; mem(*):1024; disk(*):1024;
ports(*):[31000-32000]
I0614 22:58:12.711441  4596 slave.cpp:560] Agent attributes: [  ]
I0614 22:58:12.711495  4596 slave.cpp:565] Agent hostname: e3a75529a11c
I0614 22:58:12.711894  4599 status_update_manager.cpp:177] Pausing sending status updates
I0614 22:58:12.714077  4599 state.cpp:62] Recovering state from '/tmp/Endpoint_SlaveEndpointTest_AuthorizedRequest_2_ZaG6sc/meta'
I0614 22:58:12.714917  4603 status_update_manager.cpp:203] Recovering status update manager
I0614 22:58:12.715322  4603 containerizer.cpp:582] Recovering containerizer
I0614 22:58:12.717939  4601 provisioner.cpp:416] Provisioner recovery complete
I0614 22:58:12.718957  4601 slave.cpp:6127] Finished recovery
I0614 22:58:12.720438  4601 slave.cpp:6309] Querying resource estimator for oversubscribable
resources
I0614 22:58:12.721663  4602 slave.cpp:6323] Received oversubscribable resources {} from the
resource estimator
I0614 22:58:12.727555  4598 process.cpp:3778] Handling HTTP event for process 'slave(763)'
with path: '/slave(763)/containers'
I0614 22:58:12.730590  4598 http.cpp:1115] HTTP GET for /slave(763)/containers from 172.17.0.2:59772
I0614 22:58:12.731344  4598 http.cpp:936] Authorizing principal 'test-principal' to GET the
'/containers' endpoint
I0614 22:58:12.738806  4602 slave.cpp:817] Agent terminating
[       OK ] Endpoint/SlaveEndpointTest.AuthorizedRequest/2 (70 ms)
[ RUN      ] Endpoint/SlaveEndpointTest.UnauthorizedRequest/0
I0614 22:58:12.768980  4577 containerizer.cpp:230] Using isolation: posix/cpu,posix/mem,filesystem/posix,network/cni,environment_secret
W0614 22:58:12.769917  4577 backend.cpp:76] Failed to create 'overlay' backend: OverlayBackend
requires root privileges
W0614 22:58:12.770107  4577 backend.cpp:76] Failed to create 'bind' backend: BindBackend requires
root privileges
I0614 22:58:12.770153  4577 provisioner.cpp:255] Using default backend 'copy'
I0614 22:58:12.777246  4596 slave.cpp:248] Mesos agent started on (764)@172.17.0.2:44725
I0614 22:58:12.777294  4596 slave.cpp:249] Flags at startup: --acls="" --appc_simple_discovery_uri_prefix="http://"
--appc_store_dir="/tmp/Endpoint_SlaveEndpointTest_UnauthorizedRequest_0_ARJO1d/store/appc"
--authenticate_http_readonly="true" --authenticate_http_readwrite="true" --authenticatee="crammd5"
--authentication_backoff_factor="1secs" --authorizer="local" --cgroups_cpu_enable_pids_and_tids_count="false"
--cgroups_enable_cfs="false" --cgroups_hierarchy="/sys/fs/cgroup" --cgroups_limit_swap="false"
--cgroups_root="mesos" --container_disk_watch_interval="15secs" --containerizers="mesos" --credential="/tmp/Endpoint_SlaveEndpointTest_UnauthorizedRequest_0_ARJO1d/credential"
--default_role="*" --disk_watch_interval="1mins" --docker="docker" --docker_kill_orphans="true"
--docker_registry="https://registry-1.docker.io" --docker_remove_delay="6hrs" --docker_socket="/var/run/docker.sock"
--docker_stop_timeout="0ns" --docker_store_dir="/tmp/Endpoint_SlaveEndpointTest_UnauthorizedRequest_0_ARJO1d/store/docker"
--docker_volume_checkpoint_dir="/var/run/mesos/isolators/docker/volume" --enforce_container_disk_quota="false"
--executor_registration_timeout="1mins" --executor_reregistration_timeout="2secs" --executor_shutdown_grace_period="5secs"
--fetcher_cache_dir="/tmp/Endpoint_SlaveEndpointTest_UnauthorizedRequest_0_ARJO1d/fetch" --fetcher_cache_size="2GB"
--frameworks_home="" --gc_delay="1weeks" --gc_disk_headroom="0.1" --hadoop_home="" --help="false"
--hostname_lookup="true" --http_command_executor="false" --http_credentials="/tmp/Endpoint_SlaveEndpointTest_UnauthorizedRequest_0_ARJO1d/http_credentials"
--http_heartbeat_interval="30secs" --initialize_driver_logging="true" --isolation="posix/cpu,posix/mem"
--launcher="posix" --launcher_dir="/mesos/mesos-1.4.0/_build/src" --logbufsecs="0" --logging_level="INFO"
--max_completed_executors_per_framework="150" --oversubscribed_resources_interval="15secs"
--perf_duration="10secs" --perf_interval="1mins" --port="5051" --qos_correction_interval_min="0ns"
--quiet="false" --recover="reconnect" --recovery_timeout="15mins" --registration_backoff_factor="10ms"
--resources="cpus:2;gpus:0;mem:1024;disk:1024;ports:[31000-32000]" --revocable_cpu_low_priority="true"
--runtime_dir="/tmp/Endpoint_SlaveEndpointTest_UnauthorizedRequest_0_ARJO1d" --sandbox_directory="/mnt/mesos/sandbox"
--strict="true" --switch_user="true" --systemd_enable_support="true" --systemd_runtime_directory="/run/systemd/system"
--version="false" --work_dir="/tmp/Endpoint_SlaveEndpointTest_UnauthorizedRequest_0_XRBEEd"
I0614 22:58:12.778545  4596 credentials.hpp:86] Loading credential for authentication from
'/tmp/Endpoint_SlaveEndpointTest_UnauthorizedRequest_0_ARJO1d/credential'
I0614 22:58:12.778983  4596 slave.cpp:281] Agent using credential for: test-principal
I0614 22:58:12.779176  4596 credentials.hpp:37] Loading credentials for authentication from
'/tmp/Endpoint_SlaveEndpointTest_UnauthorizedRequest_0_ARJO1d/http_credentials'
I0614 22:58:12.779754  4596 http.cpp:975] Creating default 'basic' HTTP authenticator for
realm 'mesos-agent-readonly'
I0614 22:58:12.780303  4596 http.cpp:975] Creating default 'basic' HTTP authenticator for
realm 'mesos-agent-readwrite'
I0614 22:58:12.782989  4596 slave.cpp:552] Agent resources: cpus(*):2; mem(*):1024; disk(*):1024;
ports(*):[31000-32000]
I0614 22:58:12.783145  4596 slave.cpp:560] Agent attributes: [  ]
I0614 22:58:12.783239  4596 slave.cpp:565] Agent hostname: e3a75529a11c
I0614 22:58:12.783507  4597 status_update_manager.cpp:177] Pausing sending status updates
I0614 22:58:12.786603  4600 state.cpp:62] Recovering state from '/tmp/Endpoint_SlaveEndpointTest_UnauthorizedRequest_0_XRBEEd/meta'
I0614 22:58:12.787163  4600 status_update_manager.cpp:203] Recovering status update manager
I0614 22:58:12.787493  4600 containerizer.cpp:582] Recovering containerizer
I0614 22:58:12.790182  4600 provisioner.cpp:416] Provisioner recovery complete
I0614 22:58:12.791007  4600 slave.cpp:6127] Finished recovery
I0614 22:58:12.791606  4600 slave.cpp:6309] Querying resource estimator for oversubscribable
resources
I0614 22:58:12.792693  4602 slave.cpp:6323] Received oversubscribable resources {} from the
resource estimator
I0614 22:58:12.797067  4601 process.cpp:3778] Handling HTTP event for process 'slave(764)'
with path: '/slave(764)/monitor/statistics'
I0614 22:58:12.800215  4601 http.cpp:1115] HTTP GET for /slave(764)/monitor/statistics from
172.17.0.2:59774
I0614 22:58:12.801151  4601 http.cpp:936] Authorizing principal 'test-principal' to GET the
'/monitor/statistics' endpoint
I0614 22:58:12.805516  4599 slave.cpp:817] Agent terminating
[       OK ] Endpoint/SlaveEndpointTest.UnauthorizedRequest/0 (52 ms)
[ RUN      ] Endpoint/SlaveEndpointTest.UnauthorizedRequest/1
I0614 22:58:12.821265  4577 containerizer.cpp:230] Using isolation: posix/cpu,posix/mem,filesystem/posix,network/cni,environment_secret
W0614 22:58:12.822192  4577 backend.cpp:76] Failed to create 'overlay' backend: OverlayBackend
requires root privileges
W0614 22:58:12.822376  4577 backend.cpp:76] Failed to create 'bind' backend: BindBackend requires
root privileges
I0614 22:58:12.822424  4577 provisioner.cpp:255] Using default backend 'copy'
I0614 22:58:12.828272  4601 slave.cpp:248] Mesos agent started on (765)@172.17.0.2:44725
I0614 22:58:12.828321  4601 slave.cpp:249] Flags at startup: --acls="" --appc_simple_discovery_uri_prefix="http://"
--appc_store_dir="/tmp/Endpoint_SlaveEndpointTest_UnauthorizedRequest_1_8Mbc0f/store/appc"
--authenticate_http_readonly="true" --authenticate_http_readwrite="true" --authenticatee="crammd5"
--authentication_backoff_factor="1secs" --authorizer="local" --cgroups_cpu_enable_pids_and_tids_count="false"
--cgroups_enable_cfs="false" --cgroups_hierarchy="/sys/fs/cgroup" --cgroups_limit_swap="false"
--cgroups_root="mesos" --container_disk_watch_interval="15secs" --containerizers="mesos" --credential="/tmp/Endpoint_SlaveEndpointTest_UnauthorizedRequest_1_8Mbc0f/credential"
--default_role="*" --disk_watch_interval="1mins" --docker="docker" --docker_kill_orphans="true"
--docker_registry="https://registry-1.docker.io" --docker_remove_delay="6hrs" --docker_socket="/var/run/docker.sock"
--docker_stop_timeout="0ns" --docker_store_dir="/tmp/Endpoint_SlaveEndpointTest_UnauthorizedRequest_1_8Mbc0f/store/docker"
--docker_volume_checkpoint_dir="/var/run/mesos/isolators/docker/volume" --enforce_container_disk_quota="false"
--executor_registration_timeout="1mins" --executor_reregistration_timeout="2secs" --executor_shutdown_grace_period="5secs"
--fetcher_cache_dir="/tmp/Endpoint_SlaveEndpointTest_UnauthorizedRequest_1_8Mbc0f/fetch" --fetcher_cache_size="2GB"
--frameworks_home="" --gc_delay="1weeks" --gc_disk_headroom="0.1" --hadoop_home="" --help="false"
--hostname_lookup="true" --http_command_executor="false" --http_credentials="/tmp/Endpoint_SlaveEndpointTest_UnauthorizedRequest_1_8Mbc0f/http_credentials"
--http_heartbeat_interval="30secs" --initialize_driver_logging="true" --isolation="posix/cpu,posix/mem"
--launcher="posix" --launcher_dir="/mesos/mesos-1.4.0/_build/src" --logbufsecs="0" --logging_level="INFO"
--max_completed_executors_per_framework="150" --oversubscribed_resources_interval="15secs"
--perf_duration="10secs" --perf_interval="1mins" --port="5051" --qos_correction_interval_min="0ns"
--quiet="false" --recover="reconnect" --recovery_timeout="15mins" --registration_backoff_factor="10ms"
--resources="cpus:2;gpus:0;mem:1024;disk:1024;ports:[31000-32000]" --revocable_cpu_low_priority="true"
--runtime_dir="/tmp/Endpoint_SlaveEndpointTest_UnauthorizedRequest_1_8Mbc0f" --sandbox_directory="/mnt/mesos/sandbox"
--strict="true" --switch_user="true" --systemd_enable_support="true" --systemd_runtime_directory="/run/systemd/system"
--version="false" --work_dir="/tmp/Endpoint_SlaveEndpointTest_UnauthorizedRequest_1_xKhruf"
I0614 22:58:12.829293  4601 credentials.hpp:86] Loading credential for authentication from
'/tmp/Endpoint_SlaveEndpointTest_UnauthorizedRequest_1_8Mbc0f/credential'
I0614 22:58:12.829783  4601 slave.cpp:281] Agent using credential for: test-principal
I0614 22:58:12.829829  4601 credentials.hpp:37] Loading credentials for authentication from
'/tmp/Endpoint_SlaveEndpointTest_UnauthorizedRequest_1_8Mbc0f/http_credentials'
I0614 22:58:12.830543  4601 http.cpp:975] Creating default 'basic' HTTP authenticator for
realm 'mesos-agent-readonly'
I0614 22:58:12.831058  4601 http.cpp:975] Creating default 'basic' HTTP authenticator for
realm 'mesos-agent-readwrite'
I0614 22:58:12.833573  4601 slave.cpp:552] Agent resources: cpus(*):2; mem(*):1024; disk(*):1024;
ports(*):[31000-32000]
I0614 22:58:12.833729  4601 slave.cpp:560] Agent attributes: [  ]
I0614 22:58:12.833840  4601 slave.cpp:565] Agent hostname: e3a75529a11c
I0614 22:58:12.834272  4597 status_update_manager.cpp:177] Pausing sending status updates
I0614 22:58:12.836741  4599 state.cpp:62] Recovering state from '/tmp/Endpoint_SlaveEndpointTest_UnauthorizedRequest_1_xKhruf/meta'
I0614 22:58:12.837414  4599 status_update_manager.cpp:203] Recovering status update manager
I0614 22:58:12.837798  4598 containerizer.cpp:582] Recovering containerizer
I0614 22:58:12.840116  4603 provisioner.cpp:416] Provisioner recovery complete
I0614 22:58:12.840880  4599 slave.cpp:6127] Finished recovery
I0614 22:58:12.841495  4599 slave.cpp:6309] Querying resource estimator for oversubscribable
resources
I0614 22:58:12.842533  4600 slave.cpp:6323] Received oversubscribable resources {} from the
resource estimator
I0614 22:58:12.847465  4597 process.cpp:3778] Handling HTTP event for process 'slave(765)'
with path: '/slave(765)/monitor/statistics.json'
I0614 22:58:12.850065  4597 http.cpp:1115] HTTP GET for /slave(765)/monitor/statistics.json
from 172.17.0.2:59776
I0614 22:58:12.850436  4597 http.cpp:936] Authorizing principal 'test-principal' to GET the
'/monitor/statistics.json' endpoint
I0614 22:58:12.855125  4577 slave.cpp:817] Agent terminating
[       OK ] Endpoint/SlaveEndpointTest.UnauthorizedRequest/1 (65 ms)
[ RUN      ] Endpoint/SlaveEndpointTest.UnauthorizedRequest/2
I0614 22:58:12.887117  4577 containerizer.cpp:230] Using isolation: posix/cpu,posix/mem,filesystem/posix,network/cni,environment_secret
W0614 22:58:12.887915  4577 backend.cpp:76] Failed to create 'overlay' backend: OverlayBackend
requires root privileges
W0614 22:58:12.888149  4577 backend.cpp:76] Failed to create 'bind' backend: BindBackend requires
root privileges
I0614 22:58:12.888196  4577 provisioner.cpp:255] Using default backend 'copy'
I0614 22:58:12.893710  4597 slave.cpp:248] Mesos agent started on (766)@172.17.0.2:44725
I0614 22:58:12.893812  4597 slave.cpp:249] Flags at startup: --acls="" --appc_simple_discovery_uri_prefix="http://"
--appc_store_dir="/tmp/Endpoint_SlaveEndpointTest_UnauthorizedRequest_2_c5etCi/store/appc"
--authenticate_http_readonly="true" --authenticate_http_readwrite="true" --authenticatee="crammd5"
--authentication_backoff_factor="1secs" --authorizer="local" --cgroups_cpu_enable_pids_and_tids_count="false"
--cgroups_enable_cfs="false" --cgroups_hierarchy="/sys/fs/cgroup" --cgroups_limit_swap="false"
--cgroups_root="mesos" --container_disk_watch_interval="15secs" --containerizers="mesos" --credential="/tmp/Endpoint_SlaveEndpointTest_UnauthorizedRequest_2_c5etCi/credential"
--default_role="*" --disk_watch_interval="1mins" --docker="docker" --docker_kill_orphans="true"
--docker_registry="https://registry-1.docker.io" --docker_remove_delay="6hrs" --docker_socket="/var/run/docker.sock"
--docker_stop_timeout="0ns" --docker_store_dir="/tmp/Endpoint_SlaveEndpointTest_UnauthorizedRequest_2_c5etCi/store/docker"
--docker_volume_checkpoint_dir="/var/run/mesos/isolators/docker/volume" --enforce_container_disk_quota="false"
--executor_registration_timeout="1mins" --executor_reregistration_timeout="2secs" --executor_shutdown_grace_period="5secs"
--fetcher_cache_dir="/tmp/Endpoint_SlaveEndpointTest_UnauthorizedRequest_2_c5etCi/fetch" --fetcher_cache_size="2GB"
--frameworks_home="" --gc_delay="1weeks" --gc_disk_headroom="0.1" --hadoop_home="" --help="false"
--hostname_lookup="true" --http_command_executor="false" --http_credentials="/tmp/Endpoint_SlaveEndpointTest_UnauthorizedRequest_2_c5etCi/http_credentials"
--http_heartbeat_interval="30secs" --initialize_driver_logging="true" --isolation="posix/cpu,posix/mem"
--launcher="posix" --launcher_dir="/mesos/mesos-1.4.0/_build/src" --logbufsecs="0" --logging_level="INFO"
--max_completed_executors_per_framework="150" --oversubscribed_resources_interval="15secs"
--perf_duration="10secs" --perf_interval="1mins" --port="5051" --qos_correction_interval_min="0ns"
--quiet="false" --recover="reconnect" --recovery_timeout="15mins" --registration_backoff_factor="10ms"
--resources="cpus:2;gpus:0;mem:1024;disk:1024;ports:[31000-32000]" --revocable_cpu_low_priority="true"
--runtime_dir="/tmp/Endpoint_SlaveEndpointTest_UnauthorizedRequest_2_c5etCi" --sandbox_directory="/mnt/mesos/sandbox"
--strict="true" --switch_user="true" --systemd_enable_support="true" --systemd_runtime_directory="/run/systemd/system"
--version="false" --work_dir="/tmp/Endpoint_SlaveEndpointTest_UnauthorizedRequest_2_Zij6Vh"
I0614 22:58:12.894580  4597 credentials.hpp:86] Loading credential for authentication from
'/tmp/Endpoint_SlaveEndpointTest_UnauthorizedRequest_2_c5etCi/credential'
I0614 22:58:12.894870  4597 slave.cpp:281] Agent using credential for: test-principal
I0614 22:58:12.894922  4597 credentials.hpp:37] Loading credentials for authentication from
'/tmp/Endpoint_SlaveEndpointTest_UnauthorizedRequest_2_c5etCi/http_credentials'
I0614 22:58:12.895318  4597 http.cpp:975] Creating default 'basic' HTTP authenticator for
realm 'mesos-agent-readonly'
I0614 22:58:12.895588  4597 http.cpp:975] Creating default 'basic' HTTP authenticator for
realm 'mesos-agent-readwrite'
I0614 22:58:12.897832  4597 slave.cpp:552] Agent resources: cpus(*):2; mem(*):1024; disk(*):1024;
ports(*):[31000-32000]
I0614 22:58:12.898020  4597 slave.cpp:560] Agent attributes: [  ]
I0614 22:58:12.898064  4597 slave.cpp:565] Agent hostname: e3a75529a11c
I0614 22:58:12.898543  4602 status_update_manager.cpp:177] Pausing sending status updates
I0614 22:58:12.900985  4603 state.cpp:62] Recovering state from '/tmp/Endpoint_SlaveEndpointTest_UnauthorizedRequest_2_Zij6Vh/meta'
I0614 22:58:12.901823  4603 status_update_manager.cpp:203] Recovering status update manager
I0614 22:58:12.902093  4603 containerizer.cpp:582] Recovering containerizer
I0614 22:58:12.905514  4603 provisioner.cpp:416] Provisioner recovery complete
I0614 22:58:12.906460  4603 slave.cpp:6127] Finished recovery
I0614 22:58:12.907122  4603 slave.cpp:6309] Querying resource estimator for oversubscribable
resources
I0614 22:58:12.908444  4603 slave.cpp:6323] Received oversubscribable resources {} from the
resource estimator
I0614 22:58:12.912760  4601 process.cpp:3778] Handling HTTP event for process 'slave(766)'
with path: '/slave(766)/containers'
I0614 22:58:12.915098  4600 http.cpp:1115] HTTP GET for /slave(766)/containers from 172.17.0.2:59778
I0614 22:58:12.915227  4600 http.cpp:936] Authorizing principal 'test-principal' to GET the
'/containers' endpoint
I0614 22:58:12.919637  4577 slave.cpp:817] Agent terminating
[       OK ] Endpoint/SlaveEndpointTest.UnauthorizedRequest/2 (48 ms)
[ RUN      ] Endpoint/SlaveEndpointTest.NoAuthorizer/0
I0614 22:58:12.935184  4577 containerizer.cpp:230] Using isolation: posix/cpu,posix/mem,filesystem/posix,network/cni,environment_secret
W0614 22:58:12.936157  4577 backend.cpp:76] Failed to create 'overlay' backend: OverlayBackend
requires root privileges
W0614 22:58:12.936342  4577 backend.cpp:76] Failed to create 'bind' backend: BindBackend requires
root privileges
I0614 22:58:12.936420  4577 provisioner.cpp:255] Using default backend 'copy'
I0614 22:58:12.939226  4577 cluster.cpp:448] Creating default 'local' authorizer
I0614 22:58:12.943534  4601 slave.cpp:248] Mesos agent started on (767)@172.17.0.2:44725
I0614 22:58:12.943581  4601 slave.cpp:249] Flags at startup: --acls="" --appc_simple_discovery_uri_prefix="http://"
--appc_store_dir="/tmp/Endpoint_SlaveEndpointTest_NoAuthorizer_0_O2IHGk/store/appc" --authenticate_http_readonly="true"
--authenticate_http_readwrite="true" --authenticatee="crammd5" --authentication_backoff_factor="1secs"
--authorizer="local" --cgroups_cpu_enable_pids_and_tids_count="false" --cgroups_enable_cfs="false"
--cgroups_hierarchy="/sys/fs/cgroup" --cgroups_limit_swap="false" --cgroups_root="mesos" --container_disk_watch_interval="15secs"
--containerizers="mesos" --credential="/tmp/Endpoint_SlaveEndpointTest_NoAuthorizer_0_O2IHGk/credential"
--default_role="*" --disk_watch_interval="1mins" --docker="docker" --docker_kill_orphans="true"
--docker_registry="https://registry-1.docker.io" --docker_remove_delay="6hrs" --docker_socket="/var/run/docker.sock"
--docker_stop_timeout="0ns" --docker_store_dir="/tmp/Endpoint_SlaveEndpointTest_NoAuthorizer_0_O2IHGk/store/docker"
--docker_volume_checkpoint_dir="/var/run/mesos/isolators/docker/volume" --enforce_container_disk_quota="false"
--executor_registration_timeout="1mins" --executor_reregistration_timeout="2secs" --executor_shutdown_grace_period="5secs"
--fetcher_cache_dir="/tmp/Endpoint_SlaveEndpointTest_NoAuthorizer_0_O2IHGk/fetch" --fetcher_cache_size="2GB"
--frameworks_home="" --gc_delay="1weeks" --gc_disk_headroom="0.1" --hadoop_home="" --help="false"
--hostname_lookup="true" --http_command_executor="false" --http_credentials="/tmp/Endpoint_SlaveEndpointTest_NoAuthorizer_0_O2IHGk/http_credentials"
--http_heartbeat_interval="30secs" --initialize_driver_logging="true" --isolation="posix/cpu,posix/mem"
--launcher="posix" --launcher_dir="/mesos/mesos-1.4.0/_build/src" --logbufsecs="0" --logging_level="INFO"
--max_completed_executors_per_framework="150" --oversubscribed_resources_interval="15secs"
--perf_duration="10secs" --perf_interval="1mins" --port="5051" --qos_correction_interval_min="0ns"
--quiet="false" --recover="reconnect" --recovery_timeout="15mins" --registration_backoff_factor="10ms"
--resources="cpus:2;gpus:0;mem:1024;disk:1024;ports:[31000-32000]" --revocable_cpu_low_priority="true"
--runtime_dir="/tmp/Endpoint_SlaveEndpointTest_NoAuthorizer_0_O2IHGk" --sandbox_directory="/mnt/mesos/sandbox"
--strict="true" --switch_user="true" --systemd_enable_support="true" --systemd_runtime_directory="/run/systemd/system"
--version="false" --work_dir="/tmp/Endpoint_SlaveEndpointTest_NoAuthorizer_0_1BvwSj"
I0614 22:58:12.945652  4601 credentials.hpp:86] Loading credential for authentication from
'/tmp/Endpoint_SlaveEndpointTest_NoAuthorizer_0_O2IHGk/credential'
I0614 22:58:12.946038  4601 slave.cpp:281] Agent using credential for: test-principal
I0614 22:58:12.946291  4601 credentials.hpp:37] Loading credentials for authentication from
'/tmp/Endpoint_SlaveEndpointTest_NoAuthorizer_0_O2IHGk/http_credentials'
I0614 22:58:12.946842  4601 http.cpp:975] Creating default 'basic' HTTP authenticator for
realm 'mesos-agent-readonly'
I0614 22:58:12.947428  4601 http.cpp:975] Creating default 'basic' HTTP authenticator for
realm 'mesos-agent-readwrite'
I0614 22:58:12.950675  4601 slave.cpp:552] Agent resources: cpus(*):2; mem(*):1024; disk(*):1024;
ports(*):[31000-32000]
I0614 22:58:12.950835  4601 slave.cpp:560] Agent attributes: [  ]
I0614 22:58:12.950951  4601 slave.cpp:565] Agent hostname: e3a75529a11c
I0614 22:58:12.951411  4599 status_update_manager.cpp:177] Pausing sending status updates
I0614 22:58:12.954284  4598 state.cpp:62] Recovering state from '/tmp/Endpoint_SlaveEndpointTest_NoAuthorizer_0_1BvwSj/meta'
I0614 22:58:12.954910  4600 status_update_manager.cpp:203] Recovering status update manager
I0614 22:58:12.955344  4598 containerizer.cpp:582] Recovering containerizer
I0614 22:58:12.958287  4598 provisioner.cpp:416] Provisioner recovery complete
I0614 22:58:12.959607  4598 slave.cpp:6127] Finished recovery
I0614 22:58:12.960245  4598 slave.cpp:6309] Querying resource estimator for oversubscribable
resources
I0614 22:58:12.961416  4598 slave.cpp:6323] Received oversubscribable resources {} from the
resource estimator
I0614 22:58:12.966650  4599 process.cpp:3778] Handling HTTP event for process 'slave(767)'
with path: '/slave(767)/monitor/statistics'
I0614 22:58:12.968700  4599 http.cpp:1115] HTTP GET for /slave(767)/monitor/statistics from
172.17.0.2:59780
I0614 22:58:12.968822  4599 http.cpp:936] Authorizing principal 'test-principal' to GET the
'/monitor/statistics' endpoint
I0614 22:58:12.975371  4602 slave.cpp:817] Agent terminating
[       OK ] Endpoint/SlaveEndpointTest.NoAuthorizer/0 (68 ms)
[ RUN      ] Endpoint/SlaveEndpointTest.NoAuthorizer/1
I0614 22:58:13.008342  4577 containerizer.cpp:230] Using isolation: posix/cpu,posix/mem,filesystem/posix,network/cni,environment_secret
W0614 22:58:13.009137  4577 backend.cpp:76] Failed to create 'overlay' backend: OverlayBackend
requires root privileges
W0614 22:58:13.009317  4577 backend.cpp:76] Failed to create 'bind' backend: BindBackend requires
root privileges
I0614 22:58:13.009361  4577 provisioner.cpp:255] Using default backend 'copy'
I0614 22:58:13.012429  4577 cluster.cpp:448] Creating default 'local' authorizer
I0614 22:58:13.016669  4603 slave.cpp:248] Mesos agent started on (768)@172.17.0.2:44725
I0614 22:58:13.016716  4603 slave.cpp:249] Flags at startup: --acls="" --appc_simple_discovery_uri_prefix="http://"
--appc_store_dir="/tmp/Endpoint_SlaveEndpointTest_NoAuthorizer_1_MVULyo/store/appc" --authenticate_http_readonly="true"
--authenticate_http_readwrite="true" --authenticatee="crammd5" --authentication_backoff_factor="1secs"
--authorizer="local" --cgroups_cpu_enable_pids_and_tids_count="false" --cgroups_enable_cfs="false"
--cgroups_hierarchy="/sys/fs/cgroup" --cgroups_limit_swap="false" --cgroups_root="mesos" --container_disk_watch_interval="15secs"
--containerizers="mesos" --credential="/tmp/Endpoint_SlaveEndpointTest_NoAuthorizer_1_MVULyo/credential"
--default_role="*" --disk_watch_interval="1mins" --docker="docker" --docker_kill_orphans="true"
--docker_registry="https://registry-1.docker.io" --docker_remove_delay="6hrs" --docker_socket="/var/run/docker.sock"
--docker_stop_timeout="0ns" --docker_store_dir="/tmp/Endpoint_SlaveEndpointTest_NoAuthorizer_1_MVULyo/store/docker"
--docker_volume_checkpoint_dir="/var/run/mesos/isolators/docker/volume" --enforce_container_disk_quota="false"
--executor_registration_timeout="1mins" --executor_reregistration_timeout="2secs" --executor_shutdown_grace_period="5secs"
--fetcher_cache_dir="/tmp/Endpoint_SlaveEndpointTest_NoAuthorizer_1_MVULyo/fetch" --fetcher_cache_size="2GB"
--frameworks_home="" --gc_delay="1weeks" --gc_disk_headroom="0.1" --hadoop_home="" --help="false"
--hostname_lookup="true" --http_command_executor="false" --http_credentials="/tmp/Endpoint_SlaveEndpointTest_NoAuthorizer_1_MVULyo/http_credentials"
--http_heartbeat_interval="30secs" --initialize_driver_logging="true" --isolation="posix/cpu,posix/mem"
--launcher="posix" --launcher_dir="/mesos/mesos-1.4.0/_build/src" --logbufsecs="0" --logging_level="INFO"
--max_completed_executors_per_framework="150" --oversubscribed_resources_interval="15secs"
--perf_duration="10secs" --perf_interval="1mins" --port="5051" --qos_correction_interval_min="0ns"
--quiet="false" --recover="reconnect" --recovery_timeout="15mins" --registration_backoff_factor="10ms"
--resources="cpus:2;gpus:0;mem:1024;disk:1024;ports:[31000-32000]" --revocable_cpu_low_priority="true"
--runtime_dir="/tmp/Endpoint_SlaveEndpointTest_NoAuthorizer_1_MVULyo" --sandbox_directory="/mnt/mesos/sandbox"
--strict="true" --switch_user="true" --systemd_enable_support="true" --systemd_runtime_directory="/run/systemd/system"
--version="false" --work_dir="/tmp/Endpoint_SlaveEndpointTest_NoAuthorizer_1_f7eUyn"
I0614 22:58:13.018232  4603 credentials.hpp:86] Loading credential for authentication from
'/tmp/Endpoint_SlaveEndpointTest_NoAuthorizer_1_MVULyo/credential'
I0614 22:58:13.018649  4603 slave.cpp:281] Agent using credential for: test-principal
I0614 22:58:13.018689  4603 credentials.hpp:37] Loading credentials for authentication from
'/tmp/Endpoint_SlaveEndpointTest_NoAuthorizer_1_MVULyo/http_credentials'
I0614 22:58:13.019486  4603 http.cpp:975] Creating default 'basic' HTTP authenticator for
realm 'mesos-agent-readonly'
I0614 22:58:13.019853  4603 http.cpp:975] Creating default 'basic' HTTP authenticator for
realm 'mesos-agent-readwrite'
I0614 22:58:13.022429  4603 slave.cpp:552] Agent resources: cpus(*):2; mem(*):1024; disk(*):1024;
ports(*):[31000-32000]
I0614 22:58:13.022682  4603 slave.cpp:560] Agent attributes: [  ]
I0614 22:58:13.022708  4603 slave.cpp:565] Agent hostname: e3a75529a11c
I0614 22:58:13.023016  4597 status_update_manager.cpp:177] Pausing sending status updates
I0614 22:58:13.025459  4599 state.cpp:62] Recovering state from '/tmp/Endpoint_SlaveEndpointTest_NoAuthorizer_1_f7eUyn/meta'
I0614 22:58:13.026007  4599 status_update_manager.cpp:203] Recovering status update manager
I0614 22:58:13.026320  4599 containerizer.cpp:582] Recovering containerizer
I0614 22:58:13.028452  4599 provisioner.cpp:416] Provisioner recovery complete
I0614 22:58:13.029162  4599 slave.cpp:6127] Finished recovery
I0614 22:58:13.029785  4599 slave.cpp:6309] Querying resource estimator for oversubscribable
resources
I0614 22:58:13.030277  4598 slave.cpp:6323] Received oversubscribable resources {} from the
resource estimator
I0614 22:58:13.035296  4597 process.cpp:3778] Handling HTTP event for process 'slave(768)'
with path: '/slave(768)/monitor/statistics.json'
I0614 22:58:13.037833  4597 http.cpp:1115] HTTP GET for /slave(768)/monitor/statistics.json
from 172.17.0.2:59782
I0614 22:58:13.038053  4597 http.cpp:936] Authorizing principal 'test-principal' to GET the
'/monitor/statistics.json' endpoint
I0614 22:58:13.047969  4577 slave.cpp:817] Agent terminating
[       OK ] Endpoint/SlaveEndpointTest.NoAuthorizer/1 (55 ms)
[ RUN      ] Endpoint/SlaveEndpointTest.NoAuthorizer/2
I0614 22:58:13.062844  4577 containerizer.cpp:230] Using isolation: posix/cpu,posix/mem,filesystem/posix,network/cni,environment_secret
W0614 22:58:13.063650  4577 backend.cpp:76] Failed to create 'overlay' backend: OverlayBackend
requires root privileges
W0614 22:58:13.063827  4577 backend.cpp:76] Failed to create 'bind' backend: BindBackend requires
root privileges
I0614 22:58:13.063885  4577 provisioner.cpp:255] Using default backend 'copy'
I0614 22:58:13.066902  4577 cluster.cpp:448] Creating default 'local' authorizer
I0614 22:58:13.069780  4596 slave.cpp:248] Mesos agent started on (769)@172.17.0.2:44725
I0614 22:58:13.069828  4596 slave.cpp:249] Flags at startup: --acls="" --appc_simple_discovery_uri_prefix="http://"
--appc_store_dir="/tmp/Endpoint_SlaveEndpointTest_NoAuthorizer_2_QNM02s/store/appc" --authenticate_http_readonly="true"
--authenticate_http_readwrite="true" --authenticatee="crammd5" --authentication_backoff_factor="1secs"
--authorizer="local" --cgroups_cpu_enable_pids_and_tids_count="false" --cgroups_enable_cfs="false"
--cgroups_hierarchy="/sys/fs/cgroup" --cgroups_limit_swap="false" --cgroups_root="mesos" --container_disk_watch_interval="15secs"
--containerizers="mesos" --credential="/tmp/Endpoint_SlaveEndpointTest_NoAuthorizer_2_QNM02s/credential"
--default_role="*" --disk_watch_interval="1mins" --docker="docker" --docker_kill_orphans="true"
--docker_registry="https://registry-1.docker.io" --docker_remove_delay="6hrs" --docker_socket="/var/run/docker.sock"
--docker_stop_timeout="0ns" --docker_store_dir="/tmp/Endpoint_SlaveEndpointTest_NoAuthorizer_2_QNM02s/store/docker"
--docker_volume_checkpoint_dir="/var/run/mesos/isolators/docker/volume" --enforce_container_disk_quota="false"
--executor_registration_timeout="1mins" --executor_reregistration_timeout="2secs" --executor_shutdown_grace_period="5secs"
--fetcher_cache_dir="/tmp/Endpoint_SlaveEndpointTest_NoAuthorizer_2_QNM02s/fetch" --fetcher_cache_size="2GB"
--frameworks_home="" --gc_delay="1weeks" --gc_disk_headroom="0.1" --hadoop_home="" --help="false"
--hostname_lookup="true" --http_command_executor="false" --http_credentials="/tmp/Endpoint_SlaveEndpointTest_NoAuthorizer_2_QNM02s/http_credentials"
--http_heartbeat_interval="30secs" --initialize_driver_logging="true" --isolation="posix/cpu,posix/mem"
--launcher="posix" --launcher_dir="/mesos/mesos-1.4.0/_build/src" --logbufsecs="0" --logging_level="INFO"
--max_completed_executors_per_framework="150" --oversubscribed_resources_interval="15secs"
--perf_duration="10secs" --perf_interval="1mins" --port="5051" --qos_correction_interval_min="0ns"
--quiet="false" --recover="reconnect" --recovery_timeout="15mins" --registration_backoff_factor="10ms"
--resources="cpus:2;gpus:0;mem:1024;disk:1024;ports:[31000-32000]" --revocable_cpu_low_priority="true"
--runtime_dir="/tmp/Endpoint_SlaveEndpointTest_NoAuthorizer_2_QNM02s" --sandbox_directory="/mnt/mesos/sandbox"
--strict="true" --switch_user="true" --systemd_enable_support="true" --systemd_runtime_directory="/run/systemd/system"
--version="false" --work_dir="/tmp/Endpoint_SlaveEndpointTest_NoAuthorizer_2_lEhaUr"
I0614 22:58:13.071285  4596 credentials.hpp:86] Loading credential for authentication from
'/tmp/Endpoint_SlaveEndpointTest_NoAuthorizer_2_QNM02s/credential'
I0614 22:58:13.071684  4596 slave.cpp:281] Agent using credential for: test-principal
I0614 22:58:13.071921  4596 credentials.hpp:37] Loading credentials for authentication from
'/tmp/Endpoint_SlaveEndpointTest_NoAuthorizer_2_QNM02s/http_credentials'
I0614 22:58:13.072468  4596 http.cpp:975] Creating default 'basic' HTTP authenticator for
realm 'mesos-agent-readonly'
I0614 22:58:13.072983  4596 http.cpp:975] Creating default 'basic' HTTP authenticator for
realm 'mesos-agent-readwrite'
I0614 22:58:13.075371  4596 slave.cpp:552] Agent resources: cpus(*):2; mem(*):1024; disk(*):1024;
ports(*):[31000-32000]
I0614 22:58:13.075528  4596 slave.cpp:560] Agent attributes: [  ]
I0614 22:58:13.076149  4596 slave.cpp:565] Agent hostname: e3a75529a11c
I0614 22:58:13.076491  4598 status_update_manager.cpp:177] Pausing sending status updates
I0614 22:58:13.079506  4597 state.cpp:62] Recovering state from '/tmp/Endpoint_SlaveEndpointTest_NoAuthorizer_2_lEhaUr/meta'
I0614 22:58:13.080329  4597 status_update_manager.cpp:203] Recovering status update manager
I0614 22:58:13.080745  4597 containerizer.cpp:582] Recovering containerizer
I0614 22:58:13.083376  4599 provisioner.cpp:416] Provisioner recovery complete
I0614 22:58:13.084259  4599 slave.cpp:6127] Finished recovery
I0614 22:58:13.085220  4599 slave.cpp:6309] Querying resource estimator for oversubscribable
resources
I0614 22:58:13.085655  4599 slave.cpp:6323] Received oversubscribable resources {} from the
resource estimator
I0614 22:58:13.090250  4600 process.cpp:3778] Handling HTTP event for process 'slave(769)'
with path: '/slave(769)/containers'
I0614 22:58:13.092648  4601 http.cpp:1115] HTTP GET for /slave(769)/containers from 172.17.0.2:59784
I0614 22:58:13.092865  4601 http.cpp:936] Authorizing principal 'test-principal' to GET the
'/containers' endpoint
I0614 22:58:13.099375  4602 slave.cpp:817] Agent terminating
[       OK ] Endpoint/SlaveEndpointTest.NoAuthorizer/2 (52 ms)
[----------] 9 tests from Endpoint/SlaveEndpointTest (569 ms total)

[----------] Global test environment tear-down
[==========] 1596 tests from 176 test cases ran. (790298 ms total)
[  PASSED  ] 1592 tests.
[  FAILED  ] 4 tests, listed below:
[  FAILED  ] DefaultExecutorCheckTest.CommandCheckDeliveredAndReconciled
[  FAILED  ] DefaultExecutorCheckTest.CommandCheckStatusChange
[  FAILED  ] DefaultExecutorCheckTest.CommandCheckSeesParentsEnv
[  FAILED  ] DefaultExecutorCheckTest.CommandCheckSharesWorkDirWithTask

 4 FAILED TESTS
  YOU HAVE 19 DISABLED TESTS

E0614 22:58:13.242238  4604 process.cpp:968] Failed to accept socket: future discarded
make[4]: *** [check-local] Error 1
make[4]: Leaving directory `/mesos/mesos-1.4.0/_build/src'
make[3]: *** [check-am] Error 2
make[3]: Leaving directory `/mesos/mesos-1.4.0/_build/src'
make[2]: *** [check] Error 2
make[2]: Leaving directory `/mesos/mesos-1.4.0/_build/src'
make[1]: *** [check-recursive] Error 1
make[1]: Leaving directory `/mesos/mesos-1.4.0/_build'
make: *** [distcheck] Error 1
+ docker rmi mesos-1497474867-13786
Untagged: mesos-1497474867-13786:latest
Deleted: sha256:8ddd6c992e4e8e8993230ce5d32ed7599193ad140d6a224990d5692e04cebc00
Deleted: sha256:385b8b8459a2b933d97557275d32b2473fbc8c903ca3daa019868f5708ac6d9b
Deleted: sha256:a2bde283002c6c0fda0deac2f7adf959ac2cc9d6231a6987f668a4e09830b4d7
Deleted: sha256:e4987b6c7444d8e7b6ca9019faa8043eb3966b62e6c89d702fe989e5f5068e07
Deleted: sha256:b335638f0f1131048383548a807f9e0d76339bf3db2c55e31d79a5c9ecc7f7f8
Deleted: sha256:76558a796967c90230a9eae57a8b2432b66c41a1cf306c44b74d8669a969a7ff
Deleted: sha256:84db492896b03ef2d1fe2eca119ebe44bd287c7e7c39627ab116ebe93343d51c
Deleted: sha256:6cc855a7dfb564d8a64b92dddd1f5d47b0c5f17cd392661bb3a273029ded9a43
Deleted: sha256:0e9dcd4a391136e74796bb16b0f9672e9384edbb74666e255274d41bcb24af1d
Deleted: sha256:3b96b13de677293ef66b5f79b3966826d21b34adc8baae25d4273fc105d843d6
Deleted: sha256:9cb5018cb25533b8f48c5294988491a8cc0dfd8d405d2a715b8263a1d5c68752
Deleted: sha256:681a9a0b58761e6d2485954ee94c45839316c775207ad579a608ad297667317c
Deleted: sha256:319b02cc514d5d4103df1ee1dd381b156cbfbb6dd853c77d45f184945889c503
Deleted: sha256:bc13a8fe4f48f2081b728deba54d5525293b4f155b64ac8e9b42b44b6d9c159f
Deleted: sha256:a403d651200543a32ec417ab1036dff2a41bbd45b0c58ea813bbb0071e51f4bb
Deleted: sha256:bfcbeefbd797c92936588eab42dd69cba44b7e3c424a964b99e8ab5ccc987ffe
Deleted: sha256:4cef00d97cee86063a536fd4f69ec480ee5373046a16b647bdd6740196099a1a
Deleted: sha256:05975a0b7c3314fb5b5ca0a1f251f5ef37693a15e3869f8cb3136d397cbccb39
Deleted: sha256:a567c0839cb4b3cb265b5d24ce20785da3626e16af83e2801c4012cd50585df5
Deleted: sha256:f730bfc745e3af15e4d386a77550e34cb9f47083598ddabfee646d0f82a1b8d7
Deleted: sha256:37c8a0018361f71d26b9c955de13dbff880f7abcd37433dad89d0deb6acee839
Deleted: sha256:fe39298ffc4f537d173e3c6074671b03381b760e5f0146c38b2e6e1e59ec2111
Deleted: sha256:61d685a8cacbf715e777336d97f5dfe8182e7ca7008b58a8574ea143614c648a
Deleted: sha256:85f5076ea6eb6466ce23425cde3136f04d828d255d2a4253c43c9d85793d7a10
Build step 'Execute shell' marked build as failure

Mime
View raw message