mesos-builds mailing list archives

Site index · List index
Message view « Date » · « Thread »
Top « Date » · « Thread »
From Apache Jenkins Server <jenk...@builds.apache.org>
Subject Build failed in Jenkins: Mesos-Buildbot » autotools,gcc,--verbose,GLOG_v=1 MESOS_VERBOSE=1,centos:7,(ubuntu)&&(!ubuntu-us1)&&(!ubuntu-eu2) #3758
Date Fri, 02 Jun 2017 04:59:51 GMT
See <https://builds.apache.org/job/Mesos-Buildbot/BUILDTOOL=autotools,COMPILER=gcc,CONFIGURATION=--verbose,ENVIRONMENT=GLOG_v=1%20MESOS_VERBOSE=1,OS=centos%3A7,label_exp=(ubuntu)&&(!ubuntu-us1)&&(!ubuntu-eu2)/3758/display/redirect?page=changes>

Changes:

[vinodkone] Added test for agent ping timeout during agent recovery.

[vinodkone] Added a test to verify the agent flag 'executor_reregistration_timeout'.

[vinodkone] Added a test to verify executor driver message dropping behavior.

[neil.conway] Replaced "!(x == y)" with "x != y" when comparing ExecutorInfos.

[bmahler] Removed 'DO NOT USE' and 'EXPERIMENTAL' comments for multi-role support.

[bmahler] Added parallel test runner to distribution.

[neil.conway] Clarified docs for multi-role frameworks and offers.

[xujyan] Show the resources in the allocator CHECK.

[josephwu] Windows: Disabled SlaveTest.ExecutorReregistrationTimeoutFlag.

[xujyan] Fixed a typo caused compilation error.

------------------------------------------
[...truncated 27.75 MB...]
I0602 04:59:40.693487  5847 slave.cpp:248] Mesos agent started on (751)@172.17.0.4:41947
I0602 04:59:40.694003  5847 slave.cpp:249] Flags at startup: --acls="" --appc_simple_discovery_uri_prefix="http://"
--appc_store_dir="/tmp/Endpoint_SlaveEndpointTest_AuthorizedRequest_2_TqPJxX/store/appc" --authenticate_http_readonly="true"
--authenticate_http_readwrite="true" --authenticatee="crammd5" --authentication_backoff_factor="1secs"
--authorizer="local" --cgroups_cpu_enable_pids_and_tids_count="false" --cgroups_enable_cfs="false"
--cgroups_hierarchy="/sys/fs/cgroup" --cgroups_limit_swap="false" --cgroups_root="mesos" --container_disk_watch_interval="15secs"
--containerizers="mesos" --credential="/tmp/Endpoint_SlaveEndpointTest_AuthorizedRequest_2_TqPJxX/credential"
--default_role="*" --disk_watch_interval="1mins" --docker="docker" --docker_kill_orphans="true"
--docker_registry="https://registry-1.docker.io" --docker_remove_delay="6hrs" --docker_socket="/var/run/docker.sock"
--docker_stop_timeout="0ns" --docker_store_dir="/tmp/Endpoint_SlaveEndpointTest_AuthorizedRequest_2_TqPJxX/store/docker"
--docker_volume_checkpoint_dir="/var/run/mesos/isolators/docker/volume" --enforce_container_disk_quota="false"
--executor_registration_timeout="1mins" --executor_reregistration_timeout="2secs" --executor_shutdown_grace_period="5secs"
--fetcher_cache_dir="/tmp/Endpoint_SlaveEndpointTest_AuthorizedRequest_2_TqPJxX/fetch" --fetcher_cache_size="2GB"
--frameworks_home="" --gc_delay="1weeks" --gc_disk_headroom="0.1" --hadoop_home="" --help="false"
--hostname_lookup="true" --http_command_executor="false" --http_credentials="/tmp/Endpoint_SlaveEndpointTest_AuthorizedRequest_2_TqPJxX/http_credentials"
--http_heartbeat_interval="30secs" --initialize_driver_logging="true" --isolation="posix/cpu,posix/mem"
--launcher="posix" --launcher_dir="/mesos/mesos-1.4.0/_build/src" --logbufsecs="0" --logging_level="INFO"
--max_completed_executors_per_framework="150" --oversubscribed_resources_interval="15secs"
--perf_duration="10secs" --perf_interval="1mins" --port="5051" --qos_correction_interval_min="0ns"
--quiet="false" --recover="reconnect" --recovery_timeout="15mins" --registration_backoff_factor="10ms"
--resources="cpus:2;gpus:0;mem:1024;disk:1024;ports:[31000-32000]" --revocable_cpu_low_priority="true"
--runtime_dir="/tmp/Endpoint_SlaveEndpointTest_AuthorizedRequest_2_TqPJxX" --sandbox_directory="/mnt/mesos/sandbox"
--strict="true" --switch_user="true" --systemd_enable_support="true" --systemd_runtime_directory="/run/systemd/system"
--version="false" --work_dir="/tmp/Endpoint_SlaveEndpointTest_AuthorizedRequest_2_xKFsXn"
I0602 04:59:40.694967  5847 credentials.hpp:86] Loading credential for authentication from
'/tmp/Endpoint_SlaveEndpointTest_AuthorizedRequest_2_TqPJxX/credential'
I0602 04:59:40.695546  5847 slave.cpp:281] Agent using credential for: test-principal
I0602 04:59:40.695844  5847 credentials.hpp:37] Loading credentials for authentication from
'/tmp/Endpoint_SlaveEndpointTest_AuthorizedRequest_2_TqPJxX/http_credentials'
I0602 04:59:40.696418  5847 http.cpp:975] Creating default 'basic' HTTP authenticator for
realm 'mesos-agent-readonly'
I0602 04:59:40.696928  5847 http.cpp:975] Creating default 'basic' HTTP authenticator for
realm 'mesos-agent-readwrite'
I0602 04:59:40.699038  5847 slave.cpp:552] Agent resources: cpus(*):2; mem(*):1024; disk(*):1024;
ports(*):[31000-32000]
I0602 04:59:40.699489  5847 slave.cpp:560] Agent attributes: [  ]
I0602 04:59:40.699738  5847 slave.cpp:565] Agent hostname: 0dbb4c477427
I0602 04:59:40.700244  5833 status_update_manager.cpp:177] Pausing sending status updates
I0602 04:59:40.702333  5833 state.cpp:62] Recovering state from '/tmp/Endpoint_SlaveEndpointTest_AuthorizedRequest_2_xKFsXn/meta'
I0602 04:59:40.703089  5833 status_update_manager.cpp:203] Recovering status update manager
I0602 04:59:40.703513  5846 containerizer.cpp:582] Recovering containerizer
I0602 04:59:40.706287  5843 provisioner.cpp:416] Provisioner recovery complete
I0602 04:59:40.707020  5846 slave.cpp:6119] Finished recovery
I0602 04:59:40.708405  5846 slave.cpp:6301] Querying resource estimator for oversubscribable
resources
I0602 04:59:40.709314  5835 slave.cpp:6315] Received oversubscribable resources {} from the
resource estimator
I0602 04:59:40.713678  5851 process.cpp:3778] Handling HTTP event for process 'slave(751)'
with path: '/slave(751)/containers'
I0602 04:59:40.715698  5849 http.cpp:1115] HTTP GET for /slave(751)/containers from 172.17.0.4:42146
I0602 04:59:40.715802  5849 http.cpp:936] Authorizing principal 'test-principal' to GET the
'/containers' endpoint
I0602 04:59:40.723222  5834 slave.cpp:817] Agent terminating
[       OK ] Endpoint/SlaveEndpointTest.AuthorizedRequest/2 (55 ms)
[ RUN      ] Endpoint/SlaveEndpointTest.UnauthorizedRequest/0
I0602 04:59:40.738083  5813 containerizer.cpp:230] Using isolation: posix/cpu,posix/mem,filesystem/posix,network/cni,environment_secret
W0602 04:59:40.738845  5813 backend.cpp:76] Failed to create 'aufs' backend: AufsBackend requires
root privileges
W0602 04:59:40.738981  5813 backend.cpp:76] Failed to create 'bind' backend: BindBackend requires
root privileges
I0602 04:59:40.739161  5813 provisioner.cpp:255] Using default backend 'copy'
I0602 04:59:40.743098  5835 slave.cpp:248] Mesos agent started on (752)@172.17.0.4:41947
I0602 04:59:40.743136  5835 slave.cpp:249] Flags at startup: --acls="" --appc_simple_discovery_uri_prefix="http://"
--appc_store_dir="/tmp/Endpoint_SlaveEndpointTest_UnauthorizedRequest_0_gkB9kg/store/appc"
--authenticate_http_readonly="true" --authenticate_http_readwrite="true" --authenticatee="crammd5"
--authentication_backoff_factor="1secs" --authorizer="local" --cgroups_cpu_enable_pids_and_tids_count="false"
--cgroups_enable_cfs="false" --cgroups_hierarchy="/sys/fs/cgroup" --cgroups_limit_swap="false"
--cgroups_root="mesos" --container_disk_watch_interval="15secs" --containerizers="mesos" --credential="/tmp/Endpoint_SlaveEndpointTest_UnauthorizedRequest_0_gkB9kg/credential"
--default_role="*" --disk_watch_interval="1mins" --docker="docker" --docker_kill_orphans="true"
--docker_registry="https://registry-1.docker.io" --docker_remove_delay="6hrs" --docker_socket="/var/run/docker.sock"
--docker_stop_timeout="0ns" --docker_store_dir="/tmp/Endpoint_SlaveEndpointTest_UnauthorizedRequest_0_gkB9kg/store/docker"
--docker_volume_checkpoint_dir="/var/run/mesos/isolators/docker/volume" --enforce_container_disk_quota="false"
--executor_registration_timeout="1mins" --executor_reregistration_timeout="2secs" --executor_shutdown_grace_period="5secs"
--fetcher_cache_dir="/tmp/Endpoint_SlaveEndpointTest_UnauthorizedRequest_0_gkB9kg/fetch" --fetcher_cache_size="2GB"
--frameworks_home="" --gc_delay="1weeks" --gc_disk_headroom="0.1" --hadoop_home="" --help="false"
--hostname_lookup="true" --http_command_executor="false" --http_credentials="/tmp/Endpoint_SlaveEndpointTest_UnauthorizedRequest_0_gkB9kg/http_credentials"
--http_heartbeat_interval="30secs" --initialize_driver_logging="true" --isolation="posix/cpu,posix/mem"
--launcher="posix" --launcher_dir="/mesos/mesos-1.4.0/_build/src" --logbufsecs="0" --logging_level="INFO"
--max_completed_executors_per_framework="150" --oversubscribed_resources_interval="15secs"
--perf_duration="10secs" --perf_interval="1mins" --port="5051" --qos_correction_interval_min="0ns"
--quiet="false" --recover="reconnect" --recovery_timeout="15mins" --registration_backoff_factor="10ms"
--resources="cpus:2;gpus:0;mem:1024;disk:1024;ports:[31000-32000]" --revocable_cpu_low_priority="true"
--runtime_dir="/tmp/Endpoint_SlaveEndpointTest_UnauthorizedRequest_0_gkB9kg" --sandbox_directory="/mnt/mesos/sandbox"
--strict="true" --switch_user="true" --systemd_enable_support="true" --systemd_runtime_directory="/run/systemd/system"
--version="false" --work_dir="/tmp/Endpoint_SlaveEndpointTest_UnauthorizedRequest_0_JLXGCG"
I0602 04:59:40.743640  5835 credentials.hpp:86] Loading credential for authentication from
'/tmp/Endpoint_SlaveEndpointTest_UnauthorizedRequest_0_gkB9kg/credential'
I0602 04:59:40.743836  5835 slave.cpp:281] Agent using credential for: test-principal
I0602 04:59:40.743858  5835 credentials.hpp:37] Loading credentials for authentication from
'/tmp/Endpoint_SlaveEndpointTest_UnauthorizedRequest_0_gkB9kg/http_credentials'
I0602 04:59:40.744102  5835 http.cpp:975] Creating default 'basic' HTTP authenticator for
realm 'mesos-agent-readonly'
I0602 04:59:40.744247  5835 http.cpp:975] Creating default 'basic' HTTP authenticator for
realm 'mesos-agent-readwrite'
I0602 04:59:40.745448  5835 slave.cpp:552] Agent resources: cpus(*):2; mem(*):1024; disk(*):1024;
ports(*):[31000-32000]
I0602 04:59:40.745528  5835 slave.cpp:560] Agent attributes: [  ]
I0602 04:59:40.745543  5835 slave.cpp:565] Agent hostname: 0dbb4c477427
I0602 04:59:40.745740  5853 status_update_manager.cpp:177] Pausing sending status updates
I0602 04:59:40.747527  5851 state.cpp:62] Recovering state from '/tmp/Endpoint_SlaveEndpointTest_UnauthorizedRequest_0_JLXGCG/meta'
I0602 04:59:40.747963  5836 status_update_manager.cpp:203] Recovering status update manager
I0602 04:59:40.748347  5852 containerizer.cpp:582] Recovering containerizer
I0602 04:59:40.750414  5850 provisioner.cpp:416] Provisioner recovery complete
I0602 04:59:40.751379  5839 slave.cpp:6119] Finished recovery
I0602 04:59:40.752202  5839 slave.cpp:6301] Querying resource estimator for oversubscribable
resources
I0602 04:59:40.752707  5842 slave.cpp:6315] Received oversubscribable resources {} from the
resource estimator
I0602 04:59:40.761466  5849 process.cpp:3778] Handling HTTP event for process 'slave(752)'
with path: '/slave(752)/monitor/statistics'
I0602 04:59:40.763384  5849 http.cpp:1115] HTTP GET for /slave(752)/monitor/statistics from
172.17.0.4:42148
I0602 04:59:40.763520  5849 http.cpp:936] Authorizing principal 'test-principal' to GET the
'/monitor/statistics' endpoint
I0602 04:59:40.768630  5813 slave.cpp:817] Agent terminating
[       OK ] Endpoint/SlaveEndpointTest.UnauthorizedRequest/0 (41 ms)
[ RUN      ] Endpoint/SlaveEndpointTest.UnauthorizedRequest/1
I0602 04:59:40.781759  5813 containerizer.cpp:230] Using isolation: posix/cpu,posix/mem,filesystem/posix,network/cni,environment_secret
W0602 04:59:40.783768  5813 backend.cpp:76] Failed to create 'aufs' backend: AufsBackend requires
root privileges
W0602 04:59:40.784150  5813 backend.cpp:76] Failed to create 'bind' backend: BindBackend requires
root privileges
I0602 04:59:40.784435  5813 provisioner.cpp:255] Using default backend 'copy'
I0602 04:59:40.796288  5851 slave.cpp:248] Mesos agent started on (753)@172.17.0.4:41947
I0602 04:59:40.796340  5851 slave.cpp:249] Flags at startup: --acls="" --appc_simple_discovery_uri_prefix="http://"
--appc_store_dir="/tmp/Endpoint_SlaveEndpointTest_UnauthorizedRequest_1_Bzr8xz/store/appc"
--authenticate_http_readonly="true" --authenticate_http_readwrite="true" --authenticatee="crammd5"
--authentication_backoff_factor="1secs" --authorizer="local" --cgroups_cpu_enable_pids_and_tids_count="false"
--cgroups_enable_cfs="false" --cgroups_hierarchy="/sys/fs/cgroup" --cgroups_limit_swap="false"
--cgroups_root="mesos" --container_disk_watch_interval="15secs" --containerizers="mesos" --credential="/tmp/Endpoint_SlaveEndpointTest_UnauthorizedRequest_1_Bzr8xz/credential"
--default_role="*" --disk_watch_interval="1mins" --docker="docker" --docker_kill_orphans="true"
--docker_registry="https://registry-1.docker.io" --docker_remove_delay="6hrs" --docker_socket="/var/run/docker.sock"
--docker_stop_timeout="0ns" --docker_store_dir="/tmp/Endpoint_SlaveEndpointTest_UnauthorizedRequest_1_Bzr8xz/store/docker"
--docker_volume_checkpoint_dir="/var/run/mesos/isolators/docker/volume" --enforce_container_disk_quota="false"
--executor_registration_timeout="1mins" --executor_reregistration_timeout="2secs" --executor_shutdown_grace_period="5secs"
--fetcher_cache_dir="/tmp/Endpoint_SlaveEndpointTest_UnauthorizedRequest_1_Bzr8xz/fetch" --fetcher_cache_size="2GB"
--frameworks_home="" --gc_delay="1weeks" --gc_disk_headroom="0.1" --hadoop_home="" --help="false"
--hostname_lookup="true" --http_command_executor="false" --http_credentials="/tmp/Endpoint_SlaveEndpointTest_UnauthorizedRequest_1_Bzr8xz/http_credentials"
--http_heartbeat_interval="30secs" --initialize_driver_logging="true" --isolation="posix/cpu,posix/mem"
--launcher="posix" --launcher_dir="/mesos/mesos-1.4.0/_build/src" --logbufsecs="0" --logging_level="INFO"
--max_completed_executors_per_framework="150" --oversubscribed_resources_interval="15secs"
--perf_duration="10secs" --perf_interval="1mins" --port="5051" --qos_correction_interval_min="0ns"
--quiet="false" --recover="reconnect" --recovery_timeout="15mins" --registration_backoff_factor="10ms"
--resources="cpus:2;gpus:0;mem:1024;disk:1024;ports:[31000-32000]" --revocable_cpu_low_priority="true"
--runtime_dir="/tmp/Endpoint_SlaveEndpointTest_UnauthorizedRequest_1_Bzr8xz" --sandbox_directory="/mnt/mesos/sandbox"
--strict="true" --switch_user="true" --systemd_enable_support="true" --systemd_runtime_directory="/run/systemd/system"
--version="false" --work_dir="/tmp/Endpoint_SlaveEndpointTest_UnauthorizedRequest_1_anqiJZ"
I0602 04:59:40.796927  5851 credentials.hpp:86] Loading credential for authentication from
'/tmp/Endpoint_SlaveEndpointTest_UnauthorizedRequest_1_Bzr8xz/credential'
I0602 04:59:40.797225  5851 slave.cpp:281] Agent using credential for: test-principal
I0602 04:59:40.797247  5851 credentials.hpp:37] Loading credentials for authentication from
'/tmp/Endpoint_SlaveEndpointTest_UnauthorizedRequest_1_Bzr8xz/http_credentials'
I0602 04:59:40.797543  5851 http.cpp:975] Creating default 'basic' HTTP authenticator for
realm 'mesos-agent-readonly'
I0602 04:59:40.797844  5851 http.cpp:975] Creating default 'basic' HTTP authenticator for
realm 'mesos-agent-readwrite'
I0602 04:59:40.799350  5851 slave.cpp:552] Agent resources: cpus(*):2; mem(*):1024; disk(*):1024;
ports(*):[31000-32000]
I0602 04:59:40.799437  5851 slave.cpp:560] Agent attributes: [  ]
I0602 04:59:40.799454  5851 slave.cpp:565] Agent hostname: 0dbb4c477427
I0602 04:59:40.801362  5851 status_update_manager.cpp:177] Pausing sending status updates
I0602 04:59:40.802160  5851 state.cpp:62] Recovering state from '/tmp/Endpoint_SlaveEndpointTest_UnauthorizedRequest_1_anqiJZ/meta'
I0602 04:59:40.802623  5840 status_update_manager.cpp:203] Recovering status update manager
I0602 04:59:40.803117  5840 containerizer.cpp:582] Recovering containerizer
I0602 04:59:40.805644  5840 provisioner.cpp:416] Provisioner recovery complete
I0602 04:59:40.806681  5843 slave.cpp:6119] Finished recovery
I0602 04:59:40.807469  5843 slave.cpp:6301] Querying resource estimator for oversubscribable
resources
I0602 04:59:40.807838  5850 slave.cpp:6315] Received oversubscribable resources {} from the
resource estimator
I0602 04:59:40.815837  5846 process.cpp:3778] Handling HTTP event for process 'slave(753)'
with path: '/slave(753)/monitor/statistics.json'
I0602 04:59:40.818203  5846 http.cpp:1115] HTTP GET for /slave(753)/monitor/statistics.json
from 172.17.0.4:42150
I0602 04:59:40.818322  5846 http.cpp:936] Authorizing principal 'test-principal' to GET the
'/monitor/statistics.json' endpoint
I0602 04:59:40.825773  5813 slave.cpp:817] Agent terminating
[       OK ] Endpoint/SlaveEndpointTest.UnauthorizedRequest/1 (63 ms)
[ RUN      ] Endpoint/SlaveEndpointTest.UnauthorizedRequest/2
I0602 04:59:40.846735  5813 containerizer.cpp:230] Using isolation: posix/cpu,posix/mem,filesystem/posix,network/cni,environment_secret
W0602 04:59:40.847831  5813 backend.cpp:76] Failed to create 'aufs' backend: AufsBackend requires
root privileges
W0602 04:59:40.848232  5813 backend.cpp:76] Failed to create 'bind' backend: BindBackend requires
root privileges
I0602 04:59:40.848425  5813 provisioner.cpp:255] Using default backend 'copy'
I0602 04:59:40.854352  5854 slave.cpp:248] Mesos agent started on (754)@172.17.0.4:41947
I0602 04:59:40.854409  5854 slave.cpp:249] Flags at startup: --acls="" --appc_simple_discovery_uri_prefix="http://"
--appc_store_dir="/tmp/Endpoint_SlaveEndpointTest_UnauthorizedRequest_2_0cJPlT/store/appc"
--authenticate_http_readonly="true" --authenticate_http_readwrite="true" --authenticatee="crammd5"
--authentication_backoff_factor="1secs" --authorizer="local" --cgroups_cpu_enable_pids_and_tids_count="false"
--cgroups_enable_cfs="false" --cgroups_hierarchy="/sys/fs/cgroup" --cgroups_limit_swap="false"
--cgroups_root="mesos" --container_disk_watch_interval="15secs" --containerizers="mesos" --credential="/tmp/Endpoint_SlaveEndpointTest_UnauthorizedRequest_2_0cJPlT/credential"
--default_role="*" --disk_watch_interval="1mins" --docker="docker" --docker_kill_orphans="true"
--docker_registry="https://registry-1.docker.io" --docker_remove_delay="6hrs" --docker_socket="/var/run/docker.sock"
--docker_stop_timeout="0ns" --docker_store_dir="/tmp/Endpoint_SlaveEndpointTest_UnauthorizedRequest_2_0cJPlT/store/docker"
--docker_volume_checkpoint_dir="/var/run/mesos/isolators/docker/volume" --enforce_container_disk_quota="false"
--executor_registration_timeout="1mins" --executor_reregistration_timeout="2secs" --executor_shutdown_grace_period="5secs"
--fetcher_cache_dir="/tmp/Endpoint_SlaveEndpointTest_UnauthorizedRequest_2_0cJPlT/fetch" --fetcher_cache_size="2GB"
--frameworks_home="" --gc_delay="1weeks" --gc_disk_headroom="0.1" --hadoop_home="" --help="false"
--hostname_lookup="true" --http_command_executor="false" --http_credentials="/tmp/Endpoint_SlaveEndpointTest_UnauthorizedRequest_2_0cJPlT/http_credentials"
--http_heartbeat_interval="30secs" --initialize_driver_logging="true" --isolation="posix/cpu,posix/mem"
--launcher="posix" --launcher_dir="/mesos/mesos-1.4.0/_build/src" --logbufsecs="0" --logging_level="INFO"
--max_completed_executors_per_framework="150" --oversubscribed_resources_interval="15secs"
--perf_duration="10secs" --perf_interval="1mins" --port="5051" --qos_correction_interval_min="0ns"
--quiet="false" --recover="reconnect" --recovery_timeout="15mins" --registration_backoff_factor="10ms"
--resources="cpus:2;gpus:0;mem:1024;disk:1024;ports:[31000-32000]" --revocable_cpu_low_priority="true"
--runtime_dir="/tmp/Endpoint_SlaveEndpointTest_UnauthorizedRequest_2_0cJPlT" --sandbox_directory="/mnt/mesos/sandbox"
--strict="true" --switch_user="true" --systemd_enable_support="true" --systemd_runtime_directory="/run/systemd/system"
--version="false" --work_dir="/tmp/Endpoint_SlaveEndpointTest_UnauthorizedRequest_2_dFJunj"
I0602 04:59:40.854990  5854 credentials.hpp:86] Loading credential for authentication from
'/tmp/Endpoint_SlaveEndpointTest_UnauthorizedRequest_2_0cJPlT/credential'
I0602 04:59:40.855283  5854 slave.cpp:281] Agent using credential for: test-principal
I0602 04:59:40.855306  5854 credentials.hpp:37] Loading credentials for authentication from
'/tmp/Endpoint_SlaveEndpointTest_UnauthorizedRequest_2_0cJPlT/http_credentials'
I0602 04:59:40.855608  5854 http.cpp:975] Creating default 'basic' HTTP authenticator for
realm 'mesos-agent-readonly'
I0602 04:59:40.855828  5854 http.cpp:975] Creating default 'basic' HTTP authenticator for
realm 'mesos-agent-readwrite'
I0602 04:59:40.857342  5854 slave.cpp:552] Agent resources: cpus(*):2; mem(*):1024; disk(*):1024;
ports(*):[31000-32000]
I0602 04:59:40.857439  5854 slave.cpp:560] Agent attributes: [  ]
I0602 04:59:40.857455  5854 slave.cpp:565] Agent hostname: 0dbb4c477427
I0602 04:59:40.858789  5836 status_update_manager.cpp:177] Pausing sending status updates
I0602 04:59:40.859913  5836 state.cpp:62] Recovering state from '/tmp/Endpoint_SlaveEndpointTest_UnauthorizedRequest_2_dFJunj/meta'
I0602 04:59:40.860779  5836 status_update_manager.cpp:203] Recovering status update manager
I0602 04:59:40.861125  5836 containerizer.cpp:582] Recovering containerizer
I0602 04:59:40.863032  5853 provisioner.cpp:416] Provisioner recovery complete
I0602 04:59:40.863514  5842 slave.cpp:6119] Finished recovery
I0602 04:59:40.864145  5842 slave.cpp:6301] Querying resource estimator for oversubscribable
resources
I0602 04:59:40.864496  5839 slave.cpp:6315] Received oversubscribable resources {} from the
resource estimator
I0602 04:59:40.867997  5833 process.cpp:3778] Handling HTTP event for process 'slave(754)'
with path: '/slave(754)/containers'
I0602 04:59:40.869796  5832 http.cpp:1115] HTTP GET for /slave(754)/containers from 172.17.0.4:42152
I0602 04:59:40.869905  5832 http.cpp:936] Authorizing principal 'test-principal' to GET the
'/containers' endpoint
I0602 04:59:40.872755  5839 slave.cpp:817] Agent terminating
[       OK ] Endpoint/SlaveEndpointTest.UnauthorizedRequest/2 (39 ms)
[ RUN      ] Endpoint/SlaveEndpointTest.NoAuthorizer/0
I0602 04:59:40.887189  5813 containerizer.cpp:230] Using isolation: posix/cpu,posix/mem,filesystem/posix,network/cni,environment_secret
W0602 04:59:40.888087  5813 backend.cpp:76] Failed to create 'aufs' backend: AufsBackend requires
root privileges
W0602 04:59:40.888236  5813 backend.cpp:76] Failed to create 'bind' backend: BindBackend requires
root privileges
I0602 04:59:40.888291  5813 provisioner.cpp:255] Using default backend 'copy'
I0602 04:59:40.891109  5813 cluster.cpp:448] Creating default 'local' authorizer
I0602 04:59:40.893793  5841 slave.cpp:248] Mesos agent started on (755)@172.17.0.4:41947
I0602 04:59:40.893818  5841 slave.cpp:249] Flags at startup: --acls="" --appc_simple_discovery_uri_prefix="http://"
--appc_store_dir="/tmp/Endpoint_SlaveEndpointTest_NoAuthorizer_0_H7RLzd/store/appc" --authenticate_http_readonly="true"
--authenticate_http_readwrite="true" --authenticatee="crammd5" --authentication_backoff_factor="1secs"
--authorizer="local" --cgroups_cpu_enable_pids_and_tids_count="false" --cgroups_enable_cfs="false"
--cgroups_hierarchy="/sys/fs/cgroup" --cgroups_limit_swap="false" --cgroups_root="mesos" --container_disk_watch_interval="15secs"
--containerizers="mesos" --credential="/tmp/Endpoint_SlaveEndpointTest_NoAuthorizer_0_H7RLzd/credential"
--default_role="*" --disk_watch_interval="1mins" --docker="docker" --docker_kill_orphans="true"
--docker_registry="https://registry-1.docker.io" --docker_remove_delay="6hrs" --docker_socket="/var/run/docker.sock"
--docker_stop_timeout="0ns" --docker_store_dir="/tmp/Endpoint_SlaveEndpointTest_NoAuthorizer_0_H7RLzd/store/docker"
--docker_volume_checkpoint_dir="/var/run/mesos/isolators/docker/volume" --enforce_container_disk_quota="false"
--executor_registration_timeout="1mins" --executor_reregistration_timeout="2secs" --executor_shutdown_grace_period="5secs"
--fetcher_cache_dir="/tmp/Endpoint_SlaveEndpointTest_NoAuthorizer_0_H7RLzd/fetch" --fetcher_cache_size="2GB"
--frameworks_home="" --gc_delay="1weeks" --gc_disk_headroom="0.1" --hadoop_home="" --help="false"
--hostname_lookup="true" --http_command_executor="false" --http_credentials="/tmp/Endpoint_SlaveEndpointTest_NoAuthorizer_0_H7RLzd/http_credentials"
--http_heartbeat_interval="30secs" --initialize_driver_logging="true" --isolation="posix/cpu,posix/mem"
--launcher="posix" --launcher_dir="/mesos/mesos-1.4.0/_build/src" --logbufsecs="0" --logging_level="INFO"
--max_completed_executors_per_framework="150" --oversubscribed_resources_interval="15secs"
--perf_duration="10secs" --perf_interval="1mins" --port="5051" --qos_correction_interval_min="0ns"
--quiet="false" --recover="reconnect" --recovery_timeout="15mins" --registration_backoff_factor="10ms"
--resources="cpus:2;gpus:0;mem:1024;disk:1024;ports:[31000-32000]" --revocable_cpu_low_priority="true"
--runtime_dir="/tmp/Endpoint_SlaveEndpointTest_NoAuthorizer_0_H7RLzd" --sandbox_directory="/mnt/mesos/sandbox"
--strict="true" --switch_user="true" --systemd_enable_support="true" --systemd_runtime_directory="/run/systemd/system"
--version="false" --work_dir="/tmp/Endpoint_SlaveEndpointTest_NoAuthorizer_0_YBgtvD"
I0602 04:59:40.894237  5841 credentials.hpp:86] Loading credential for authentication from
'/tmp/Endpoint_SlaveEndpointTest_NoAuthorizer_0_H7RLzd/credential'
I0602 04:59:40.894518  5841 slave.cpp:281] Agent using credential for: test-principal
I0602 04:59:40.894634  5841 credentials.hpp:37] Loading credentials for authentication from
'/tmp/Endpoint_SlaveEndpointTest_NoAuthorizer_0_H7RLzd/http_credentials'
I0602 04:59:40.894994  5841 http.cpp:975] Creating default 'basic' HTTP authenticator for
realm 'mesos-agent-readonly'
I0602 04:59:40.895189  5841 http.cpp:975] Creating default 'basic' HTTP authenticator for
realm 'mesos-agent-readwrite'
I0602 04:59:40.896693  5841 slave.cpp:552] Agent resources: cpus(*):2; mem(*):1024; disk(*):1024;
ports(*):[31000-32000]
I0602 04:59:40.896775  5841 slave.cpp:560] Agent attributes: [  ]
I0602 04:59:40.896793  5841 slave.cpp:565] Agent hostname: 0dbb4c477427
I0602 04:59:40.896967  5843 status_update_manager.cpp:177] Pausing sending status updates
I0602 04:59:40.898530  5834 state.cpp:62] Recovering state from '/tmp/Endpoint_SlaveEndpointTest_NoAuthorizer_0_YBgtvD/meta'
I0602 04:59:40.902765  5836 status_update_manager.cpp:203] Recovering status update manager
I0602 04:59:40.903074  5843 containerizer.cpp:582] Recovering containerizer
I0602 04:59:40.904798  5834 provisioner.cpp:416] Provisioner recovery complete
I0602 04:59:40.905284  5840 slave.cpp:6119] Finished recovery
I0602 04:59:40.905874  5840 slave.cpp:6301] Querying resource estimator for oversubscribable
resources
I0602 04:59:40.906185  5850 slave.cpp:6315] Received oversubscribable resources {} from the
resource estimator
I0602 04:59:40.909462  5847 process.cpp:3778] Handling HTTP event for process 'slave(755)'
with path: '/slave(755)/monitor/statistics'
I0602 04:59:40.910902  5834 http.cpp:1115] HTTP GET for /slave(755)/monitor/statistics from
172.17.0.4:42154
I0602 04:59:40.910995  5834 http.cpp:936] Authorizing principal 'test-principal' to GET the
'/monitor/statistics' endpoint
I0602 04:59:40.915058  5839 slave.cpp:817] Agent terminating
[       OK ] Endpoint/SlaveEndpointTest.NoAuthorizer/0 (43 ms)
[ RUN      ] Endpoint/SlaveEndpointTest.NoAuthorizer/1
I0602 04:59:40.930742  5813 containerizer.cpp:230] Using isolation: posix/cpu,posix/mem,filesystem/posix,network/cni,environment_secret
W0602 04:59:40.931607  5813 backend.cpp:76] Failed to create 'aufs' backend: AufsBackend requires
root privileges
W0602 04:59:40.931757  5813 backend.cpp:76] Failed to create 'bind' backend: BindBackend requires
root privileges
I0602 04:59:40.931808  5813 provisioner.cpp:255] Using default backend 'copy'
I0602 04:59:40.934658  5813 cluster.cpp:448] Creating default 'local' authorizer
I0602 04:59:40.937515  5853 slave.cpp:248] Mesos agent started on (756)@172.17.0.4:41947
I0602 04:59:40.937553  5853 slave.cpp:249] Flags at startup: --acls="" --appc_simple_discovery_uri_prefix="http://"
--appc_store_dir="/tmp/Endpoint_SlaveEndpointTest_NoAuthorizer_1_vigkdy/store/appc" --authenticate_http_readonly="true"
--authenticate_http_readwrite="true" --authenticatee="crammd5" --authentication_backoff_factor="1secs"
--authorizer="local" --cgroups_cpu_enable_pids_and_tids_count="false" --cgroups_enable_cfs="false"
--cgroups_hierarchy="/sys/fs/cgroup" --cgroups_limit_swap="false" --cgroups_root="mesos" --container_disk_watch_interval="15secs"
--containerizers="mesos" --credential="/tmp/Endpoint_SlaveEndpointTest_NoAuthorizer_1_vigkdy/credential"
--default_role="*" --disk_watch_interval="1mins" --docker="docker" --docker_kill_orphans="true"
--docker_registry="https://registry-1.docker.io" --docker_remove_delay="6hrs" --docker_socket="/var/run/docker.sock"
--docker_stop_timeout="0ns" --docker_store_dir="/tmp/Endpoint_SlaveEndpointTest_NoAuthorizer_1_vigkdy/store/docker"
--docker_volume_checkpoint_dir="/var/run/mesos/isolators/docker/volume" --enforce_container_disk_quota="false"
--executor_registration_timeout="1mins" --executor_reregistration_timeout="2secs" --executor_shutdown_grace_period="5secs"
--fetcher_cache_dir="/tmp/Endpoint_SlaveEndpointTest_NoAuthorizer_1_vigkdy/fetch" --fetcher_cache_size="2GB"
--frameworks_home="" --gc_delay="1weeks" --gc_disk_headroom="0.1" --hadoop_home="" --help="false"
--hostname_lookup="true" --http_command_executor="false" --http_credentials="/tmp/Endpoint_SlaveEndpointTest_NoAuthorizer_1_vigkdy/http_credentials"
--http_heartbeat_interval="30secs" --initialize_driver_logging="true" --isolation="posix/cpu,posix/mem"
--launcher="posix" --launcher_dir="/mesos/mesos-1.4.0/_build/src" --logbufsecs="0" --logging_level="INFO"
--max_completed_executors_per_framework="150" --oversubscribed_resources_interval="15secs"
--perf_duration="10secs" --perf_interval="1mins" --port="5051" --qos_correction_interval_min="0ns"
--quiet="false" --recover="reconnect" --recovery_timeout="15mins" --registration_backoff_factor="10ms"
--resources="cpus:2;gpus:0;mem:1024;disk:1024;ports:[31000-32000]" --revocable_cpu_low_priority="true"
--runtime_dir="/tmp/Endpoint_SlaveEndpointTest_NoAuthorizer_1_vigkdy" --sandbox_directory="/mnt/mesos/sandbox"
--strict="true" --switch_user="true" --systemd_enable_support="true" --systemd_runtime_directory="/run/systemd/system"
--version="false" --work_dir="/tmp/Endpoint_SlaveEndpointTest_NoAuthorizer_1_IUWx2X"
I0602 04:59:40.938114  5853 credentials.hpp:86] Loading credential for authentication from
'/tmp/Endpoint_SlaveEndpointTest_NoAuthorizer_1_vigkdy/credential'
I0602 04:59:40.938406  5853 slave.cpp:281] Agent using credential for: test-principal
I0602 04:59:40.938432  5853 credentials.hpp:37] Loading credentials for authentication from
'/tmp/Endpoint_SlaveEndpointTest_NoAuthorizer_1_vigkdy/http_credentials'
I0602 04:59:40.938753  5853 http.cpp:975] Creating default 'basic' HTTP authenticator for
realm 'mesos-agent-readonly'
I0602 04:59:40.939160  5853 http.cpp:975] Creating default 'basic' HTTP authenticator for
realm 'mesos-agent-readwrite'
I0602 04:59:40.940762  5853 slave.cpp:552] Agent resources: cpus(*):2; mem(*):1024; disk(*):1024;
ports(*):[31000-32000]
I0602 04:59:40.940871  5853 slave.cpp:560] Agent attributes: [  ]
I0602 04:59:40.940891  5853 slave.cpp:565] Agent hostname: 0dbb4c477427
I0602 04:59:40.942808  5855 status_update_manager.cpp:177] Pausing sending status updates
I0602 04:59:40.943038  5853 state.cpp:62] Recovering state from '/tmp/Endpoint_SlaveEndpointTest_NoAuthorizer_1_IUWx2X/meta'
I0602 04:59:40.943467  5853 status_update_manager.cpp:203] Recovering status update manager
I0602 04:59:40.943699  5853 containerizer.cpp:582] Recovering containerizer
I0602 04:59:40.945997  5832 provisioner.cpp:416] Provisioner recovery complete
I0602 04:59:40.946713  5846 slave.cpp:6119] Finished recovery
I0602 04:59:40.947331  5846 slave.cpp:6301] Querying resource estimator for oversubscribable
resources
I0602 04:59:40.947654  5849 slave.cpp:6315] Received oversubscribable resources {} from the
resource estimator
I0602 04:59:40.951328  5836 process.cpp:3778] Handling HTTP event for process 'slave(756)'
with path: '/slave(756)/monitor/statistics.json'
I0602 04:59:40.953414  5836 http.cpp:1115] HTTP GET for /slave(756)/monitor/statistics.json
from 172.17.0.4:42156
I0602 04:59:40.953510  5836 http.cpp:936] Authorizing principal 'test-principal' to GET the
'/monitor/statistics.json' endpoint
I0602 04:59:40.965651  5852 slave.cpp:817] Agent terminating
[       OK ] Endpoint/SlaveEndpointTest.NoAuthorizer/1 (63 ms)
[ RUN      ] Endpoint/SlaveEndpointTest.NoAuthorizer/2
I0602 04:59:40.996063  5813 containerizer.cpp:230] Using isolation: posix/cpu,posix/mem,filesystem/posix,network/cni,environment_secret
W0602 04:59:40.996902  5813 backend.cpp:76] Failed to create 'aufs' backend: AufsBackend requires
root privileges
W0602 04:59:40.997045  5813 backend.cpp:76] Failed to create 'bind' backend: BindBackend requires
root privileges
I0602 04:59:40.997082  5813 provisioner.cpp:255] Using default backend 'copy'
I0602 04:59:41.000073  5813 cluster.cpp:448] Creating default 'local' authorizer
I0602 04:59:41.006973  5838 slave.cpp:248] Mesos agent started on (757)@172.17.0.4:41947
I0602 04:59:41.007346  5838 slave.cpp:249] Flags at startup: --acls="" --appc_simple_discovery_uri_prefix="http://"
--appc_store_dir="/tmp/Endpoint_SlaveEndpointTest_NoAuthorizer_2_7dwnpT/store/appc" --authenticate_http_readonly="true"
--authenticate_http_readwrite="true" --authenticatee="crammd5" --authentication_backoff_factor="1secs"
--authorizer="local" --cgroups_cpu_enable_pids_and_tids_count="false" --cgroups_enable_cfs="false"
--cgroups_hierarchy="/sys/fs/cgroup" --cgroups_limit_swap="false" --cgroups_root="mesos" --container_disk_watch_interval="15secs"
--containerizers="mesos" --credential="/tmp/Endpoint_SlaveEndpointTest_NoAuthorizer_2_7dwnpT/credential"
--default_role="*" --disk_watch_interval="1mins" --docker="docker" --docker_kill_orphans="true"
--docker_registry="https://registry-1.docker.io" --docker_remove_delay="6hrs" --docker_socket="/var/run/docker.sock"
--docker_stop_timeout="0ns" --docker_store_dir="/tmp/Endpoint_SlaveEndpointTest_NoAuthorizer_2_7dwnpT/store/docker"
--docker_volume_checkpoint_dir="/var/run/mesos/isolators/docker/volume" --enforce_container_disk_quota="false"
--executor_registration_timeout="1mins" --executor_reregistration_timeout="2secs" --executor_shutdown_grace_period="5secs"
--fetcher_cache_dir="/tmp/Endpoint_SlaveEndpointTest_NoAuthorizer_2_7dwnpT/fetch" --fetcher_cache_size="2GB"
--frameworks_home="" --gc_delay="1weeks" --gc_disk_headroom="0.1" --hadoop_home="" --help="false"
--hostname_lookup="true" --http_command_executor="false" --http_credentials="/tmp/Endpoint_SlaveEndpointTest_NoAuthorizer_2_7dwnpT/http_credentials"
--http_heartbeat_interval="30secs" --initialize_driver_logging="true" --isolation="posix/cpu,posix/mem"
--launcher="posix" --launcher_dir="/mesos/mesos-1.4.0/_build/src" --logbufsecs="0" --logging_level="INFO"
--max_completed_executors_per_framework="150" --oversubscribed_resources_interval="15secs"
--perf_duration="10secs" --perf_interval="1mins" --port="5051" --qos_correction_interval_min="0ns"
--quiet="false" --recover="reconnect" --recovery_timeout="15mins" --registration_backoff_factor="10ms"
--resources="cpus:2;gpus:0;mem:1024;disk:1024;ports:[31000-32000]" --revocable_cpu_low_priority="true"
--runtime_dir="/tmp/Endpoint_SlaveEndpointTest_NoAuthorizer_2_7dwnpT" --sandbox_directory="/mnt/mesos/sandbox"
--strict="true" --switch_user="true" --systemd_enable_support="true" --systemd_runtime_directory="/run/systemd/system"
--version="false" --work_dir="/tmp/Endpoint_SlaveEndpointTest_NoAuthorizer_2_UlYb5i"
I0602 04:59:41.008193  5838 credentials.hpp:86] Loading credential for authentication from
'/tmp/Endpoint_SlaveEndpointTest_NoAuthorizer_2_7dwnpT/credential'
I0602 04:59:41.008635  5838 slave.cpp:281] Agent using credential for: test-principal
I0602 04:59:41.008873  5838 credentials.hpp:37] Loading credentials for authentication from
'/tmp/Endpoint_SlaveEndpointTest_NoAuthorizer_2_7dwnpT/http_credentials'
I0602 04:59:41.009394  5838 http.cpp:975] Creating default 'basic' HTTP authenticator for
realm 'mesos-agent-readonly'
I0602 04:59:41.009814  5838 http.cpp:975] Creating default 'basic' HTTP authenticator for
realm 'mesos-agent-readwrite'
I0602 04:59:41.011529  5838 slave.cpp:552] Agent resources: cpus(*):2; mem(*):1024; disk(*):1024;
ports(*):[31000-32000]
I0602 04:59:41.011868  5838 slave.cpp:560] Agent attributes: [  ]
I0602 04:59:41.012096  5838 slave.cpp:565] Agent hostname: 0dbb4c477427
I0602 04:59:41.014601  5838 status_update_manager.cpp:177] Pausing sending status updates
I0602 04:59:41.016737  5848 state.cpp:62] Recovering state from '/tmp/Endpoint_SlaveEndpointTest_NoAuthorizer_2_UlYb5i/meta'
I0602 04:59:41.017660  5842 status_update_manager.cpp:203] Recovering status update manager
I0602 04:59:41.017990  5854 containerizer.cpp:582] Recovering containerizer
I0602 04:59:41.020377  5848 provisioner.cpp:416] Provisioner recovery complete
I0602 04:59:41.021034  5849 slave.cpp:6119] Finished recovery
I0602 04:59:41.021872  5849 slave.cpp:6301] Querying resource estimator for oversubscribable
resources
I0602 04:59:41.022830  5832 slave.cpp:6315] Received oversubscribable resources {} from the
resource estimator
I0602 04:59:41.026237  5838 process.cpp:3778] Handling HTTP event for process 'slave(757)'
with path: '/slave(757)/containers'
I0602 04:59:41.027900  5849 http.cpp:1115] HTTP GET for /slave(757)/containers from 172.17.0.4:42158
I0602 04:59:41.028031  5849 http.cpp:936] Authorizing principal 'test-principal' to GET the
'/containers' endpoint
I0602 04:59:41.032872  5841 slave.cpp:817] Agent terminating
[       OK ] Endpoint/SlaveEndpointTest.NoAuthorizer/2 (53 ms)
[----------] 9 tests from Endpoint/SlaveEndpointTest (449 ms total)

[----------] Global test environment tear-down
[==========] 1583 tests from 176 test cases ran. (654508 ms total)
[  PASSED  ] 1578 tests.
[  FAILED  ] 5 tests, listed below:
[  FAILED  ] CommandExecutorCheckTest.CommandCheckDeliveredAndReconciled
[  FAILED  ] DefaultExecutorCheckTest.CommandCheckDeliveredAndReconciled
[  FAILED  ] DefaultExecutorCheckTest.CommandCheckStatusChange
[  FAILED  ] DefaultExecutorCheckTest.CommandCheckSeesParentsEnv
[  FAILED  ] DefaultExecutorCheckTest.CommandCheckSharesWorkDirWithTask

 5 FAILED TESTS
  YOU HAVE 22 DISABLED TESTS

E0602 04:59:41.133545  5856 process.cpp:968] Failed to accept socket: future discarded
make[4]: *** [check-local] Error 1
make[4]: Leaving directory `/mesos/mesos-1.4.0/_build/src'
make[3]: *** [check-am] Error 2
make[3]: Leaving directory `/mesos/mesos-1.4.0/_build/src'
make[2]: *** [check] Error 2
make[2]: Leaving directory `/mesos/mesos-1.4.0/_build/src'
make[1]: *** [check-recursive] Error 1
make[1]: Leaving directory `/mesos/mesos-1.4.0/_build'
make: *** [distcheck] Error 1
+ docker rmi mesos-1496376500-8119
Untagged: mesos-1496376500-8119:latest
Deleted: sha256:56f641d359bfb0b800d401ee378ac4a097d8941baf17b0e90aa9f39f2ee186c3
Deleted: sha256:8aa5a5678b1bf9468ab6ebda18fe4efb12c32a90843f5604e5db949c9c9fe593
Deleted: sha256:e8f0d580cc76e7ac90bdac2aebacf7a490b1daa9362be73d1ed45aff3c0e4713
Deleted: sha256:320cde088d93b108df18c27f934a128b3543455cd8c3654c993a51ad35170002
Deleted: sha256:7be4d47c8316e37ef1ba90a994a3ec24a190530ab5f635f9cb293e30430c5bab
Deleted: sha256:3866fab9bb4b15064e7ab9acd6a6212aff637e3b64c5d83ac387e13f3db66929
Deleted: sha256:a8f1d234eb1fbf5b3b9791c0a130117d6d3609c02493e13ce023217d6075db17
Deleted: sha256:e0f12494a4bdd2e6c14d0b7657dc57eff1d834d18d081f9e49e7235f47464136
Deleted: sha256:92708e750a6bb9f3ac1400fb49e6ce27dae6fd96be74f367ca6b693072d94384
Deleted: sha256:079d2ca69222ff6f4cfdc130ae39edf92738109512b2c2620667dfe5f8e1cbe2
Deleted: sha256:196193285be29ab9d0d11aa751ee0a217ac421515b30f3d503898439e8543a7f
Deleted: sha256:8726060dc758b92f88e84ae107936738b21a8a80edf7598238a54265b2a0c829
Deleted: sha256:bb9c9663ca653cf71eb864f4aa0c6f06b37bb82ea207132e9b9e980072dd1c1e
Deleted: sha256:2bf4a2433cd36e8813c72114604b2b588972022bf68916b52eec24d74cb2c5d5
Deleted: sha256:518dd6ffeb699efa1a11447d9049213c5a7c9e108feab7819d8e8ca6fe514ffb
Deleted: sha256:8d5b6e280f7ce4562dedda2f8b5a9cb9243de4c5022674c351419e32461abbc4
Deleted: sha256:ec0cc1a14c0b4ab7b2c4e3d987a374a0990f6dc8f9e47aa636f2886ad48e58a9
Deleted: sha256:28c73c3d6e9782bfa406f47df2050102a7a7a6f32b15c2e85e5ac9ba8ae69ad7
Deleted: sha256:605d3cc08b38a59ac3f9bb5039d30c16b8eb289ae45e9156e5014f511ce120ac
Deleted: sha256:445335f35d595d21cd05927a9a0e24516d6b098e606c0d0e7d60f4b31f0b16a7
Deleted: sha256:315e34674f4a52bad0dfbe1c00f094d2d6bf4f4c80376b7393aa602eaf15e726
Deleted: sha256:aa0a8ebde08a40853abdd0ef86b48630852ecc1c93c8048626cc9d659537b763
Deleted: sha256:b62b7a7757caa782a80a740c5236a03d568b6424759960687f0657182d8a9f6e
Deleted: sha256:26a51440219297a23af512fad12498f1a4f98b5af896dcd976e26672a0ebb59c
Deleted: sha256:70cee134fc85ccd78d66eff0ed5029fc62a5c6fe04fbd185672fb1cf99947cb2
Build step 'Execute shell' marked build as failure
Not sending mail to unregistered user xujyan@apple.com
Not sending mail to unregistered user neil.conway@gmail.com

Mime
View raw message