mesos-builds mailing list archives

Site index · List index
Message view « Date » · « Thread »
Top « Date » · « Thread »
From Apache Jenkins Server <jenk...@builds.apache.org>
Subject Build failed in Jenkins: Mesos-Buildbot » autotools,clang,--verbose,GLOG_v=1 MESOS_VERBOSE=1,ubuntu:14.04,(docker||Hadoop)&&(!ubuntu-us1)&&(!ubuntu-eu2) #3744
Date Mon, 29 May 2017 23:14:41 GMT
See <https://builds.apache.org/job/Mesos-Buildbot/BUILDTOOL=autotools,COMPILER=clang,CONFIGURATION=--verbose,ENVIRONMENT=GLOG_v=1%20MESOS_VERBOSE=1,OS=ubuntu%3A14.04,label_exp=(docker%7C%7CHadoop)&&(!ubuntu-us1)&&(!ubuntu-eu2)/3744/display/redirect?page=changes>

Changes:

[klueska] Added 'mesos config show' command to the new Mesos CLI.

------------------------------------------
[...truncated 27.62 MB...]
I0529 23:14:31.438433  2967 slave.cpp:801] Agent terminating
[       OK ] Endpoint/SlaveEndpointTest.AuthorizedRequest/1 (27 ms)
[ RUN      ] Endpoint/SlaveEndpointTest.AuthorizedRequest/2
I0529 23:14:31.449314  2945 containerizer.cpp:230] Using isolation: posix/cpu,posix/mem,filesystem/posix,network/cni,environment_secret
W0529 23:14:31.449772  2945 backend.cpp:76] Failed to create 'aufs' backend: AufsBackend requires
root privileges
W0529 23:14:31.449931  2945 backend.cpp:76] Failed to create 'bind' backend: BindBackend requires
root privileges
I0529 23:14:31.449976  2945 provisioner.cpp:255] Using default backend 'copy'
I0529 23:14:31.452971  2971 slave.cpp:232] Mesos agent started on (751)@172.17.0.3:33875
I0529 23:14:31.453003  2971 slave.cpp:233] Flags at startup: --acls="" --appc_simple_discovery_uri_prefix="http://"
--appc_store_dir="/tmp/mesos/store/appc" --authenticate_http_readonly="true" --authenticate_http_readwrite="true"
--authenticatee="crammd5" --authentication_backoff_factor="1secs" --authorizer="local" --cgroups_cpu_enable_pids_and_tids_count="false"
--cgroups_enable_cfs="false" --cgroups_hierarchy="/sys/fs/cgroup" --cgroups_limit_swap="false"
--cgroups_root="mesos" --container_disk_watch_interval="15secs" --containerizers="mesos" --credential="/tmp/Endpoint_SlaveEndpointTest_AuthorizedRequest_2_xG50dX/credential"
--default_role="*" --disk_watch_interval="1mins" --docker="docker" --docker_kill_orphans="true"
--docker_registry="https://registry-1.docker.io" --docker_remove_delay="6hrs" --docker_socket="/var/run/docker.sock"
--docker_stop_timeout="0ns" --docker_store_dir="/tmp/mesos/store/docker" --docker_volume_checkpoint_dir="/var/run/mesos/isolators/docker/volume"
--enforce_container_disk_quota="false" --executor_registration_timeout="1mins" --executor_reregistration_timeout="2secs"
--executor_shutdown_grace_period="5secs" --fetcher_cache_dir="/tmp/Endpoint_SlaveEndpointTest_AuthorizedRequest_2_xG50dX/fetch"
--fetcher_cache_size="2GB" --frameworks_home="" --gc_delay="1weeks" --gc_disk_headroom="0.1"
--hadoop_home="" --help="false" --hostname_lookup="true" --http_command_executor="false" --http_credentials="/tmp/Endpoint_SlaveEndpointTest_AuthorizedRequest_2_xG50dX/http_credentials"
--http_heartbeat_interval="30secs" --initialize_driver_logging="true" --isolation="posix/cpu,posix/mem"
--launcher="posix" --launcher_dir="/mesos/mesos-1.4.0/_build/src" --logbufsecs="0" --logging_level="INFO"
--max_completed_executors_per_framework="150" --oversubscribed_resources_interval="15secs"
--perf_duration="10secs" --perf_interval="1mins" --port="5051" --qos_correction_interval_min="0ns"
--quiet="false" --recover="reconnect" --recovery_timeout="15mins" --registration_backoff_factor="10ms"
--resources="cpus:2;gpus:0;mem:1024;disk:1024;ports:[31000-32000]" --revocable_cpu_low_priority="true"
--runtime_dir="/tmp/Endpoint_SlaveEndpointTest_AuthorizedRequest_2_xG50dX" --sandbox_directory="/mnt/mesos/sandbox"
--strict="true" --switch_user="true" --systemd_enable_support="true" --systemd_runtime_directory="/run/systemd/system"
--version="false" --work_dir="/tmp/Endpoint_SlaveEndpointTest_AuthorizedRequest_2_eviYUY"
I0529 23:14:31.453438  2971 credentials.hpp:86] Loading credential for authentication from
'/tmp/Endpoint_SlaveEndpointTest_AuthorizedRequest_2_xG50dX/credential'
I0529 23:14:31.453582  2971 slave.cpp:265] Agent using credential for: test-principal
I0529 23:14:31.453608  2971 credentials.hpp:37] Loading credentials for authentication from
'/tmp/Endpoint_SlaveEndpointTest_AuthorizedRequest_2_xG50dX/http_credentials'
I0529 23:14:31.453881  2971 http.cpp:975] Creating default 'basic' HTTP authenticator for
realm 'mesos-agent-readonly'
I0529 23:14:31.454064  2971 http.cpp:975] Creating default 'basic' HTTP authenticator for
realm 'mesos-agent-readwrite'
I0529 23:14:31.455220  2971 slave.cpp:536] Agent resources: cpus(*):2; mem(*):1024; disk(*):1024;
ports(*):[31000-32000]
I0529 23:14:31.455288  2971 slave.cpp:544] Agent attributes: [  ]
I0529 23:14:31.455304  2971 slave.cpp:549] Agent hostname: 79a0368d86fb
I0529 23:14:31.455509  2972 status_update_manager.cpp:177] Pausing sending status updates
I0529 23:14:31.456703  2968 state.cpp:62] Recovering state from '/tmp/Endpoint_SlaveEndpointTest_AuthorizedRequest_2_eviYUY/meta'
I0529 23:14:31.456989  2977 status_update_manager.cpp:203] Recovering status update manager
I0529 23:14:31.457180  2970 containerizer.cpp:582] Recovering containerizer
I0529 23:14:31.458513  2975 provisioner.cpp:416] Provisioner recovery complete
I0529 23:14:31.458940  2966 slave.cpp:6083] Finished recovery
I0529 23:14:31.459450  2966 slave.cpp:6265] Querying resource estimator for oversubscribable
resources
I0529 23:14:31.459714  2963 slave.cpp:6279] Received oversubscribable resources {} from the
resource estimator
I0529 23:14:31.462131  2976 process.cpp:3730] Handling HTTP event for process 'slave(751)'
with path: '/slave(751)/containers'
I0529 23:14:31.463433  2974 http.cpp:1115] HTTP GET for /slave(751)/containers from 172.17.0.3:49153
I0529 23:14:31.463511  2974 http.cpp:936] Authorizing principal 'test-principal' to GET the
'/containers' endpoint
I0529 23:14:31.467133  2973 slave.cpp:801] Agent terminating
[       OK ] Endpoint/SlaveEndpointTest.AuthorizedRequest/2 (28 ms)
[ RUN      ] Endpoint/SlaveEndpointTest.UnauthorizedRequest/0
I0529 23:14:31.478783  2945 containerizer.cpp:230] Using isolation: posix/cpu,posix/mem,filesystem/posix,network/cni,environment_secret
W0529 23:14:31.479223  2945 backend.cpp:76] Failed to create 'aufs' backend: AufsBackend requires
root privileges
W0529 23:14:31.479315  2945 backend.cpp:76] Failed to create 'bind' backend: BindBackend requires
root privileges
I0529 23:14:31.479348  2945 provisioner.cpp:255] Using default backend 'copy'
I0529 23:14:31.482362  2968 slave.cpp:232] Mesos agent started on (752)@172.17.0.3:33875
I0529 23:14:31.482403  2968 slave.cpp:233] Flags at startup: --acls="" --appc_simple_discovery_uri_prefix="http://"
--appc_store_dir="/tmp/mesos/store/appc" --authenticate_http_readonly="true" --authenticate_http_readwrite="true"
--authenticatee="crammd5" --authentication_backoff_factor="1secs" --authorizer="local" --cgroups_cpu_enable_pids_and_tids_count="false"
--cgroups_enable_cfs="false" --cgroups_hierarchy="/sys/fs/cgroup" --cgroups_limit_swap="false"
--cgroups_root="mesos" --container_disk_watch_interval="15secs" --containerizers="mesos" --credential="/tmp/Endpoint_SlaveEndpointTest_UnauthorizedRequest_0_pcyXHQ/credential"
--default_role="*" --disk_watch_interval="1mins" --docker="docker" --docker_kill_orphans="true"
--docker_registry="https://registry-1.docker.io" --docker_remove_delay="6hrs" --docker_socket="/var/run/docker.sock"
--docker_stop_timeout="0ns" --docker_store_dir="/tmp/mesos/store/docker" --docker_volume_checkpoint_dir="/var/run/mesos/isolators/docker/volume"
--enforce_container_disk_quota="false" --executor_registration_timeout="1mins" --executor_reregistration_timeout="2secs"
--executor_shutdown_grace_period="5secs" --fetcher_cache_dir="/tmp/Endpoint_SlaveEndpointTest_UnauthorizedRequest_0_pcyXHQ/fetch"
--fetcher_cache_size="2GB" --frameworks_home="" --gc_delay="1weeks" --gc_disk_headroom="0.1"
--hadoop_home="" --help="false" --hostname_lookup="true" --http_command_executor="false" --http_credentials="/tmp/Endpoint_SlaveEndpointTest_UnauthorizedRequest_0_pcyXHQ/http_credentials"
--http_heartbeat_interval="30secs" --initialize_driver_logging="true" --isolation="posix/cpu,posix/mem"
--launcher="posix" --launcher_dir="/mesos/mesos-1.4.0/_build/src" --logbufsecs="0" --logging_level="INFO"
--max_completed_executors_per_framework="150" --oversubscribed_resources_interval="15secs"
--perf_duration="10secs" --perf_interval="1mins" --port="5051" --qos_correction_interval_min="0ns"
--quiet="false" --recover="reconnect" --recovery_timeout="15mins" --registration_backoff_factor="10ms"
--resources="cpus:2;gpus:0;mem:1024;disk:1024;ports:[31000-32000]" --revocable_cpu_low_priority="true"
--runtime_dir="/tmp/Endpoint_SlaveEndpointTest_UnauthorizedRequest_0_pcyXHQ" --sandbox_directory="/mnt/mesos/sandbox"
--strict="true" --switch_user="true" --systemd_enable_support="true" --systemd_runtime_directory="/run/systemd/system"
--version="false" --work_dir="/tmp/Endpoint_SlaveEndpointTest_UnauthorizedRequest_0_OolckS"
I0529 23:14:31.482826  2968 credentials.hpp:86] Loading credential for authentication from
'/tmp/Endpoint_SlaveEndpointTest_UnauthorizedRequest_0_pcyXHQ/credential'
I0529 23:14:31.482965  2968 slave.cpp:265] Agent using credential for: test-principal
I0529 23:14:31.482988  2968 credentials.hpp:37] Loading credentials for authentication from
'/tmp/Endpoint_SlaveEndpointTest_UnauthorizedRequest_0_pcyXHQ/http_credentials'
I0529 23:14:31.483202  2968 http.cpp:975] Creating default 'basic' HTTP authenticator for
realm 'mesos-agent-readonly'
I0529 23:14:31.483330  2968 http.cpp:975] Creating default 'basic' HTTP authenticator for
realm 'mesos-agent-readwrite'
I0529 23:14:31.484542  2968 slave.cpp:536] Agent resources: cpus(*):2; mem(*):1024; disk(*):1024;
ports(*):[31000-32000]
I0529 23:14:31.484619  2968 slave.cpp:544] Agent attributes: [  ]
I0529 23:14:31.484644  2968 slave.cpp:549] Agent hostname: 79a0368d86fb
I0529 23:14:31.484797  2976 status_update_manager.cpp:177] Pausing sending status updates
I0529 23:14:31.486382  2978 state.cpp:62] Recovering state from '/tmp/Endpoint_SlaveEndpointTest_UnauthorizedRequest_0_OolckS/meta'
I0529 23:14:31.486687  2968 status_update_manager.cpp:203] Recovering status update manager
I0529 23:14:31.486917  2966 containerizer.cpp:582] Recovering containerizer
I0529 23:14:31.488275  2963 provisioner.cpp:416] Provisioner recovery complete
I0529 23:14:31.488695  2978 slave.cpp:6083] Finished recovery
I0529 23:14:31.489222  2978 slave.cpp:6265] Querying resource estimator for oversubscribable
resources
I0529 23:14:31.489480  2972 slave.cpp:6279] Received oversubscribable resources {} from the
resource estimator
I0529 23:14:31.491730  2969 process.cpp:3730] Handling HTTP event for process 'slave(752)'
with path: '/slave(752)/monitor/statistics'
I0529 23:14:31.493149  2977 http.cpp:1115] HTTP GET for /slave(752)/monitor/statistics from
172.17.0.3:49154
I0529 23:14:31.493224  2977 http.cpp:936] Authorizing principal 'test-principal' to GET the
'/monitor/statistics' endpoint
I0529 23:14:31.495367  2969 slave.cpp:801] Agent terminating
[       OK ] Endpoint/SlaveEndpointTest.UnauthorizedRequest/0 (27 ms)
[ RUN      ] Endpoint/SlaveEndpointTest.UnauthorizedRequest/1
I0529 23:14:31.506196  2945 containerizer.cpp:230] Using isolation: posix/cpu,posix/mem,filesystem/posix,network/cni,environment_secret
W0529 23:14:31.506759  2945 backend.cpp:76] Failed to create 'aufs' backend: AufsBackend requires
root privileges
W0529 23:14:31.506873  2945 backend.cpp:76] Failed to create 'bind' backend: BindBackend requires
root privileges
I0529 23:14:31.506916  2945 provisioner.cpp:255] Using default backend 'copy'
I0529 23:14:31.510922  2966 slave.cpp:232] Mesos agent started on (753)@172.17.0.3:33875
I0529 23:14:31.510967  2966 slave.cpp:233] Flags at startup: --acls="" --appc_simple_discovery_uri_prefix="http://"
--appc_store_dir="/tmp/mesos/store/appc" --authenticate_http_readonly="true" --authenticate_http_readwrite="true"
--authenticatee="crammd5" --authentication_backoff_factor="1secs" --authorizer="local" --cgroups_cpu_enable_pids_and_tids_count="false"
--cgroups_enable_cfs="false" --cgroups_hierarchy="/sys/fs/cgroup" --cgroups_limit_swap="false"
--cgroups_root="mesos" --container_disk_watch_interval="15secs" --containerizers="mesos" --credential="/tmp/Endpoint_SlaveEndpointTest_UnauthorizedRequest_1_9Z3ZtK/credential"
--default_role="*" --disk_watch_interval="1mins" --docker="docker" --docker_kill_orphans="true"
--docker_registry="https://registry-1.docker.io" --docker_remove_delay="6hrs" --docker_socket="/var/run/docker.sock"
--docker_stop_timeout="0ns" --docker_store_dir="/tmp/mesos/store/docker" --docker_volume_checkpoint_dir="/var/run/mesos/isolators/docker/volume"
--enforce_container_disk_quota="false" --executor_registration_timeout="1mins" --executor_reregistration_timeout="2secs"
--executor_shutdown_grace_period="5secs" --fetcher_cache_dir="/tmp/Endpoint_SlaveEndpointTest_UnauthorizedRequest_1_9Z3ZtK/fetch"
--fetcher_cache_size="2GB" --frameworks_home="" --gc_delay="1weeks" --gc_disk_headroom="0.1"
--hadoop_home="" --help="false" --hostname_lookup="true" --http_command_executor="false" --http_credentials="/tmp/Endpoint_SlaveEndpointTest_UnauthorizedRequest_1_9Z3ZtK/http_credentials"
--http_heartbeat_interval="30secs" --initialize_driver_logging="true" --isolation="posix/cpu,posix/mem"
--launcher="posix" --launcher_dir="/mesos/mesos-1.4.0/_build/src" --logbufsecs="0" --logging_level="INFO"
--max_completed_executors_per_framework="150" --oversubscribed_resources_interval="15secs"
--perf_duration="10secs" --perf_interval="1mins" --port="5051" --qos_correction_interval_min="0ns"
--quiet="false" --recover="reconnect" --recovery_timeout="15mins" --registration_backoff_factor="10ms"
--resources="cpus:2;gpus:0;mem:1024;disk:1024;ports:[31000-32000]" --revocable_cpu_low_priority="true"
--runtime_dir="/tmp/Endpoint_SlaveEndpointTest_UnauthorizedRequest_1_9Z3ZtK" --sandbox_directory="/mnt/mesos/sandbox"
--strict="true" --switch_user="true" --systemd_enable_support="true" --systemd_runtime_directory="/run/systemd/system"
--version="false" --work_dir="/tmp/Endpoint_SlaveEndpointTest_UnauthorizedRequest_1_UG3O1L"
I0529 23:14:31.511458  2966 credentials.hpp:86] Loading credential for authentication from
'/tmp/Endpoint_SlaveEndpointTest_UnauthorizedRequest_1_9Z3ZtK/credential'
I0529 23:14:31.511636  2966 slave.cpp:265] Agent using credential for: test-principal
I0529 23:14:31.511667  2966 credentials.hpp:37] Loading credentials for authentication from
'/tmp/Endpoint_SlaveEndpointTest_UnauthorizedRequest_1_9Z3ZtK/http_credentials'
I0529 23:14:31.511953  2966 http.cpp:975] Creating default 'basic' HTTP authenticator for
realm 'mesos-agent-readonly'
I0529 23:14:31.512133  2966 http.cpp:975] Creating default 'basic' HTTP authenticator for
realm 'mesos-agent-readwrite'
I0529 23:14:31.513674  2966 slave.cpp:536] Agent resources: cpus(*):2; mem(*):1024; disk(*):1024;
ports(*):[31000-32000]
I0529 23:14:31.513770  2966 slave.cpp:544] Agent attributes: [  ]
I0529 23:14:31.513797  2966 slave.cpp:549] Agent hostname: 79a0368d86fb
I0529 23:14:31.514046  2972 status_update_manager.cpp:177] Pausing sending status updates
I0529 23:14:31.515265  2963 state.cpp:62] Recovering state from '/tmp/Endpoint_SlaveEndpointTest_UnauthorizedRequest_1_UG3O1L/meta'
I0529 23:14:31.515669  2969 status_update_manager.cpp:203] Recovering status update manager
I0529 23:14:31.516021  2968 containerizer.cpp:582] Recovering containerizer
I0529 23:14:31.517477  2963 provisioner.cpp:416] Provisioner recovery complete
I0529 23:14:31.517900  2971 slave.cpp:6083] Finished recovery
I0529 23:14:31.518456  2971 slave.cpp:6265] Querying resource estimator for oversubscribable
resources
I0529 23:14:31.518698  2974 slave.cpp:6279] Received oversubscribable resources {} from the
resource estimator
I0529 23:14:31.520784  2972 process.cpp:3730] Handling HTTP event for process 'slave(753)'
with path: '/slave(753)/monitor/statistics.json'
I0529 23:14:31.521950  2975 http.cpp:1115] HTTP GET for /slave(753)/monitor/statistics.json
from 172.17.0.3:49155
I0529 23:14:31.522027  2975 http.cpp:936] Authorizing principal 'test-principal' to GET the
'/monitor/statistics.json' endpoint
I0529 23:14:31.524219  2974 slave.cpp:801] Agent terminating
[       OK ] Endpoint/SlaveEndpointTest.UnauthorizedRequest/1 (28 ms)
[ RUN      ] Endpoint/SlaveEndpointTest.UnauthorizedRequest/2
I0529 23:14:31.533711  2945 containerizer.cpp:230] Using isolation: posix/cpu,posix/mem,filesystem/posix,network/cni,environment_secret
W0529 23:14:31.534193  2945 backend.cpp:76] Failed to create 'aufs' backend: AufsBackend requires
root privileges
W0529 23:14:31.534306  2945 backend.cpp:76] Failed to create 'bind' backend: BindBackend requires
root privileges
I0529 23:14:31.534356  2945 provisioner.cpp:255] Using default backend 'copy'
I0529 23:14:31.537478  2966 slave.cpp:232] Mesos agent started on (754)@172.17.0.3:33875
I0529 23:14:31.537514  2966 slave.cpp:233] Flags at startup: --acls="" --appc_simple_discovery_uri_prefix="http://"
--appc_store_dir="/tmp/mesos/store/appc" --authenticate_http_readonly="true" --authenticate_http_readwrite="true"
--authenticatee="crammd5" --authentication_backoff_factor="1secs" --authorizer="local" --cgroups_cpu_enable_pids_and_tids_count="false"
--cgroups_enable_cfs="false" --cgroups_hierarchy="/sys/fs/cgroup" --cgroups_limit_swap="false"
--cgroups_root="mesos" --container_disk_watch_interval="15secs" --containerizers="mesos" --credential="/tmp/Endpoint_SlaveEndpointTest_UnauthorizedRequest_2_bbMyyE/credential"
--default_role="*" --disk_watch_interval="1mins" --docker="docker" --docker_kill_orphans="true"
--docker_registry="https://registry-1.docker.io" --docker_remove_delay="6hrs" --docker_socket="/var/run/docker.sock"
--docker_stop_timeout="0ns" --docker_store_dir="/tmp/mesos/store/docker" --docker_volume_checkpoint_dir="/var/run/mesos/isolators/docker/volume"
--enforce_container_disk_quota="false" --executor_registration_timeout="1mins" --executor_reregistration_timeout="2secs"
--executor_shutdown_grace_period="5secs" --fetcher_cache_dir="/tmp/Endpoint_SlaveEndpointTest_UnauthorizedRequest_2_bbMyyE/fetch"
--fetcher_cache_size="2GB" --frameworks_home="" --gc_delay="1weeks" --gc_disk_headroom="0.1"
--hadoop_home="" --help="false" --hostname_lookup="true" --http_command_executor="false" --http_credentials="/tmp/Endpoint_SlaveEndpointTest_UnauthorizedRequest_2_bbMyyE/http_credentials"
--http_heartbeat_interval="30secs" --initialize_driver_logging="true" --isolation="posix/cpu,posix/mem"
--launcher="posix" --launcher_dir="/mesos/mesos-1.4.0/_build/src" --logbufsecs="0" --logging_level="INFO"
--max_completed_executors_per_framework="150" --oversubscribed_resources_interval="15secs"
--perf_duration="10secs" --perf_interval="1mins" --port="5051" --qos_correction_interval_min="0ns"
--quiet="false" --recover="reconnect" --recovery_timeout="15mins" --registration_backoff_factor="10ms"
--resources="cpus:2;gpus:0;mem:1024;disk:1024;ports:[31000-32000]" --revocable_cpu_low_priority="true"
--runtime_dir="/tmp/Endpoint_SlaveEndpointTest_UnauthorizedRequest_2_bbMyyE" --sandbox_directory="/mnt/mesos/sandbox"
--strict="true" --switch_user="true" --systemd_enable_support="true" --systemd_runtime_directory="/run/systemd/system"
--version="false" --work_dir="/tmp/Endpoint_SlaveEndpointTest_UnauthorizedRequest_2_cLjO1F"
I0529 23:14:31.538007  2966 credentials.hpp:86] Loading credential for authentication from
'/tmp/Endpoint_SlaveEndpointTest_UnauthorizedRequest_2_bbMyyE/credential'
I0529 23:14:31.538167  2966 slave.cpp:265] Agent using credential for: test-principal
I0529 23:14:31.538198  2966 credentials.hpp:37] Loading credentials for authentication from
'/tmp/Endpoint_SlaveEndpointTest_UnauthorizedRequest_2_bbMyyE/http_credentials'
I0529 23:14:31.538452  2966 http.cpp:975] Creating default 'basic' HTTP authenticator for
realm 'mesos-agent-readonly'
I0529 23:14:31.538597  2966 http.cpp:975] Creating default 'basic' HTTP authenticator for
realm 'mesos-agent-readwrite'
I0529 23:14:31.539927  2966 slave.cpp:536] Agent resources: cpus(*):2; mem(*):1024; disk(*):1024;
ports(*):[31000-32000]
I0529 23:14:31.540007  2966 slave.cpp:544] Agent attributes: [  ]
I0529 23:14:31.540030  2966 slave.cpp:549] Agent hostname: 79a0368d86fb
I0529 23:14:31.540207  2964 status_update_manager.cpp:177] Pausing sending status updates
I0529 23:14:31.541353  2974 state.cpp:62] Recovering state from '/tmp/Endpoint_SlaveEndpointTest_UnauthorizedRequest_2_cLjO1F/meta'
I0529 23:14:31.541568  2977 status_update_manager.cpp:203] Recovering status update manager
I0529 23:14:31.541872  2969 containerizer.cpp:582] Recovering containerizer
I0529 23:14:31.543321  2965 provisioner.cpp:416] Provisioner recovery complete
I0529 23:14:31.543720  2976 slave.cpp:6083] Finished recovery
I0529 23:14:31.544240  2976 slave.cpp:6265] Querying resource estimator for oversubscribable
resources
I0529 23:14:31.544489  2976 slave.cpp:6279] Received oversubscribable resources {} from the
resource estimator
I0529 23:14:31.546872  2978 process.cpp:3730] Handling HTTP event for process 'slave(754)'
with path: '/slave(754)/containers'
I0529 23:14:31.548468  2971 http.cpp:1115] HTTP GET for /slave(754)/containers from 172.17.0.3:49156
I0529 23:14:31.548560  2971 http.cpp:936] Authorizing principal 'test-principal' to GET the
'/containers' endpoint
I0529 23:14:31.551296  2978 slave.cpp:801] Agent terminating
[       OK ] Endpoint/SlaveEndpointTest.UnauthorizedRequest/2 (27 ms)
[ RUN      ] Endpoint/SlaveEndpointTest.NoAuthorizer/0
I0529 23:14:31.562340  2945 containerizer.cpp:230] Using isolation: posix/cpu,posix/mem,filesystem/posix,network/cni,environment_secret
W0529 23:14:31.562754  2945 backend.cpp:76] Failed to create 'aufs' backend: AufsBackend requires
root privileges
W0529 23:14:31.562840  2945 backend.cpp:76] Failed to create 'bind' backend: BindBackend requires
root privileges
I0529 23:14:31.562870  2945 provisioner.cpp:255] Using default backend 'copy'
I0529 23:14:31.564746  2945 cluster.cpp:448] Creating default 'local' authorizer
I0529 23:14:31.566264  2969 slave.cpp:232] Mesos agent started on (755)@172.17.0.3:33875
I0529 23:14:31.566313  2969 slave.cpp:233] Flags at startup: --acls="" --appc_simple_discovery_uri_prefix="http://"
--appc_store_dir="/tmp/mesos/store/appc" --authenticate_http_readonly="true" --authenticate_http_readwrite="true"
--authenticatee="crammd5" --authentication_backoff_factor="1secs" --authorizer="local" --cgroups_cpu_enable_pids_and_tids_count="false"
--cgroups_enable_cfs="false" --cgroups_hierarchy="/sys/fs/cgroup" --cgroups_limit_swap="false"
--cgroups_root="mesos" --container_disk_watch_interval="15secs" --containerizers="mesos" --credential="/tmp/Endpoint_SlaveEndpointTest_NoAuthorizer_0_HPJKUy/credential"
--default_role="*" --disk_watch_interval="1mins" --docker="docker" --docker_kill_orphans="true"
--docker_registry="https://registry-1.docker.io" --docker_remove_delay="6hrs" --docker_socket="/var/run/docker.sock"
--docker_stop_timeout="0ns" --docker_store_dir="/tmp/mesos/store/docker" --docker_volume_checkpoint_dir="/var/run/mesos/isolators/docker/volume"
--enforce_container_disk_quota="false" --executor_registration_timeout="1mins" --executor_reregistration_timeout="2secs"
--executor_shutdown_grace_period="5secs" --fetcher_cache_dir="/tmp/Endpoint_SlaveEndpointTest_NoAuthorizer_0_HPJKUy/fetch"
--fetcher_cache_size="2GB" --frameworks_home="" --gc_delay="1weeks" --gc_disk_headroom="0.1"
--hadoop_home="" --help="false" --hostname_lookup="true" --http_command_executor="false" --http_credentials="/tmp/Endpoint_SlaveEndpointTest_NoAuthorizer_0_HPJKUy/http_credentials"
--http_heartbeat_interval="30secs" --initialize_driver_logging="true" --isolation="posix/cpu,posix/mem"
--launcher="posix" --launcher_dir="/mesos/mesos-1.4.0/_build/src" --logbufsecs="0" --logging_level="INFO"
--max_completed_executors_per_framework="150" --oversubscribed_resources_interval="15secs"
--perf_duration="10secs" --perf_interval="1mins" --port="5051" --qos_correction_interval_min="0ns"
--quiet="false" --recover="reconnect" --recovery_timeout="15mins" --registration_backoff_factor="10ms"
--resources="cpus:2;gpus:0;mem:1024;disk:1024;ports:[31000-32000]" --revocable_cpu_low_priority="true"
--runtime_dir="/tmp/Endpoint_SlaveEndpointTest_NoAuthorizer_0_HPJKUy" --sandbox_directory="/mnt/mesos/sandbox"
--strict="true" --switch_user="true" --systemd_enable_support="true" --systemd_runtime_directory="/run/systemd/system"
--version="false" --work_dir="/tmp/Endpoint_SlaveEndpointTest_NoAuthorizer_0_U7tvjA"
I0529 23:14:31.566849  2969 credentials.hpp:86] Loading credential for authentication from
'/tmp/Endpoint_SlaveEndpointTest_NoAuthorizer_0_HPJKUy/credential'
I0529 23:14:31.567047  2969 slave.cpp:265] Agent using credential for: test-principal
I0529 23:14:31.567082  2969 credentials.hpp:37] Loading credentials for authentication from
'/tmp/Endpoint_SlaveEndpointTest_NoAuthorizer_0_HPJKUy/http_credentials'
I0529 23:14:31.567407  2969 http.cpp:975] Creating default 'basic' HTTP authenticator for
realm 'mesos-agent-readonly'
I0529 23:14:31.567603  2969 http.cpp:975] Creating default 'basic' HTTP authenticator for
realm 'mesos-agent-readwrite'
I0529 23:14:31.569159  2969 slave.cpp:536] Agent resources: cpus(*):2; mem(*):1024; disk(*):1024;
ports(*):[31000-32000]
I0529 23:14:31.569257  2969 slave.cpp:544] Agent attributes: [  ]
I0529 23:14:31.569285  2969 slave.cpp:549] Agent hostname: 79a0368d86fb
I0529 23:14:31.569485  2976 status_update_manager.cpp:177] Pausing sending status updates
I0529 23:14:31.570950  2974 state.cpp:62] Recovering state from '/tmp/Endpoint_SlaveEndpointTest_NoAuthorizer_0_U7tvjA/meta'
I0529 23:14:31.571265  2964 status_update_manager.cpp:203] Recovering status update manager
I0529 23:14:31.571496  2975 containerizer.cpp:582] Recovering containerizer
I0529 23:14:31.573341  2972 provisioner.cpp:416] Provisioner recovery complete
I0529 23:14:31.573746  2976 slave.cpp:6083] Finished recovery
I0529 23:14:31.574229  2976 slave.cpp:6265] Querying resource estimator for oversubscribable
resources
I0529 23:14:31.574497  2963 slave.cpp:6279] Received oversubscribable resources {} from the
resource estimator
I0529 23:14:31.576577  2973 process.cpp:3730] Handling HTTP event for process 'slave(755)'
with path: '/slave(755)/monitor/statistics'
I0529 23:14:31.577905  2967 http.cpp:1115] HTTP GET for /slave(755)/monitor/statistics from
172.17.0.3:49157
I0529 23:14:31.577986  2967 http.cpp:936] Authorizing principal 'test-principal' to GET the
'/monitor/statistics' endpoint
I0529 23:14:31.582151  2971 slave.cpp:801] Agent terminating
[       OK ] Endpoint/SlaveEndpointTest.NoAuthorizer/0 (30 ms)
[ RUN      ] Endpoint/SlaveEndpointTest.NoAuthorizer/1
I0529 23:14:31.593163  2945 containerizer.cpp:230] Using isolation: posix/cpu,posix/mem,filesystem/posix,network/cni,environment_secret
W0529 23:14:31.593762  2945 backend.cpp:76] Failed to create 'aufs' backend: AufsBackend requires
root privileges
W0529 23:14:31.593896  2945 backend.cpp:76] Failed to create 'bind' backend: BindBackend requires
root privileges
I0529 23:14:31.593940  2945 provisioner.cpp:255] Using default backend 'copy'
I0529 23:14:31.595790  2945 cluster.cpp:448] Creating default 'local' authorizer
I0529 23:14:31.597383  2971 slave.cpp:232] Mesos agent started on (756)@172.17.0.3:33875
I0529 23:14:31.597503  2971 slave.cpp:233] Flags at startup: --acls="" --appc_simple_discovery_uri_prefix="http://"
--appc_store_dir="/tmp/mesos/store/appc" --authenticate_http_readonly="true" --authenticate_http_readwrite="true"
--authenticatee="crammd5" --authentication_backoff_factor="1secs" --authorizer="local" --cgroups_cpu_enable_pids_and_tids_count="false"
--cgroups_enable_cfs="false" --cgroups_hierarchy="/sys/fs/cgroup" --cgroups_limit_swap="false"
--cgroups_root="mesos" --container_disk_watch_interval="15secs" --containerizers="mesos" --credential="/tmp/Endpoint_SlaveEndpointTest_NoAuthorizer_1_DhtKAt/credential"
--default_role="*" --disk_watch_interval="1mins" --docker="docker" --docker_kill_orphans="true"
--docker_registry="https://registry-1.docker.io" --docker_remove_delay="6hrs" --docker_socket="/var/run/docker.sock"
--docker_stop_timeout="0ns" --docker_store_dir="/tmp/mesos/store/docker" --docker_volume_checkpoint_dir="/var/run/mesos/isolators/docker/volume"
--enforce_container_disk_quota="false" --executor_registration_timeout="1mins" --executor_reregistration_timeout="2secs"
--executor_shutdown_grace_period="5secs" --fetcher_cache_dir="/tmp/Endpoint_SlaveEndpointTest_NoAuthorizer_1_DhtKAt/fetch"
--fetcher_cache_size="2GB" --frameworks_home="" --gc_delay="1weeks" --gc_disk_headroom="0.1"
--hadoop_home="" --help="false" --hostname_lookup="true" --http_command_executor="false" --http_credentials="/tmp/Endpoint_SlaveEndpointTest_NoAuthorizer_1_DhtKAt/http_credentials"
--http_heartbeat_interval="30secs" --initialize_driver_logging="true" --isolation="posix/cpu,posix/mem"
--launcher="posix" --launcher_dir="/mesos/mesos-1.4.0/_build/src" --logbufsecs="0" --logging_level="INFO"
--max_completed_executors_per_framework="150" --oversubscribed_resources_interval="15secs"
--perf_duration="10secs" --perf_interval="1mins" --port="5051" --qos_correction_interval_min="0ns"
--quiet="false" --recover="reconnect" --recovery_timeout="15mins" --registration_backoff_factor="10ms"
--resources="cpus:2;gpus:0;mem:1024;disk:1024;ports:[31000-32000]" --revocable_cpu_low_priority="true"
--runtime_dir="/tmp/Endpoint_SlaveEndpointTest_NoAuthorizer_1_DhtKAt" --sandbox_directory="/mnt/mesos/sandbox"
--strict="true" --switch_user="true" --systemd_enable_support="true" --systemd_runtime_directory="/run/systemd/system"
--version="false" --work_dir="/tmp/Endpoint_SlaveEndpointTest_NoAuthorizer_1_ELjwUu"
I0529 23:14:31.598026  2971 credentials.hpp:86] Loading credential for authentication from
'/tmp/Endpoint_SlaveEndpointTest_NoAuthorizer_1_DhtKAt/credential'
I0529 23:14:31.598251  2971 slave.cpp:265] Agent using credential for: test-principal
I0529 23:14:31.598285  2971 credentials.hpp:37] Loading credentials for authentication from
'/tmp/Endpoint_SlaveEndpointTest_NoAuthorizer_1_DhtKAt/http_credentials'
I0529 23:14:31.598593  2971 http.cpp:975] Creating default 'basic' HTTP authenticator for
realm 'mesos-agent-readonly'
I0529 23:14:31.598788  2971 http.cpp:975] Creating default 'basic' HTTP authenticator for
realm 'mesos-agent-readwrite'
I0529 23:14:31.600311  2971 slave.cpp:536] Agent resources: cpus(*):2; mem(*):1024; disk(*):1024;
ports(*):[31000-32000]
I0529 23:14:31.600404  2971 slave.cpp:544] Agent attributes: [  ]
I0529 23:14:31.600422  2971 slave.cpp:549] Agent hostname: 79a0368d86fb
I0529 23:14:31.600569  2967 status_update_manager.cpp:177] Pausing sending status updates
I0529 23:14:31.602239  2973 state.cpp:62] Recovering state from '/tmp/Endpoint_SlaveEndpointTest_NoAuthorizer_1_ELjwUu/meta'
I0529 23:14:31.602530  2966 status_update_manager.cpp:203] Recovering status update manager
I0529 23:14:31.602875  2975 containerizer.cpp:582] Recovering containerizer
I0529 23:14:31.604674  2974 provisioner.cpp:416] Provisioner recovery complete
I0529 23:14:31.605130  2967 slave.cpp:6083] Finished recovery
I0529 23:14:31.605690  2967 slave.cpp:6265] Querying resource estimator for oversubscribable
resources
I0529 23:14:31.606106  2970 slave.cpp:6279] Received oversubscribable resources {} from the
resource estimator
I0529 23:14:31.608664  2968 process.cpp:3730] Handling HTTP event for process 'slave(756)'
with path: '/slave(756)/monitor/statistics.json'
I0529 23:14:31.609984  2974 http.cpp:1115] HTTP GET for /slave(756)/monitor/statistics.json
from 172.17.0.3:49158
I0529 23:14:31.610076  2974 http.cpp:936] Authorizing principal 'test-principal' to GET the
'/monitor/statistics.json' endpoint
I0529 23:14:31.613497  2973 slave.cpp:801] Agent terminating
[       OK ] Endpoint/SlaveEndpointTest.NoAuthorizer/1 (32 ms)
[ RUN      ] Endpoint/SlaveEndpointTest.NoAuthorizer/2
I0529 23:14:31.624917  2945 containerizer.cpp:230] Using isolation: posix/cpu,posix/mem,filesystem/posix,network/cni,environment_secret
W0529 23:14:31.625417  2945 backend.cpp:76] Failed to create 'aufs' backend: AufsBackend requires
root privileges
W0529 23:14:31.625520  2945 backend.cpp:76] Failed to create 'bind' backend: BindBackend requires
root privileges
I0529 23:14:31.625571  2945 provisioner.cpp:255] Using default backend 'copy'
I0529 23:14:31.627455  2945 cluster.cpp:448] Creating default 'local' authorizer
I0529 23:14:31.629097  2972 slave.cpp:232] Mesos agent started on (757)@172.17.0.3:33875
I0529 23:14:31.629142  2972 slave.cpp:233] Flags at startup: --acls="" --appc_simple_discovery_uri_prefix="http://"
--appc_store_dir="/tmp/mesos/store/appc" --authenticate_http_readonly="true" --authenticate_http_readwrite="true"
--authenticatee="crammd5" --authentication_backoff_factor="1secs" --authorizer="local" --cgroups_cpu_enable_pids_and_tids_count="false"
--cgroups_enable_cfs="false" --cgroups_hierarchy="/sys/fs/cgroup" --cgroups_limit_swap="false"
--cgroups_root="mesos" --container_disk_watch_interval="15secs" --containerizers="mesos" --credential="/tmp/Endpoint_SlaveEndpointTest_NoAuthorizer_2_xiaBBo/credential"
--default_role="*" --disk_watch_interval="1mins" --docker="docker" --docker_kill_orphans="true"
--docker_registry="https://registry-1.docker.io" --docker_remove_delay="6hrs" --docker_socket="/var/run/docker.sock"
--docker_stop_timeout="0ns" --docker_store_dir="/tmp/mesos/store/docker" --docker_volume_checkpoint_dir="/var/run/mesos/isolators/docker/volume"
--enforce_container_disk_quota="false" --executor_registration_timeout="1mins" --executor_reregistration_timeout="2secs"
--executor_shutdown_grace_period="5secs" --fetcher_cache_dir="/tmp/Endpoint_SlaveEndpointTest_NoAuthorizer_2_xiaBBo/fetch"
--fetcher_cache_size="2GB" --frameworks_home="" --gc_delay="1weeks" --gc_disk_headroom="0.1"
--hadoop_home="" --help="false" --hostname_lookup="true" --http_command_executor="false" --http_credentials="/tmp/Endpoint_SlaveEndpointTest_NoAuthorizer_2_xiaBBo/http_credentials"
--http_heartbeat_interval="30secs" --initialize_driver_logging="true" --isolation="posix/cpu,posix/mem"
--launcher="posix" --launcher_dir="/mesos/mesos-1.4.0/_build/src" --logbufsecs="0" --logging_level="INFO"
--max_completed_executors_per_framework="150" --oversubscribed_resources_interval="15secs"
--perf_duration="10secs" --perf_interval="1mins" --port="5051" --qos_correction_interval_min="0ns"
--quiet="false" --recover="reconnect" --recovery_timeout="15mins" --registration_backoff_factor="10ms"
--resources="cpus:2;gpus:0;mem:1024;disk:1024;ports:[31000-32000]" --revocable_cpu_low_priority="true"
--runtime_dir="/tmp/Endpoint_SlaveEndpointTest_NoAuthorizer_2_xiaBBo" --sandbox_directory="/mnt/mesos/sandbox"
--strict="true" --switch_user="true" --systemd_enable_support="true" --systemd_runtime_directory="/run/systemd/system"
--version="false" --work_dir="/tmp/Endpoint_SlaveEndpointTest_NoAuthorizer_2_CHb8Pp"
I0529 23:14:31.629622  2972 credentials.hpp:86] Loading credential for authentication from
'/tmp/Endpoint_SlaveEndpointTest_NoAuthorizer_2_xiaBBo/credential'
I0529 23:14:31.629801  2972 slave.cpp:265] Agent using credential for: test-principal
I0529 23:14:31.629871  2972 credentials.hpp:37] Loading credentials for authentication from
'/tmp/Endpoint_SlaveEndpointTest_NoAuthorizer_2_xiaBBo/http_credentials'
I0529 23:14:31.630167  2972 http.cpp:975] Creating default 'basic' HTTP authenticator for
realm 'mesos-agent-readonly'
I0529 23:14:31.630331  2972 http.cpp:975] Creating default 'basic' HTTP authenticator for
realm 'mesos-agent-readwrite'
I0529 23:14:31.631808  2972 slave.cpp:536] Agent resources: cpus(*):2; mem(*):1024; disk(*):1024;
ports(*):[31000-32000]
I0529 23:14:31.631889  2972 slave.cpp:544] Agent attributes: [  ]
I0529 23:14:31.631906  2972 slave.cpp:549] Agent hostname: 79a0368d86fb
I0529 23:14:31.632040  2976 status_update_manager.cpp:177] Pausing sending status updates
I0529 23:14:31.633345  2978 state.cpp:62] Recovering state from '/tmp/Endpoint_SlaveEndpointTest_NoAuthorizer_2_CHb8Pp/meta'
I0529 23:14:31.633620  2971 status_update_manager.cpp:203] Recovering status update manager
I0529 23:14:31.633931  2974 containerizer.cpp:582] Recovering containerizer
I0529 23:14:31.635474  2975 provisioner.cpp:416] Provisioner recovery complete
I0529 23:14:31.635946  2978 slave.cpp:6083] Finished recovery
I0529 23:14:31.636435  2978 slave.cpp:6265] Querying resource estimator for oversubscribable
resources
I0529 23:14:31.636785  2970 slave.cpp:6279] Received oversubscribable resources {} from the
resource estimator
I0529 23:14:31.639050  2965 process.cpp:3730] Handling HTTP event for process 'slave(757)'
with path: '/slave(757)/containers'
I0529 23:14:31.640290  2969 http.cpp:1115] HTTP GET for /slave(757)/containers from 172.17.0.3:49159
I0529 23:14:31.640372  2969 http.cpp:936] Authorizing principal 'test-principal' to GET the
'/containers' endpoint
I0529 23:14:31.643698  2964 slave.cpp:801] Agent terminating
[       OK ] Endpoint/SlaveEndpointTest.NoAuthorizer/2 (30 ms)
[----------] 9 tests from Endpoint/SlaveEndpointTest (267 ms total)

[----------] Global test environment tear-down
[==========] 1583 tests from 176 test cases ran. (444264 ms total)
[  PASSED  ] 1582 tests.
[  FAILED  ] 1 test, listed below:
[  FAILED  ] ProvisionerDockerLocalStoreTest.MissingLayer

 1 FAILED TEST
  YOU HAVE 22 DISABLED TESTS

E0529 23:14:31.707320  2979 process.cpp:950] Failed to accept socket: future discarded
make[4]: *** [check-local] Error 1
make[4]: Leaving directory `/mesos/mesos-1.4.0/_build/src'
make[3]: *** [check-am] Error 2
make[3]: Leaving directory `/mesos/mesos-1.4.0/_build/src'
make[2]: *** [check] Error 2
make[2]: Leaving directory `/mesos/mesos-1.4.0/_build/src'
make[1]: *** [check-recursive] Error 1
make[1]: Leaving directory `/mesos/mesos-1.4.0/_build'
make: *** [distcheck] Error 1
+ docker rmi mesos-1496096844-16118
Untagged: mesos-1496096844-16118:latest
Deleted: sha256:008122dbc5fba274aaed9864b736ac7db89b550010d908561362868e22ba44f1
Deleted: sha256:29d05c0a3b55bf46b599be358d1403237b9fc3569349eb44aae48edeb434da41
Deleted: sha256:6030c8e98e44f72ad64d1e920c95ff6982e103be4e74d00b10e45514d3020562
Deleted: sha256:f27ef02afb540cf6e3ed6f46b7e43767a5596a0f518dec79e7669e82a4c5fd4b
Deleted: sha256:1931d3814a63fcb7c81b54375d88f0c3ec3782579d7cf368e252ff70f31742ac
Deleted: sha256:7ce51585983cd303840a09a8d926e0bbc100d3575a94f7448ef820b89d8151fc
Deleted: sha256:7eed7dbf93dd3f88e9bc22a045ad8e3b0fe842d7630ccea9dc878e1fa0a23afe
Deleted: sha256:0103e2ea9bc3c79044a45cd7cd697396556b4c8f8bee1b6bc72e2c6f5b41cbf2
Deleted: sha256:b77d5c8a52abfc63f5eb767888c74f7cc2edd60b3bb558e21a317479f97bf16c
Deleted: sha256:83012a93c35a4575873a69a0c46f334cc4873852022aec5df4dd832e13ada351
Deleted: sha256:37e147d16fdf73cfbb3bedfb77456afd8eb4b2e341fe344ca9efee9d179b3f77
Deleted: sha256:07933366b7604a660d62d1942b66f018d6bdd081cabd4a465b60b2463d6d7d93
Deleted: sha256:7d285fc187deecdc4d151524600358e588b6742a972d3b3a17619214a4aabd6c
Deleted: sha256:1519ac118e7e661ebe866ff18719338b58ff609f6b4b4b4ea57fb4c315958c9b
Deleted: sha256:495dd6347f57623d6d223ed2bce0d0961efc930c0cc88c5140de82a585e43906
Deleted: sha256:b693f178d5920b3e42b3dc6ff921f09365cf3ddcd27f5a162de562f91f7d4b65
Deleted: sha256:5f41b4d0208c7b955abdeae798fe17e507e4aa881bce2f1a74043ba4928748da
Deleted: sha256:79065adb9ded59aa71c937cbe3cf826ac640c9079ec33b5a939dba1f5b94bc48
Deleted: sha256:1c16c281ffc97a23308fdd0b055eae1772a3e913dda9c5b4429d253769b681d9
Deleted: sha256:a11e709296d7bb566ef585af10eb02e94af121565d2e3a78dbc8e98ceb0cdea9
Deleted: sha256:d59a1d1b3d1da67e83c219d78e62b27734d5fb0251fd2a8f44fb62c97e2e4491
Deleted: sha256:f09ac7703bb73483f6607bc23dfbb8c79deef2ddadeac78385ef8b6bffb504bc
Deleted: sha256:26620a21cd267457052d727a9b60a799f8ae72f7bb6d36cb5c0022c8d1c97e33
Deleted: sha256:a2a39cdb23f9b3e01897508479f0900f51dfcf0d22bef1430d762472a796235e
Build step 'Execute shell' marked build as failure

Mime
View raw message