mesos-builds mailing list archives

Site index · List index
Message view « Date » · « Thread »
Top « Date » · « Thread »
From Apache Jenkins Server <jenk...@builds.apache.org>
Subject Build failed in Jenkins: Mesos-Buildbot » cmake,clang,--verbose,GLOG_v=1 MESOS_VERBOSE=1,ubuntu:14.04,(docker||Hadoop)&&(!ubuntu-us1)&&(!ubuntu-eu2) #3655
Date Thu, 11 May 2017 00:40:06 GMT
See <https://builds.apache.org/job/Mesos-Buildbot/BUILDTOOL=cmake,COMPILER=clang,CONFIGURATION=--verbose,ENVIRONMENT=GLOG_v=1%20MESOS_VERBOSE=1,OS=ubuntu%3A14.04,label_exp=(docker%7C%7CHadoop)&&(!ubuntu-us1)&&(!ubuntu-eu2)/3655/display/redirect?page=changes>

Changes:

[neil.conway] Added MESOS-7378 to CHANGELOG for 1.3.0.

------------------------------------------
[...truncated 25.06 MB...]
I0511 00:39:57.540112 24000 http.cpp:936] Authorizing principal 'test-principal' to GET the
'/monitor/statistics.json' endpoint
I0511 00:39:57.541545 23992 slave.cpp:790] Agent terminating
[       OK ] Endpoint/SlaveEndpointTest.AuthorizedRequest/1 (11 ms)
[ RUN      ] Endpoint/SlaveEndpointTest.AuthorizedRequest/2
I0511 00:39:57.545864 23984 containerizer.cpp:221] Using isolation: posix/cpu,posix/mem,filesystem/posix,network/cni
W0511 00:39:57.546105 23984 backend.cpp:76] Failed to create 'aufs' backend: AufsBackend requires
root privileges
W0511 00:39:57.546145 23984 backend.cpp:76] Failed to create 'bind' backend: BindBackend requires
root privileges
I0511 00:39:57.546160 23984 provisioner.cpp:249] Using default backend 'copy'
I0511 00:39:57.547122 23987 slave.cpp:225] Mesos agent started on (744)@172.17.0.3:39831
I0511 00:39:57.547158 23987 slave.cpp:226] Flags at startup: --acls="" --appc_simple_discovery_uri_prefix="http://"
--appc_store_dir="/tmp/mesos/store/appc" --authenticate_http_readonly="true" --authenticate_http_readwrite="true"
--authenticatee="crammd5" --authentication_backoff_factor="1secs" --authorizer="local" --cgroups_cpu_enable_pids_and_tids_count="false"
--cgroups_enable_cfs="false" --cgroups_hierarchy="/sys/fs/cgroup" --cgroups_limit_swap="false"
--cgroups_root="mesos" --container_disk_watch_interval="15secs" --containerizers="mesos" --credential="/tmp/Endpoint_SlaveEndpointTest_AuthorizedRequest_2_g6rgqr/credential"
--default_role="*" --disk_watch_interval="1mins" --docker="docker" --docker_kill_orphans="true"
--docker_registry="https://registry-1.docker.io" --docker_remove_delay="6hrs" --docker_socket="/var/run/docker.sock"
--docker_stop_timeout="0ns" --docker_store_dir="/tmp/mesos/store/docker" --docker_volume_checkpoint_dir="/var/run/mesos/isolators/docker/volume"
--enforce_container_disk_quota="false" --executor_registration_timeout="1mins" --executor_shutdown_grace_period="5secs"
--fetcher_cache_dir="/tmp/Endpoint_SlaveEndpointTest_AuthorizedRequest_2_g6rgqr/fetch" --fetcher_cache_size="2GB"
--frameworks_home="" --gc_delay="1weeks" --gc_disk_headroom="0.1" --hadoop_home="" --help="false"
--hostname_lookup="true" --http_command_executor="false" --http_credentials="/tmp/Endpoint_SlaveEndpointTest_AuthorizedRequest_2_g6rgqr/http_credentials"
--http_heartbeat_interval="30secs" --initialize_driver_logging="true" --isolation="posix/cpu,posix/mem"
--launcher="posix" --launcher_dir="/mesos/build/src" --logbufsecs="0" --logging_level="INFO"
--max_completed_executors_per_framework="150" --oversubscribed_resources_interval="15secs"
--perf_duration="10secs" --perf_interval="1mins" --port="5051" --qos_correction_interval_min="0ns"
--quiet="false" --recover="reconnect" --recovery_timeout="15mins" --registration_backoff_factor="10ms"
--resources="cpus:2;gpus:0;mem:1024;disk:1024;ports:[31000-32000]" --revocable_cpu_low_priority="true"
--runtime_dir="/tmp/Endpoint_SlaveEndpointTest_AuthorizedRequest_2_g6rgqr" --sandbox_directory="/mnt/mesos/sandbox"
--strict="true" --switch_user="true" --systemd_enable_support="true" --systemd_runtime_directory="/run/systemd/system"
--version="false" --work_dir="/tmp/Endpoint_SlaveEndpointTest_AuthorizedRequest_2_HQ7Ya4"
I0511 00:39:57.547433 23987 credentials.hpp:86] Loading credential for authentication from
'/tmp/Endpoint_SlaveEndpointTest_AuthorizedRequest_2_g6rgqr/credential'
I0511 00:39:57.547540 23987 slave.cpp:258] Agent using credential for: test-principal
I0511 00:39:57.547556 23987 credentials.hpp:37] Loading credentials for authentication from
'/tmp/Endpoint_SlaveEndpointTest_AuthorizedRequest_2_g6rgqr/http_credentials'
I0511 00:39:57.547699 23987 http.cpp:975] Creating default 'basic' HTTP authenticator for
realm 'mesos-agent-readonly'
I0511 00:39:57.547767 23987 http.cpp:975] Creating default 'basic' HTTP authenticator for
realm 'mesos-agent-readwrite'
I0511 00:39:57.548343 23987 slave.cpp:525] Agent resources: cpus(*):2; mem(*):1024; disk(*):1024;
ports(*):[31000-32000]
I0511 00:39:57.548384 23987 slave.cpp:533] Agent attributes: [  ]
I0511 00:39:57.548394 23987 slave.cpp:538] Agent hostname: ac7e7b7afe0d
I0511 00:39:57.548794 23987 status_update_manager.cpp:177] Pausing sending status updates
I0511 00:39:57.549085 23987 state.cpp:62] Recovering state from '/tmp/Endpoint_SlaveEndpointTest_AuthorizedRequest_2_HQ7Ya4/meta'
I0511 00:39:57.549217 23987 status_update_manager.cpp:203] Recovering status update manager
I0511 00:39:57.549275 23987 containerizer.cpp:608] Recovering containerizer
I0511 00:39:57.549790 23987 provisioner.cpp:410] Provisioner recovery complete
I0511 00:39:57.550014 23994 slave.cpp:5970] Finished recovery
I0511 00:39:57.553936 23994 slave.cpp:6152] Querying resource estimator for oversubscribable
resources
I0511 00:39:57.558030 23985 slave.cpp:6166] Received oversubscribable resources {} from the
resource estimator
I0511 00:39:57.558890 23997 process.cpp:3730] Handling HTTP event for process 'slave(744)'
with path: '/slave(744)/containers'
I0511 00:39:57.559267 23997 http.cpp:1115] HTTP GET for /slave(744)/containers from 172.17.0.3:50591
I0511 00:39:57.559309 23997 http.cpp:936] Authorizing principal 'test-principal' to GET the
'/containers' endpoint
I0511 00:39:57.560570 23993 slave.cpp:790] Agent terminating
[       OK ] Endpoint/SlaveEndpointTest.AuthorizedRequest/2 (18 ms)
[ RUN      ] Endpoint/SlaveEndpointTest.UnauthorizedRequest/0
I0511 00:39:57.565529 23984 containerizer.cpp:221] Using isolation: posix/cpu,posix/mem,filesystem/posix,network/cni
W0511 00:39:57.565811 23984 backend.cpp:76] Failed to create 'aufs' backend: AufsBackend requires
root privileges
W0511 00:39:57.565901 23984 backend.cpp:76] Failed to create 'bind' backend: BindBackend requires
root privileges
I0511 00:39:57.565963 23984 provisioner.cpp:249] Using default backend 'copy'
I0511 00:39:57.567234 24000 slave.cpp:225] Mesos agent started on (745)@172.17.0.3:39831
I0511 00:39:57.567288 24000 slave.cpp:226] Flags at startup: --acls="" --appc_simple_discovery_uri_prefix="http://"
--appc_store_dir="/tmp/mesos/store/appc" --authenticate_http_readonly="true" --authenticate_http_readwrite="true"
--authenticatee="crammd5" --authentication_backoff_factor="1secs" --authorizer="local" --cgroups_cpu_enable_pids_and_tids_count="false"
--cgroups_enable_cfs="false" --cgroups_hierarchy="/sys/fs/cgroup" --cgroups_limit_swap="false"
--cgroups_root="mesos" --container_disk_watch_interval="15secs" --containerizers="mesos" --credential="/tmp/Endpoint_SlaveEndpointTest_UnauthorizedRequest_0_3o7xzW/credential"
--default_role="*" --disk_watch_interval="1mins" --docker="docker" --docker_kill_orphans="true"
--docker_registry="https://registry-1.docker.io" --docker_remove_delay="6hrs" --docker_socket="/var/run/docker.sock"
--docker_stop_timeout="0ns" --docker_store_dir="/tmp/mesos/store/docker" --docker_volume_checkpoint_dir="/var/run/mesos/isolators/docker/volume"
--enforce_container_disk_quota="false" --executor_registration_timeout="1mins" --executor_shutdown_grace_period="5secs"
--fetcher_cache_dir="/tmp/Endpoint_SlaveEndpointTest_UnauthorizedRequest_0_3o7xzW/fetch" --fetcher_cache_size="2GB"
--frameworks_home="" --gc_delay="1weeks" --gc_disk_headroom="0.1" --hadoop_home="" --help="false"
--hostname_lookup="true" --http_command_executor="false" --http_credentials="/tmp/Endpoint_SlaveEndpointTest_UnauthorizedRequest_0_3o7xzW/http_credentials"
--http_heartbeat_interval="30secs" --initialize_driver_logging="true" --isolation="posix/cpu,posix/mem"
--launcher="posix" --launcher_dir="/mesos/build/src" --logbufsecs="0" --logging_level="INFO"
--max_completed_executors_per_framework="150" --oversubscribed_resources_interval="15secs"
--perf_duration="10secs" --perf_interval="1mins" --port="5051" --qos_correction_interval_min="0ns"
--quiet="false" --recover="reconnect" --recovery_timeout="15mins" --registration_backoff_factor="10ms"
--resources="cpus:2;gpus:0;mem:1024;disk:1024;ports:[31000-32000]" --revocable_cpu_low_priority="true"
--runtime_dir="/tmp/Endpoint_SlaveEndpointTest_UnauthorizedRequest_0_3o7xzW" --sandbox_directory="/mnt/mesos/sandbox"
--strict="true" --switch_user="true" --systemd_enable_support="true" --systemd_runtime_directory="/run/systemd/system"
--version="false" --work_dir="/tmp/Endpoint_SlaveEndpointTest_UnauthorizedRequest_0_MyT6gz"
I0511 00:39:57.567566 24000 credentials.hpp:86] Loading credential for authentication from
'/tmp/Endpoint_SlaveEndpointTest_UnauthorizedRequest_0_3o7xzW/credential'
I0511 00:39:57.567682 24000 slave.cpp:258] Agent using credential for: test-principal
I0511 00:39:57.567698 24000 credentials.hpp:37] Loading credentials for authentication from
'/tmp/Endpoint_SlaveEndpointTest_UnauthorizedRequest_0_3o7xzW/http_credentials'
I0511 00:39:57.567816 24000 http.cpp:975] Creating default 'basic' HTTP authenticator for
realm 'mesos-agent-readonly'
I0511 00:39:57.567879 24000 http.cpp:975] Creating default 'basic' HTTP authenticator for
realm 'mesos-agent-readwrite'
I0511 00:39:57.568372 24000 slave.cpp:525] Agent resources: cpus(*):2; mem(*):1024; disk(*):1024;
ports(*):[31000-32000]
I0511 00:39:57.568414 24000 slave.cpp:533] Agent attributes: [  ]
I0511 00:39:57.568424 24000 slave.cpp:538] Agent hostname: ac7e7b7afe0d
I0511 00:39:57.568490 23992 status_update_manager.cpp:177] Pausing sending status updates
I0511 00:39:57.568888 23989 state.cpp:62] Recovering state from '/tmp/Endpoint_SlaveEndpointTest_UnauthorizedRequest_0_MyT6gz/meta'
I0511 00:39:57.569018 23990 status_update_manager.cpp:203] Recovering status update manager
I0511 00:39:57.569082 23990 containerizer.cpp:608] Recovering containerizer
I0511 00:39:57.569615 23990 provisioner.cpp:410] Provisioner recovery complete
I0511 00:39:57.569926 23987 slave.cpp:5970] Finished recovery
I0511 00:39:57.570276 23987 slave.cpp:6152] Querying resource estimator for oversubscribable
resources
I0511 00:39:57.570410 23986 slave.cpp:6166] Received oversubscribable resources {} from the
resource estimator
I0511 00:39:57.571055 23994 process.cpp:3730] Handling HTTP event for process 'slave(745)'
with path: '/slave(745)/monitor/statistics'
I0511 00:39:57.571425 23987 http.cpp:1115] HTTP GET for /slave(745)/monitor/statistics from
172.17.0.3:50592
I0511 00:39:57.571461 23987 http.cpp:936] Authorizing principal 'test-principal' to GET the
'/monitor/statistics' endpoint
I0511 00:39:57.572312 23997 slave.cpp:790] Agent terminating
[       OK ] Endpoint/SlaveEndpointTest.UnauthorizedRequest/0 (11 ms)
[ RUN      ] Endpoint/SlaveEndpointTest.UnauthorizedRequest/1
I0511 00:39:57.576629 23984 containerizer.cpp:221] Using isolation: posix/cpu,posix/mem,filesystem/posix,network/cni
W0511 00:39:57.576902 23984 backend.cpp:76] Failed to create 'aufs' backend: AufsBackend requires
root privileges
W0511 00:39:57.576938 23984 backend.cpp:76] Failed to create 'bind' backend: BindBackend requires
root privileges
I0511 00:39:57.576951 23984 provisioner.cpp:249] Using default backend 'copy'
I0511 00:39:57.577955 23987 slave.cpp:225] Mesos agent started on (746)@172.17.0.3:39831
I0511 00:39:57.578400 23987 slave.cpp:226] Flags at startup: --acls="" --appc_simple_discovery_uri_prefix="http://"
--appc_store_dir="/tmp/mesos/store/appc" --authenticate_http_readonly="true" --authenticate_http_readwrite="true"
--authenticatee="crammd5" --authentication_backoff_factor="1secs" --authorizer="local" --cgroups_cpu_enable_pids_and_tids_count="false"
--cgroups_enable_cfs="false" --cgroups_hierarchy="/sys/fs/cgroup" --cgroups_limit_swap="false"
--cgroups_root="mesos" --container_disk_watch_interval="15secs" --containerizers="mesos" --credential="/tmp/Endpoint_SlaveEndpointTest_UnauthorizedRequest_1_1N6DRr/credential"
--default_role="*" --disk_watch_interval="1mins" --docker="docker" --docker_kill_orphans="true"
--docker_registry="https://registry-1.docker.io" --docker_remove_delay="6hrs" --docker_socket="/var/run/docker.sock"
--docker_stop_timeout="0ns" --docker_store_dir="/tmp/mesos/store/docker" --docker_volume_checkpoint_dir="/var/run/mesos/isolators/docker/volume"
--enforce_container_disk_quota="false" --executor_registration_timeout="1mins" --executor_shutdown_grace_period="5secs"
--fetcher_cache_dir="/tmp/Endpoint_SlaveEndpointTest_UnauthorizedRequest_1_1N6DRr/fetch" --fetcher_cache_size="2GB"
--frameworks_home="" --gc_delay="1weeks" --gc_disk_headroom="0.1" --hadoop_home="" --help="false"
--hostname_lookup="true" --http_command_executor="false" --http_credentials="/tmp/Endpoint_SlaveEndpointTest_UnauthorizedRequest_1_1N6DRr/http_credentials"
--http_heartbeat_interval="30secs" --initialize_driver_logging="true" --isolation="posix/cpu,posix/mem"
--launcher="posix" --launcher_dir="/mesos/build/src" --logbufsecs="0" --logging_level="INFO"
--max_completed_executors_per_framework="150" --oversubscribed_resources_interval="15secs"
--perf_duration="10secs" --perf_interval="1mins" --port="5051" --qos_correction_interval_min="0ns"
--quiet="false" --recover="reconnect" --recovery_timeout="15mins" --registration_backoff_factor="10ms"
--resources="cpus:2;gpus:0;mem:1024;disk:1024;ports:[31000-32000]" --revocable_cpu_low_priority="true"
--runtime_dir="/tmp/Endpoint_SlaveEndpointTest_UnauthorizedRequest_1_1N6DRr" --sandbox_directory="/mnt/mesos/sandbox"
--strict="true" --switch_user="true" --systemd_enable_support="true" --systemd_runtime_directory="/run/systemd/system"
--version="false" --work_dir="/tmp/Endpoint_SlaveEndpointTest_UnauthorizedRequest_1_cIxmx4"
I0511 00:39:57.578704 23987 credentials.hpp:86] Loading credential for authentication from
'/tmp/Endpoint_SlaveEndpointTest_UnauthorizedRequest_1_1N6DRr/credential'
I0511 00:39:57.579228 23987 slave.cpp:258] Agent using credential for: test-principal
I0511 00:39:57.579417 23987 credentials.hpp:37] Loading credentials for authentication from
'/tmp/Endpoint_SlaveEndpointTest_UnauthorizedRequest_1_1N6DRr/http_credentials'
I0511 00:39:57.579728 23987 http.cpp:975] Creating default 'basic' HTTP authenticator for
realm 'mesos-agent-readonly'
I0511 00:39:57.579883 23987 http.cpp:975] Creating default 'basic' HTTP authenticator for
realm 'mesos-agent-readwrite'
I0511 00:39:57.580641 23987 slave.cpp:525] Agent resources: cpus(*):2; mem(*):1024; disk(*):1024;
ports(*):[31000-32000]
I0511 00:39:57.580698 23987 slave.cpp:533] Agent attributes: [  ]
I0511 00:39:57.580705 23987 slave.cpp:538] Agent hostname: ac7e7b7afe0d
I0511 00:39:57.581382 23987 status_update_manager.cpp:177] Pausing sending status updates
I0511 00:39:57.581923 24000 state.cpp:62] Recovering state from '/tmp/Endpoint_SlaveEndpointTest_UnauthorizedRequest_1_cIxmx4/meta'
I0511 00:39:57.582190 23988 status_update_manager.cpp:203] Recovering status update manager
I0511 00:39:57.582280 24000 containerizer.cpp:608] Recovering containerizer
I0511 00:39:57.583102 23999 provisioner.cpp:410] Provisioner recovery complete
I0511 00:39:57.583358 23988 slave.cpp:5970] Finished recovery
I0511 00:39:57.584082 23988 slave.cpp:6152] Querying resource estimator for oversubscribable
resources
I0511 00:39:57.584236 23992 slave.cpp:6166] Received oversubscribable resources {} from the
resource estimator
I0511 00:39:57.585348 23999 process.cpp:3730] Handling HTTP event for process 'slave(746)'
with path: '/slave(746)/monitor/statistics.json'
I0511 00:39:57.585706 23991 http.cpp:1115] HTTP GET for /slave(746)/monitor/statistics.json
from 172.17.0.3:50593
I0511 00:39:57.585741 23991 http.cpp:936] Authorizing principal 'test-principal' to GET the
'/monitor/statistics.json' endpoint
I0511 00:39:57.586660 23984 slave.cpp:790] Agent terminating
[       OK ] Endpoint/SlaveEndpointTest.UnauthorizedRequest/1 (14 ms)
[ RUN      ] Endpoint/SlaveEndpointTest.UnauthorizedRequest/2
I0511 00:39:57.590857 23984 containerizer.cpp:221] Using isolation: posix/cpu,posix/mem,filesystem/posix,network/cni
W0511 00:39:57.591122 23984 backend.cpp:76] Failed to create 'aufs' backend: AufsBackend requires
root privileges
W0511 00:39:57.591159 23984 backend.cpp:76] Failed to create 'bind' backend: BindBackend requires
root privileges
I0511 00:39:57.591177 23984 provisioner.cpp:249] Using default backend 'copy'
I0511 00:39:57.592151 23989 slave.cpp:225] Mesos agent started on (747)@172.17.0.3:39831
I0511 00:39:57.592171 23989 slave.cpp:226] Flags at startup: --acls="" --appc_simple_discovery_uri_prefix="http://"
--appc_store_dir="/tmp/mesos/store/appc" --authenticate_http_readonly="true" --authenticate_http_readwrite="true"
--authenticatee="crammd5" --authentication_backoff_factor="1secs" --authorizer="local" --cgroups_cpu_enable_pids_and_tids_count="false"
--cgroups_enable_cfs="false" --cgroups_hierarchy="/sys/fs/cgroup" --cgroups_limit_swap="false"
--cgroups_root="mesos" --container_disk_watch_interval="15secs" --containerizers="mesos" --credential="/tmp/Endpoint_SlaveEndpointTest_UnauthorizedRequest_2_BjSQiX/credential"
--default_role="*" --disk_watch_interval="1mins" --docker="docker" --docker_kill_orphans="true"
--docker_registry="https://registry-1.docker.io" --docker_remove_delay="6hrs" --docker_socket="/var/run/docker.sock"
--docker_stop_timeout="0ns" --docker_store_dir="/tmp/mesos/store/docker" --docker_volume_checkpoint_dir="/var/run/mesos/isolators/docker/volume"
--enforce_container_disk_quota="false" --executor_registration_timeout="1mins" --executor_shutdown_grace_period="5secs"
--fetcher_cache_dir="/tmp/Endpoint_SlaveEndpointTest_UnauthorizedRequest_2_BjSQiX/fetch" --fetcher_cache_size="2GB"
--frameworks_home="" --gc_delay="1weeks" --gc_disk_headroom="0.1" --hadoop_home="" --help="false"
--hostname_lookup="true" --http_command_executor="false" --http_credentials="/tmp/Endpoint_SlaveEndpointTest_UnauthorizedRequest_2_BjSQiX/http_credentials"
--http_heartbeat_interval="30secs" --initialize_driver_logging="true" --isolation="posix/cpu,posix/mem"
--launcher="posix" --launcher_dir="/mesos/build/src" --logbufsecs="0" --logging_level="INFO"
--max_completed_executors_per_framework="150" --oversubscribed_resources_interval="15secs"
--perf_duration="10secs" --perf_interval="1mins" --port="5051" --qos_correction_interval_min="0ns"
--quiet="false" --recover="reconnect" --recovery_timeout="15mins" --registration_backoff_factor="10ms"
--resources="cpus:2;gpus:0;mem:1024;disk:1024;ports:[31000-32000]" --revocable_cpu_low_priority="true"
--runtime_dir="/tmp/Endpoint_SlaveEndpointTest_UnauthorizedRequest_2_BjSQiX" --sandbox_directory="/mnt/mesos/sandbox"
--strict="true" --switch_user="true" --systemd_enable_support="true" --systemd_runtime_directory="/run/systemd/system"
--version="false" --work_dir="/tmp/Endpoint_SlaveEndpointTest_UnauthorizedRequest_2_esJgWz"
I0511 00:39:57.592406 23989 credentials.hpp:86] Loading credential for authentication from
'/tmp/Endpoint_SlaveEndpointTest_UnauthorizedRequest_2_BjSQiX/credential'
I0511 00:39:57.592505 23989 slave.cpp:258] Agent using credential for: test-principal
I0511 00:39:57.592517 23989 credentials.hpp:37] Loading credentials for authentication from
'/tmp/Endpoint_SlaveEndpointTest_UnauthorizedRequest_2_BjSQiX/http_credentials'
I0511 00:39:57.592636 23989 http.cpp:975] Creating default 'basic' HTTP authenticator for
realm 'mesos-agent-readonly'
I0511 00:39:57.592695 23989 http.cpp:975] Creating default 'basic' HTTP authenticator for
realm 'mesos-agent-readwrite'
I0511 00:39:57.593109 23989 slave.cpp:525] Agent resources: cpus(*):2; mem(*):1024; disk(*):1024;
ports(*):[31000-32000]
I0511 00:39:57.593139 23989 slave.cpp:533] Agent attributes: [  ]
I0511 00:39:57.593147 23989 slave.cpp:538] Agent hostname: ac7e7b7afe0d
I0511 00:39:57.593284 23990 status_update_manager.cpp:177] Pausing sending status updates
I0511 00:39:57.593550 24000 state.cpp:62] Recovering state from '/tmp/Endpoint_SlaveEndpointTest_UnauthorizedRequest_2_esJgWz/meta'
I0511 00:39:57.593765 23997 status_update_manager.cpp:203] Recovering status update manager
I0511 00:39:57.593909 23997 containerizer.cpp:608] Recovering containerizer
I0511 00:39:57.594852 23991 provisioner.cpp:410] Provisioner recovery complete
I0511 00:39:57.595039 23991 slave.cpp:5970] Finished recovery
I0511 00:39:57.595518 23991 slave.cpp:6152] Querying resource estimator for oversubscribable
resources
I0511 00:39:57.595816 23991 slave.cpp:6166] Received oversubscribable resources {} from the
resource estimator
I0511 00:39:57.596894 23988 process.cpp:3730] Handling HTTP event for process 'slave(747)'
with path: '/slave(747)/containers'
I0511 00:39:57.597419 23988 http.cpp:1115] HTTP GET for /slave(747)/containers from 172.17.0.3:50594
I0511 00:39:57.597499 23988 http.cpp:936] Authorizing principal 'test-principal' to GET the
'/containers' endpoint
I0511 00:39:57.598572 23989 slave.cpp:790] Agent terminating
[       OK ] Endpoint/SlaveEndpointTest.UnauthorizedRequest/2 (15 ms)
[ RUN      ] Endpoint/SlaveEndpointTest.NoAuthorizer/0
I0511 00:39:57.605573 23984 containerizer.cpp:221] Using isolation: posix/cpu,posix/mem,filesystem/posix,network/cni
W0511 00:39:57.605850 23984 backend.cpp:76] Failed to create 'aufs' backend: AufsBackend requires
root privileges
W0511 00:39:57.605890 23984 backend.cpp:76] Failed to create 'bind' backend: BindBackend requires
root privileges
I0511 00:39:57.605902 23984 provisioner.cpp:249] Using default backend 'copy'
I0511 00:39:57.606365 23984 cluster.cpp:448] Creating default 'local' authorizer
I0511 00:39:57.606796 23986 slave.cpp:225] Mesos agent started on (748)@172.17.0.3:39831
I0511 00:39:57.606822 23986 slave.cpp:226] Flags at startup: --acls="" --appc_simple_discovery_uri_prefix="http://"
--appc_store_dir="/tmp/mesos/store/appc" --authenticate_http_readonly="true" --authenticate_http_readwrite="true"
--authenticatee="crammd5" --authentication_backoff_factor="1secs" --authorizer="local" --cgroups_cpu_enable_pids_and_tids_count="false"
--cgroups_enable_cfs="false" --cgroups_hierarchy="/sys/fs/cgroup" --cgroups_limit_swap="false"
--cgroups_root="mesos" --container_disk_watch_interval="15secs" --containerizers="mesos" --credential="/tmp/Endpoint_SlaveEndpointTest_NoAuthorizer_0_SDO4Ss/credential"
--default_role="*" --disk_watch_interval="1mins" --docker="docker" --docker_kill_orphans="true"
--docker_registry="https://registry-1.docker.io" --docker_remove_delay="6hrs" --docker_socket="/var/run/docker.sock"
--docker_stop_timeout="0ns" --docker_store_dir="/tmp/mesos/store/docker" --docker_volume_checkpoint_dir="/var/run/mesos/isolators/docker/volume"
--enforce_container_disk_quota="false" --executor_registration_timeout="1mins" --executor_shutdown_grace_period="5secs"
--fetcher_cache_dir="/tmp/Endpoint_SlaveEndpointTest_NoAuthorizer_0_SDO4Ss/fetch" --fetcher_cache_size="2GB"
--frameworks_home="" --gc_delay="1weeks" --gc_disk_headroom="0.1" --hadoop_home="" --help="false"
--hostname_lookup="true" --http_command_executor="false" --http_credentials="/tmp/Endpoint_SlaveEndpointTest_NoAuthorizer_0_SDO4Ss/http_credentials"
--http_heartbeat_interval="30secs" --initialize_driver_logging="true" --isolation="posix/cpu,posix/mem"
--launcher="posix" --launcher_dir="/mesos/build/src" --logbufsecs="0" --logging_level="INFO"
--max_completed_executors_per_framework="150" --oversubscribed_resources_interval="15secs"
--perf_duration="10secs" --perf_interval="1mins" --port="5051" --qos_correction_interval_min="0ns"
--quiet="false" --recover="reconnect" --recovery_timeout="15mins" --registration_backoff_factor="10ms"
--resources="cpus:2;gpus:0;mem:1024;disk:1024;ports:[31000-32000]" --revocable_cpu_low_priority="true"
--runtime_dir="/tmp/Endpoint_SlaveEndpointTest_NoAuthorizer_0_SDO4Ss" --sandbox_directory="/mnt/mesos/sandbox"
--strict="true" --switch_user="true" --systemd_enable_support="true" --systemd_runtime_directory="/run/systemd/system"
--version="false" --work_dir="/tmp/Endpoint_SlaveEndpointTest_NoAuthorizer_0_dIf7t5"
I0511 00:39:57.607111 23986 credentials.hpp:86] Loading credential for authentication from
'/tmp/Endpoint_SlaveEndpointTest_NoAuthorizer_0_SDO4Ss/credential'
I0511 00:39:57.607213 23986 slave.cpp:258] Agent using credential for: test-principal
I0511 00:39:57.607230 23986 credentials.hpp:37] Loading credentials for authentication from
'/tmp/Endpoint_SlaveEndpointTest_NoAuthorizer_0_SDO4Ss/http_credentials'
I0511 00:39:57.607342 23986 http.cpp:975] Creating default 'basic' HTTP authenticator for
realm 'mesos-agent-readonly'
I0511 00:39:57.607386 23986 http.cpp:975] Creating default 'basic' HTTP authenticator for
realm 'mesos-agent-readwrite'
I0511 00:39:57.607715 23986 slave.cpp:525] Agent resources: cpus(*):2; mem(*):1024; disk(*):1024;
ports(*):[31000-32000]
I0511 00:39:57.607743 23986 slave.cpp:533] Agent attributes: [  ]
I0511 00:39:57.607748 23986 slave.cpp:538] Agent hostname: ac7e7b7afe0d
I0511 00:39:57.607831 23991 status_update_manager.cpp:177] Pausing sending status updates
I0511 00:39:57.608177 23986 state.cpp:62] Recovering state from '/tmp/Endpoint_SlaveEndpointTest_NoAuthorizer_0_dIf7t5/meta'
I0511 00:39:57.608328 23986 status_update_manager.cpp:203] Recovering status update manager
I0511 00:39:57.608464 23993 containerizer.cpp:608] Recovering containerizer
I0511 00:39:57.608906 23996 provisioner.cpp:410] Provisioner recovery complete
I0511 00:39:57.609124 23986 slave.cpp:5970] Finished recovery
I0511 00:39:57.609491 23986 slave.cpp:6152] Querying resource estimator for oversubscribable
resources
I0511 00:39:57.609701 23993 slave.cpp:6166] Received oversubscribable resources {} from the
resource estimator
I0511 00:39:57.610332 23993 process.cpp:3730] Handling HTTP event for process 'slave(748)'
with path: '/slave(748)/monitor/statistics'
I0511 00:39:57.610798 23988 http.cpp:1115] HTTP GET for /slave(748)/monitor/statistics from
172.17.0.3:50595
I0511 00:39:57.610841 23988 http.cpp:936] Authorizing principal 'test-principal' to GET the
'/monitor/statistics' endpoint
I0511 00:39:57.611935 23984 slave.cpp:790] Agent terminating
[       OK ] Endpoint/SlaveEndpointTest.NoAuthorizer/0 (12 ms)
[ RUN      ] Endpoint/SlaveEndpointTest.NoAuthorizer/1
I0511 00:39:57.617372 23984 containerizer.cpp:221] Using isolation: posix/cpu,posix/mem,filesystem/posix,network/cni
W0511 00:39:57.617609 23984 backend.cpp:76] Failed to create 'aufs' backend: AufsBackend requires
root privileges
W0511 00:39:57.617650 23984 backend.cpp:76] Failed to create 'bind' backend: BindBackend requires
root privileges
I0511 00:39:57.617667 23984 provisioner.cpp:249] Using default backend 'copy'
I0511 00:39:57.618221 23984 cluster.cpp:448] Creating default 'local' authorizer
I0511 00:39:57.618676 23992 slave.cpp:225] Mesos agent started on (749)@172.17.0.3:39831
I0511 00:39:57.618738 23992 slave.cpp:226] Flags at startup: --acls="" --appc_simple_discovery_uri_prefix="http://"
--appc_store_dir="/tmp/mesos/store/appc" --authenticate_http_readonly="true" --authenticate_http_readwrite="true"
--authenticatee="crammd5" --authentication_backoff_factor="1secs" --authorizer="local" --cgroups_cpu_enable_pids_and_tids_count="false"
--cgroups_enable_cfs="false" --cgroups_hierarchy="/sys/fs/cgroup" --cgroups_limit_swap="false"
--cgroups_root="mesos" --container_disk_watch_interval="15secs" --containerizers="mesos" --credential="/tmp/Endpoint_SlaveEndpointTest_NoAuthorizer_1_t9SmBY/credential"
--default_role="*" --disk_watch_interval="1mins" --docker="docker" --docker_kill_orphans="true"
--docker_registry="https://registry-1.docker.io" --docker_remove_delay="6hrs" --docker_socket="/var/run/docker.sock"
--docker_stop_timeout="0ns" --docker_store_dir="/tmp/mesos/store/docker" --docker_volume_checkpoint_dir="/var/run/mesos/isolators/docker/volume"
--enforce_container_disk_quota="false" --executor_registration_timeout="1mins" --executor_shutdown_grace_period="5secs"
--fetcher_cache_dir="/tmp/Endpoint_SlaveEndpointTest_NoAuthorizer_1_t9SmBY/fetch" --fetcher_cache_size="2GB"
--frameworks_home="" --gc_delay="1weeks" --gc_disk_headroom="0.1" --hadoop_home="" --help="false"
--hostname_lookup="true" --http_command_executor="false" --http_credentials="/tmp/Endpoint_SlaveEndpointTest_NoAuthorizer_1_t9SmBY/http_credentials"
--http_heartbeat_interval="30secs" --initialize_driver_logging="true" --isolation="posix/cpu,posix/mem"
--launcher="posix" --launcher_dir="/mesos/build/src" --logbufsecs="0" --logging_level="INFO"
--max_completed_executors_per_framework="150" --oversubscribed_resources_interval="15secs"
--perf_duration="10secs" --perf_interval="1mins" --port="5051" --qos_correction_interval_min="0ns"
--quiet="false" --recover="reconnect" --recovery_timeout="15mins" --registration_backoff_factor="10ms"
--resources="cpus:2;gpus:0;mem:1024;disk:1024;ports:[31000-32000]" --revocable_cpu_low_priority="true"
--runtime_dir="/tmp/Endpoint_SlaveEndpointTest_NoAuthorizer_1_t9SmBY" --sandbox_directory="/mnt/mesos/sandbox"
--strict="true" --switch_user="true" --systemd_enable_support="true" --systemd_runtime_directory="/run/systemd/system"
--version="false" --work_dir="/tmp/Endpoint_SlaveEndpointTest_NoAuthorizer_1_vfPtaB"
I0511 00:39:57.618958 23992 credentials.hpp:86] Loading credential for authentication from
'/tmp/Endpoint_SlaveEndpointTest_NoAuthorizer_1_t9SmBY/credential'
I0511 00:39:57.619035 23992 slave.cpp:258] Agent using credential for: test-principal
I0511 00:39:57.619048 23992 credentials.hpp:37] Loading credentials for authentication from
'/tmp/Endpoint_SlaveEndpointTest_NoAuthorizer_1_t9SmBY/http_credentials'
I0511 00:39:57.619145 23992 http.cpp:975] Creating default 'basic' HTTP authenticator for
realm 'mesos-agent-readonly'
I0511 00:39:57.619194 23992 http.cpp:975] Creating default 'basic' HTTP authenticator for
realm 'mesos-agent-readwrite'
I0511 00:39:57.619560 23992 slave.cpp:525] Agent resources: cpus(*):2; mem(*):1024; disk(*):1024;
ports(*):[31000-32000]
I0511 00:39:57.619590 23992 slave.cpp:533] Agent attributes: [  ]
I0511 00:39:57.619596 23992 slave.cpp:538] Agent hostname: ac7e7b7afe0d
I0511 00:39:57.619668 23993 status_update_manager.cpp:177] Pausing sending status updates
I0511 00:39:57.619967 23992 state.cpp:62] Recovering state from '/tmp/Endpoint_SlaveEndpointTest_NoAuthorizer_1_vfPtaB/meta'
I0511 00:39:57.620154 23996 status_update_manager.cpp:203] Recovering status update manager
I0511 00:39:57.620223 23996 containerizer.cpp:608] Recovering containerizer
I0511 00:39:57.620656 23988 provisioner.cpp:410] Provisioner recovery complete
I0511 00:39:57.620784 23996 slave.cpp:5970] Finished recovery
I0511 00:39:57.621098 23996 slave.cpp:6152] Querying resource estimator for oversubscribable
resources
I0511 00:39:57.621268 23995 slave.cpp:6166] Received oversubscribable resources {} from the
resource estimator
I0511 00:39:57.621862 23994 process.cpp:3730] Handling HTTP event for process 'slave(749)'
with path: '/slave(749)/monitor/statistics.json'
I0511 00:39:57.622215 23987 http.cpp:1115] HTTP GET for /slave(749)/monitor/statistics.json
from 172.17.0.3:50596
I0511 00:39:57.622251 23987 http.cpp:936] Authorizing principal 'test-principal' to GET the
'/monitor/statistics.json' endpoint
I0511 00:39:57.623200 23993 slave.cpp:790] Agent terminating
[       OK ] Endpoint/SlaveEndpointTest.NoAuthorizer/1 (9 ms)
[ RUN      ] Endpoint/SlaveEndpointTest.NoAuthorizer/2
I0511 00:39:57.626945 23984 containerizer.cpp:221] Using isolation: posix/cpu,posix/mem,filesystem/posix,network/cni
W0511 00:39:57.627202 23984 backend.cpp:76] Failed to create 'aufs' backend: AufsBackend requires
root privileges
W0511 00:39:57.627233 23984 backend.cpp:76] Failed to create 'bind' backend: BindBackend requires
root privileges
I0511 00:39:57.627246 23984 provisioner.cpp:249] Using default backend 'copy'
I0511 00:39:57.627826 23984 cluster.cpp:448] Creating default 'local' authorizer
I0511 00:39:57.628294 23996 slave.cpp:225] Mesos agent started on (750)@172.17.0.3:39831
I0511 00:39:57.628320 23996 slave.cpp:226] Flags at startup: --acls="" --appc_simple_discovery_uri_prefix="http://"
--appc_store_dir="/tmp/mesos/store/appc" --authenticate_http_readonly="true" --authenticate_http_readwrite="true"
--authenticatee="crammd5" --authentication_backoff_factor="1secs" --authorizer="local" --cgroups_cpu_enable_pids_and_tids_count="false"
--cgroups_enable_cfs="false" --cgroups_hierarchy="/sys/fs/cgroup" --cgroups_limit_swap="false"
--cgroups_root="mesos" --container_disk_watch_interval="15secs" --containerizers="mesos" --credential="/tmp/Endpoint_SlaveEndpointTest_NoAuthorizer_2_tEQequ/credential"
--default_role="*" --disk_watch_interval="1mins" --docker="docker" --docker_kill_orphans="true"
--docker_registry="https://registry-1.docker.io" --docker_remove_delay="6hrs" --docker_socket="/var/run/docker.sock"
--docker_stop_timeout="0ns" --docker_store_dir="/tmp/mesos/store/docker" --docker_volume_checkpoint_dir="/var/run/mesos/isolators/docker/volume"
--enforce_container_disk_quota="false" --executor_registration_timeout="1mins" --executor_shutdown_grace_period="5secs"
--fetcher_cache_dir="/tmp/Endpoint_SlaveEndpointTest_NoAuthorizer_2_tEQequ/fetch" --fetcher_cache_size="2GB"
--frameworks_home="" --gc_delay="1weeks" --gc_disk_headroom="0.1" --hadoop_home="" --help="false"
--hostname_lookup="true" --http_command_executor="false" --http_credentials="/tmp/Endpoint_SlaveEndpointTest_NoAuthorizer_2_tEQequ/http_credentials"
--http_heartbeat_interval="30secs" --initialize_driver_logging="true" --isolation="posix/cpu,posix/mem"
--launcher="posix" --launcher_dir="/mesos/build/src" --logbufsecs="0" --logging_level="INFO"
--max_completed_executors_per_framework="150" --oversubscribed_resources_interval="15secs"
--perf_duration="10secs" --perf_interval="1mins" --port="5051" --qos_correction_interval_min="0ns"
--quiet="false" --recover="reconnect" --recovery_timeout="15mins" --registration_backoff_factor="10ms"
--resources="cpus:2;gpus:0;mem:1024;disk:1024;ports:[31000-32000]" --revocable_cpu_low_priority="true"
--runtime_dir="/tmp/Endpoint_SlaveEndpointTest_NoAuthorizer_2_tEQequ" --sandbox_directory="/mnt/mesos/sandbox"
--strict="true" --switch_user="true" --systemd_enable_support="true" --systemd_runtime_directory="/run/systemd/system"
--version="false" --work_dir="/tmp/Endpoint_SlaveEndpointTest_NoAuthorizer_2_q7NMX6"
I0511 00:39:57.628641 23996 credentials.hpp:86] Loading credential for authentication from
'/tmp/Endpoint_SlaveEndpointTest_NoAuthorizer_2_tEQequ/credential'
I0511 00:39:57.628798 23996 slave.cpp:258] Agent using credential for: test-principal
I0511 00:39:57.628810 23996 credentials.hpp:37] Loading credentials for authentication from
'/tmp/Endpoint_SlaveEndpointTest_NoAuthorizer_2_tEQequ/http_credentials'
I0511 00:39:57.628917 23996 http.cpp:975] Creating default 'basic' HTTP authenticator for
realm 'mesos-agent-readonly'
I0511 00:39:57.628964 23996 http.cpp:975] Creating default 'basic' HTTP authenticator for
realm 'mesos-agent-readwrite'
I0511 00:39:57.629298 23996 slave.cpp:525] Agent resources: cpus(*):2; mem(*):1024; disk(*):1024;
ports(*):[31000-32000]
I0511 00:39:57.629328 23996 slave.cpp:533] Agent attributes: [  ]
I0511 00:39:57.629335 23996 slave.cpp:538] Agent hostname: ac7e7b7afe0d
I0511 00:39:57.629425 23991 status_update_manager.cpp:177] Pausing sending status updates
I0511 00:39:57.629806 23996 state.cpp:62] Recovering state from '/tmp/Endpoint_SlaveEndpointTest_NoAuthorizer_2_q7NMX6/meta'
I0511 00:39:57.630004 23997 status_update_manager.cpp:203] Recovering status update manager
I0511 00:39:57.630100 23989 containerizer.cpp:608] Recovering containerizer
I0511 00:39:57.630641 23998 provisioner.cpp:410] Provisioner recovery complete
I0511 00:39:57.630787 23998 slave.cpp:5970] Finished recovery
I0511 00:39:57.631083 23998 slave.cpp:6152] Querying resource estimator for oversubscribable
resources
I0511 00:39:57.631217 23987 slave.cpp:6166] Received oversubscribable resources {} from the
resource estimator
I0511 00:39:57.631742 23986 process.cpp:3730] Handling HTTP event for process 'slave(750)'
with path: '/slave(750)/containers'
I0511 00:39:57.632087 23998 http.cpp:1115] HTTP GET for /slave(750)/containers from 172.17.0.3:50597
I0511 00:39:57.632117 23998 http.cpp:936] Authorizing principal 'test-principal' to GET the
'/containers' endpoint
I0511 00:39:57.633483 23984 slave.cpp:790] Agent terminating
[       OK ] Endpoint/SlaveEndpointTest.NoAuthorizer/2 (10 ms)
[----------] 9 tests from Endpoint/SlaveEndpointTest (115 ms total)

[----------] Global test environment tear-down
[==========] 1523 tests from 167 test cases ran. (220318 ms total)
[  PASSED  ] 1522 tests.
[  FAILED  ] 1 test, listed below:
[  FAILED  ] OversubscriptionTest.RescindRevocableOfferWithIncreasedRevocable

 1 FAILED TEST
  YOU HAVE 19 DISABLED TESTS

E0511 00:39:57.685995 24001 process.cpp:950] Failed to accept socket: future discarded
make[3]: *** [CMakeFiles/check] Error 1
make[3]: Leaving directory `/mesos/build'
make[2]: Leaving directory `/mesos/build'
make[2]: *** [CMakeFiles/check.dir/all] Error 2
make[1]: *** [CMakeFiles/check.dir/rule] Error 2
make[1]: Leaving directory `/mesos/build'
make: *** [check] Error 2
+ docker rmi mesos-1494460766-24038
Untagged: mesos-1494460766-24038:latest
Deleted: sha256:a4c6c19792a2a4769f8edf3c43812cffd54a2f164c819c17cb5337e52f5e9848
Deleted: sha256:9d192e03723e4118418094b5cfa938a59b72cec9fb8f1c5ed0ff71be3bfdc4d6
Deleted: sha256:41a707720cf6f73dd42417c0bd7e6342bae6bc71dcca7684a45ec5ca3c368c81
Deleted: sha256:2181fcfb84902361d77eb4591e13e61b863a25817fb77dc8d6f10be9d610fceb
Deleted: sha256:8e14b512e42be1f10cac2d47111eb37601db2a9315cecdc153dc7c2fd6a7e1bb
Deleted: sha256:4e753d0f321161c9e4c71c63209fecff48343417481abfdf560a783d22579f6c
Deleted: sha256:5b0749588be48d6afa71e41d22a8c71e331ac19f8141b5fdad6fa2a76b35aa0c
Deleted: sha256:0330fbbed0450d9c5d0ab9738b650cdeb47312df3a2198d5a1c20303d0e76c6a
Deleted: sha256:5a53e0504a12d8d12308e51b9d945e5fad9dc2d13f70b5a12a81248ac1966a35
Deleted: sha256:26872070864bb1c23d0527aad669624708f7a35f57c310bf69e933b0f8d16569
Deleted: sha256:a45cecb99d787b2b11fae8209af358deccb29e2059146b92df563987e0069ced
Deleted: sha256:49e093b92b0a890636e3ba640d26e1a00c6184115e460ee135ef961fea558aee
Deleted: sha256:692db15f173d14557eb29ddef04208f565403405c89b61da83932304ee501d9d
Deleted: sha256:a86ee10f614ac16adf3085a50d546bbe6b0411afcd2a8359a5c1221ec8078431
Deleted: sha256:0fb0e2e2ec61bd51a9cf1fe0737104afa74b47dfa7d01a41ed08f5f7cac35f1f
Deleted: sha256:2ac59287d79a7508c45e06c0124b8c977da40011adff9484805dee2f1827e18b
Deleted: sha256:076835a9f70d6df4bc71cfd584769ac6b87e204d9b6ecb6d1790892458979aa8
Deleted: sha256:9e0139acbd052474260f7fb5e13115d10b2d47afdf25c2c97ad22341264a3711
Deleted: sha256:529aa0a459261f11a14d60a7d7a800cc7c6a888aa1626c7d125e2076f85ac178
Deleted: sha256:ee081088fd36b3fe8954cf5592bccc660e28417b612cda3da742f82331a66ee5
Deleted: sha256:91bef1919c76081de8ab6f0aa5778e7922227d4a4a27f32f2e144974613c8e5e
Deleted: sha256:c09e0dd47482301a065761b52e946aa7481d86c96519ab4ce88480a60c1c08aa
Deleted: sha256:4beec01099a75c173a6f8d654e8173cffb95c0a16dc8feb340178303746423a6
Deleted: sha256:a5ecf869fada68238a21b20692d73d583690525adcadf2eba027706bef0e2541
Build step 'Execute shell' marked build as failure
Not sending mail to unregistered user neil.conway@gmail.com

Mime
View raw message