mesos-builds mailing list archives

Site index · List index
Message view « Date » · « Thread »
Top « Date » · « Thread »
From Apache Jenkins Server <jenk...@builds.apache.org>
Subject Build failed in Jenkins: Mesos-Buildbot » cmake,gcc,--verbose --enable-libevent --enable-ssl,GLOG_v=1 MESOS_VERBOSE=1,centos:7,(docker||Hadoop)&&(!ubuntu-us1)&&(!ubuntu-eu2) #3740
Date Mon, 29 May 2017 13:48:35 GMT
See <https://builds.apache.org/job/Mesos-Buildbot/BUILDTOOL=cmake,COMPILER=gcc,CONFIGURATION=--verbose%20--enable-libevent%20--enable-ssl,ENVIRONMENT=GLOG_v=1%20MESOS_VERBOSE=1,OS=centos%3A7,label_exp=(docker%7C%7CHadoop)&&(!ubuntu-us1)&&(!ubuntu-eu2)/3740/display/redirect?page=changes>

Changes:

[klueska] Moved 'current_word' calculation for autocomplete in the new Mesos CLI.

[klueska] Added Config class to manage the config file in the new Mesos CLI.

------------------------------------------
[...truncated 1.79 MB...]
I0529 13:47:55.410723 31959 openssl.cpp:429] Will not verify peer certificate!
NOTE: Set LIBPROCESS_SSL_VERIFY_CERT=1 to enable peer certificate verification
I0529 13:47:55.410732 31959 openssl.cpp:435] Will only verify peer certificate if presented!
NOTE: Set LIBPROCESS_SSL_REQUIRE_CERT=1 to require peer certificate verification
WARNING: Logging before InitGoogleLogging() is written to STDERR
I0529 13:47:55.431987 32457 openssl.cpp:419] CA file path is unspecified! NOTE: Set CA file
path with LIBPROCESS_SSL_CA_FILE=<filepath>
I0529 13:47:55.432099 32457 openssl.cpp:424] CA directory path unspecified! NOTE: Set CA directory
path with LIBPROCESS_SSL_CA_DIR=<dirpath>
I0529 13:47:55.432106 32457 openssl.cpp:429] Will not verify peer certificate!
NOTE: Set LIBPROCESS_SSL_VERIFY_CERT=1 to enable peer certificate verification
I0529 13:47:55.432112 32457 openssl.cpp:435] Will only verify peer certificate if presented!
NOTE: Set LIBPROCESS_SSL_REQUIRE_CERT=1 to require peer certificate verification
I0529 13:47:55.435572 31976 libevent_ssl_socket.cpp:1170] Socket error: error:140760FC:SSL
routines:SSL23_GET_CLIENT_HELLO:unknown protocol
I0529 13:47:55.511425 31959 ssl_tests.cpp:472] Testing server protocol 'LIBPROCESS_SSL_ENABLE_TLS_V1_2'
with client protocol 'LIBPROCESS_SSL_ENABLE_TLS_V1_0'
I0529 13:47:55.511904 31959 openssl.cpp:419] CA file path is unspecified! NOTE: Set CA file
path with LIBPROCESS_SSL_CA_FILE=<filepath>
I0529 13:47:55.511924 31959 openssl.cpp:424] CA directory path unspecified! NOTE: Set CA directory
path with LIBPROCESS_SSL_CA_DIR=<dirpath>
I0529 13:47:55.511930 31959 openssl.cpp:429] Will not verify peer certificate!
NOTE: Set LIBPROCESS_SSL_VERIFY_CERT=1 to enable peer certificate verification
I0529 13:47:55.511940 31959 openssl.cpp:435] Will only verify peer certificate if presented!
NOTE: Set LIBPROCESS_SSL_REQUIRE_CERT=1 to require peer certificate verification
WARNING: Logging before InitGoogleLogging() is written to STDERR
I0529 13:47:55.534410 32475 openssl.cpp:419] CA file path is unspecified! NOTE: Set CA file
path with LIBPROCESS_SSL_CA_FILE=<filepath>
I0529 13:47:55.534538 32475 openssl.cpp:424] CA directory path unspecified! NOTE: Set CA directory
path with LIBPROCESS_SSL_CA_DIR=<dirpath>
I0529 13:47:55.534545 32475 openssl.cpp:429] Will not verify peer certificate!
NOTE: Set LIBPROCESS_SSL_VERIFY_CERT=1 to enable peer certificate verification
I0529 13:47:55.534550 32475 openssl.cpp:435] Will only verify peer certificate if presented!
NOTE: Set LIBPROCESS_SSL_REQUIRE_CERT=1 to require peer certificate verification
I0529 13:47:55.538480 31976 libevent_ssl_socket.cpp:1170] Socket error: error:140760FC:SSL
routines:SSL23_GET_CLIENT_HELLO:unknown protocol
I0529 13:47:55.615406 31959 ssl_tests.cpp:472] Testing server protocol 'LIBPROCESS_SSL_ENABLE_TLS_V1_2'
with client protocol 'LIBPROCESS_SSL_ENABLE_TLS_V1_1'
I0529 13:47:55.615814 31959 openssl.cpp:419] CA file path is unspecified! NOTE: Set CA file
path with LIBPROCESS_SSL_CA_FILE=<filepath>
I0529 13:47:55.615828 31959 openssl.cpp:424] CA directory path unspecified! NOTE: Set CA directory
path with LIBPROCESS_SSL_CA_DIR=<dirpath>
I0529 13:47:55.615833 31959 openssl.cpp:429] Will not verify peer certificate!
NOTE: Set LIBPROCESS_SSL_VERIFY_CERT=1 to enable peer certificate verification
I0529 13:47:55.615841 31959 openssl.cpp:435] Will only verify peer certificate if presented!
NOTE: Set LIBPROCESS_SSL_REQUIRE_CERT=1 to require peer certificate verification
WARNING: Logging before InitGoogleLogging() is written to STDERR
I0529 13:47:55.640535 32493 openssl.cpp:419] CA file path is unspecified! NOTE: Set CA file
path with LIBPROCESS_SSL_CA_FILE=<filepath>
I0529 13:47:55.640645 32493 openssl.cpp:424] CA directory path unspecified! NOTE: Set CA directory
path with LIBPROCESS_SSL_CA_DIR=<dirpath>
I0529 13:47:55.640651 32493 openssl.cpp:429] Will not verify peer certificate!
NOTE: Set LIBPROCESS_SSL_VERIFY_CERT=1 to enable peer certificate verification
I0529 13:47:55.640656 32493 openssl.cpp:435] Will only verify peer certificate if presented!
NOTE: Set LIBPROCESS_SSL_REQUIRE_CERT=1 to require peer certificate verification
I0529 13:47:55.647665 31976 libevent_ssl_socket.cpp:1170] Socket error: error:140760FC:SSL
routines:SSL23_GET_CLIENT_HELLO:unknown protocol
I0529 13:47:55.719008 31959 ssl_tests.cpp:472] Testing server protocol 'LIBPROCESS_SSL_ENABLE_TLS_V1_2'
with client protocol 'LIBPROCESS_SSL_ENABLE_TLS_V1_2'
I0529 13:47:55.719445 31959 openssl.cpp:419] CA file path is unspecified! NOTE: Set CA file
path with LIBPROCESS_SSL_CA_FILE=<filepath>
I0529 13:47:55.719491 31959 openssl.cpp:424] CA directory path unspecified! NOTE: Set CA directory
path with LIBPROCESS_SSL_CA_DIR=<dirpath>
I0529 13:47:55.719528 31959 openssl.cpp:429] Will not verify peer certificate!
NOTE: Set LIBPROCESS_SSL_VERIFY_CERT=1 to enable peer certificate verification
I0529 13:47:55.719560 31959 openssl.cpp:435] Will only verify peer certificate if presented!
NOTE: Set LIBPROCESS_SSL_REQUIRE_CERT=1 to require peer certificate verification
WARNING: Logging before InitGoogleLogging() is written to STDERR
I0529 13:47:55.745661 32511 openssl.cpp:419] CA file path is unspecified! NOTE: Set CA file
path with LIBPROCESS_SSL_CA_FILE=<filepath>
I0529 13:47:55.745998 32511 openssl.cpp:424] CA directory path unspecified! NOTE: Set CA directory
path with LIBPROCESS_SSL_CA_DIR=<dirpath>
I0529 13:47:55.746044 32511 openssl.cpp:429] Will not verify peer certificate!
NOTE: Set LIBPROCESS_SSL_VERIFY_CERT=1 to enable peer certificate verification
I0529 13:47:55.746081 32511 openssl.cpp:435] Will only verify peer certificate if presented!
NOTE: Set LIBPROCESS_SSL_REQUIRE_CERT=1 to require peer certificate verification
[       OK ] SSLTest.ProtocolMismatch (1847 ms)
[ RUN      ] SSLTest.ValidDowngrade
W0529 13:47:56.241305 31959 openssl.cpp:402] Failed SSL connections will be downgraded to
a non-SSL socket
I0529 13:47:56.241331 31959 openssl.cpp:419] CA file path is unspecified! NOTE: Set CA file
path with LIBPROCESS_SSL_CA_FILE=<filepath>
I0529 13:47:56.241335 31959 openssl.cpp:424] CA directory path unspecified! NOTE: Set CA directory
path with LIBPROCESS_SSL_CA_DIR=<dirpath>
I0529 13:47:56.241338 31959 openssl.cpp:429] Will not verify peer certificate!
NOTE: Set LIBPROCESS_SSL_VERIFY_CERT=1 to enable peer certificate verification
I0529 13:47:56.241343 31959 openssl.cpp:449] LIBPROCESS_SSL_REQUIRE_CERT implies peer certificate
verification.
LIBPROCESS_SSL_VERIFY_CERT set to true
I0529 13:47:56.251680 31959 openssl.cpp:511] Using default CA file '/etc/pki/tls/cert.pem'
and/or directory '/etc/pki/tls/certs'
[       OK ] SSLTest.ValidDowngrade (506 ms)
[ RUN      ] SSLTest.NoValidDowngrade
I0529 13:47:56.774286 31959 openssl.cpp:419] CA file path is unspecified! NOTE: Set CA file
path with LIBPROCESS_SSL_CA_FILE=<filepath>
I0529 13:47:56.774312 31959 openssl.cpp:424] CA directory path unspecified! NOTE: Set CA directory
path with LIBPROCESS_SSL_CA_DIR=<dirpath>
I0529 13:47:56.774317 31959 openssl.cpp:429] Will not verify peer certificate!
NOTE: Set LIBPROCESS_SSL_VERIFY_CERT=1 to enable peer certificate verification
I0529 13:47:56.774320 31959 openssl.cpp:449] LIBPROCESS_SSL_REQUIRE_CERT implies peer certificate
verification.
LIBPROCESS_SSL_VERIFY_CERT set to true
I0529 13:47:56.784255 31959 openssl.cpp:511] Using default CA file '/etc/pki/tls/cert.pem'
and/or directory '/etc/pki/tls/certs'
I0529 13:47:56.802306 31976 libevent_ssl_socket.cpp:1170] Socket error: error:140760FC:SSL
routines:SSL23_GET_CLIENT_HELLO:unknown protocol
[       OK ] SSLTest.NoValidDowngrade (504 ms)
[ RUN      ] SSLTest.ValidDowngradeEachProtocol
I0529 13:47:57.190400 31959 ssl_tests.cpp:591] Testing server protocol 'LIBPROCESS_SSL_ENABLE_SSL_V3'
W0529 13:47:57.192045 31959 openssl.cpp:402] Failed SSL connections will be downgraded to
a non-SSL socket
I0529 13:47:57.192059 31959 openssl.cpp:419] CA file path is unspecified! NOTE: Set CA file
path with LIBPROCESS_SSL_CA_FILE=<filepath>
I0529 13:47:57.192062 31959 openssl.cpp:424] CA directory path unspecified! NOTE: Set CA directory
path with LIBPROCESS_SSL_CA_DIR=<dirpath>
I0529 13:47:57.192065 31959 openssl.cpp:429] Will not verify peer certificate!
NOTE: Set LIBPROCESS_SSL_VERIFY_CERT=1 to enable peer certificate verification
I0529 13:47:57.192068 31959 openssl.cpp:435] Will only verify peer certificate if presented!
NOTE: Set LIBPROCESS_SSL_REQUIRE_CERT=1 to require peer certificate verification
I0529 13:47:57.231779 31959 ssl_tests.cpp:591] Testing server protocol 'LIBPROCESS_SSL_ENABLE_TLS_V1_0'
W0529 13:47:57.232074 31959 openssl.cpp:402] Failed SSL connections will be downgraded to
a non-SSL socket
I0529 13:47:57.232087 31959 openssl.cpp:419] CA file path is unspecified! NOTE: Set CA file
path with LIBPROCESS_SSL_CA_FILE=<filepath>
I0529 13:47:57.232091 31959 openssl.cpp:424] CA directory path unspecified! NOTE: Set CA directory
path with LIBPROCESS_SSL_CA_DIR=<dirpath>
I0529 13:47:57.232095 31959 openssl.cpp:429] Will not verify peer certificate!
NOTE: Set LIBPROCESS_SSL_VERIFY_CERT=1 to enable peer certificate verification
I0529 13:47:57.232098 31959 openssl.cpp:435] Will only verify peer certificate if presented!
NOTE: Set LIBPROCESS_SSL_REQUIRE_CERT=1 to require peer certificate verification
I0529 13:47:57.334947 31959 ssl_tests.cpp:591] Testing server protocol 'LIBPROCESS_SSL_ENABLE_TLS_V1_1'
W0529 13:47:57.335242 31959 openssl.cpp:402] Failed SSL connections will be downgraded to
a non-SSL socket
I0529 13:47:57.335253 31959 openssl.cpp:419] CA file path is unspecified! NOTE: Set CA file
path with LIBPROCESS_SSL_CA_FILE=<filepath>
I0529 13:47:57.335258 31959 openssl.cpp:424] CA directory path unspecified! NOTE: Set CA directory
path with LIBPROCESS_SSL_CA_DIR=<dirpath>
I0529 13:47:57.335260 31959 openssl.cpp:429] Will not verify peer certificate!
NOTE: Set LIBPROCESS_SSL_VERIFY_CERT=1 to enable peer certificate verification
I0529 13:47:57.335263 31959 openssl.cpp:435] Will only verify peer certificate if presented!
NOTE: Set LIBPROCESS_SSL_REQUIRE_CERT=1 to require peer certificate verification
I0529 13:47:57.437090 31959 ssl_tests.cpp:591] Testing server protocol 'LIBPROCESS_SSL_ENABLE_TLS_V1_2'
W0529 13:47:57.437441 31959 openssl.cpp:402] Failed SSL connections will be downgraded to
a non-SSL socket
I0529 13:47:57.437454 31959 openssl.cpp:419] CA file path is unspecified! NOTE: Set CA file
path with LIBPROCESS_SSL_CA_FILE=<filepath>
I0529 13:47:57.437461 31959 openssl.cpp:424] CA directory path unspecified! NOTE: Set CA directory
path with LIBPROCESS_SSL_CA_DIR=<dirpath>
I0529 13:47:57.437469 31959 openssl.cpp:429] Will not verify peer certificate!
NOTE: Set LIBPROCESS_SSL_VERIFY_CERT=1 to enable peer certificate verification
I0529 13:47:57.437475 31959 openssl.cpp:435] Will only verify peer certificate if presented!
NOTE: Set LIBPROCESS_SSL_REQUIRE_CERT=1 to require peer certificate verification
[       OK ] SSLTest.ValidDowngradeEachProtocol (707 ms)
[ RUN      ] SSLTest.NoValidDowngradeEachProtocol
I0529 13:47:57.961128 31959 ssl_tests.cpp:638] Testing server protocol 'LIBPROCESS_SSL_ENABLE_SSL_V3'
I0529 13:47:57.961427 31959 openssl.cpp:419] CA file path is unspecified! NOTE: Set CA file
path with LIBPROCESS_SSL_CA_FILE=<filepath>
I0529 13:47:57.961441 31959 openssl.cpp:424] CA directory path unspecified! NOTE: Set CA directory
path with LIBPROCESS_SSL_CA_DIR=<dirpath>
I0529 13:47:57.961447 31959 openssl.cpp:429] Will not verify peer certificate!
NOTE: Set LIBPROCESS_SSL_VERIFY_CERT=1 to enable peer certificate verification
I0529 13:47:57.961453 31959 openssl.cpp:435] Will only verify peer certificate if presented!
NOTE: Set LIBPROCESS_SSL_REQUIRE_CERT=1 to require peer certificate verification
I0529 13:47:57.984493 31976 libevent_ssl_socket.cpp:1170] Socket error: error:140760FC:SSL
routines:SSL23_GET_CLIENT_HELLO:unknown protocol
I0529 13:47:58.040897 31959 ssl_tests.cpp:638] Testing server protocol 'LIBPROCESS_SSL_ENABLE_TLS_V1_0'
I0529 13:47:58.041167 31959 openssl.cpp:419] CA file path is unspecified! NOTE: Set CA file
path with LIBPROCESS_SSL_CA_FILE=<filepath>
I0529 13:47:58.041180 31959 openssl.cpp:424] CA directory path unspecified! NOTE: Set CA directory
path with LIBPROCESS_SSL_CA_DIR=<dirpath>
I0529 13:47:58.041183 31959 openssl.cpp:429] Will not verify peer certificate!
NOTE: Set LIBPROCESS_SSL_VERIFY_CERT=1 to enable peer certificate verification
I0529 13:47:58.041188 31959 openssl.cpp:435] Will only verify peer certificate if presented!
NOTE: Set LIBPROCESS_SSL_REQUIRE_CERT=1 to require peer certificate verification
I0529 13:47:58.064113 31976 libevent_ssl_socket.cpp:1170] Socket error: error:140760FC:SSL
routines:SSL23_GET_CLIENT_HELLO:unknown protocol
I0529 13:47:58.142813 31959 ssl_tests.cpp:638] Testing server protocol 'LIBPROCESS_SSL_ENABLE_TLS_V1_1'
I0529 13:47:58.143164 31959 openssl.cpp:419] CA file path is unspecified! NOTE: Set CA file
path with LIBPROCESS_SSL_CA_FILE=<filepath>
I0529 13:47:58.143177 31959 openssl.cpp:424] CA directory path unspecified! NOTE: Set CA directory
path with LIBPROCESS_SSL_CA_DIR=<dirpath>
I0529 13:47:58.143184 31959 openssl.cpp:429] Will not verify peer certificate!
NOTE: Set LIBPROCESS_SSL_VERIFY_CERT=1 to enable peer certificate verification
I0529 13:47:58.143190 31959 openssl.cpp:435] Will only verify peer certificate if presented!
NOTE: Set LIBPROCESS_SSL_REQUIRE_CERT=1 to require peer certificate verification
I0529 13:47:58.163769 31976 libevent_ssl_socket.cpp:1170] Socket error: error:140760FC:SSL
routines:SSL23_GET_CLIENT_HELLO:unknown protocol
I0529 13:47:58.244498 31959 ssl_tests.cpp:638] Testing server protocol 'LIBPROCESS_SSL_ENABLE_TLS_V1_2'
I0529 13:47:58.244910 31959 openssl.cpp:419] CA file path is unspecified! NOTE: Set CA file
path with LIBPROCESS_SSL_CA_FILE=<filepath>
I0529 13:47:58.244925 31959 openssl.cpp:424] CA directory path unspecified! NOTE: Set CA directory
path with LIBPROCESS_SSL_CA_DIR=<dirpath>
I0529 13:47:58.244930 31959 openssl.cpp:429] Will not verify peer certificate!
NOTE: Set LIBPROCESS_SSL_VERIFY_CERT=1 to enable peer certificate verification
I0529 13:47:58.244940 31959 openssl.cpp:435] Will only verify peer certificate if presented!
NOTE: Set LIBPROCESS_SSL_REQUIRE_CERT=1 to require peer certificate verification
I0529 13:47:58.267985 31976 libevent_ssl_socket.cpp:1170] Socket error: error:140760FC:SSL
routines:SSL23_GET_CLIENT_HELLO:unknown protocol
[       OK ] SSLTest.NoValidDowngradeEachProtocol (807 ms)
[ RUN      ] SSLTest.PeerAddress
I0529 13:47:59.069003 31959 openssl.cpp:419] CA file path is unspecified! NOTE: Set CA file
path with LIBPROCESS_SSL_CA_FILE=<filepath>
I0529 13:47:59.069028 31959 openssl.cpp:424] CA directory path unspecified! NOTE: Set CA directory
path with LIBPROCESS_SSL_CA_DIR=<dirpath>
I0529 13:47:59.069033 31959 openssl.cpp:429] Will not verify peer certificate!
NOTE: Set LIBPROCESS_SSL_VERIFY_CERT=1 to enable peer certificate verification
I0529 13:47:59.069037 31959 openssl.cpp:435] Will only verify peer certificate if presented!
NOTE: Set LIBPROCESS_SSL_REQUIRE_CERT=1 to require peer certificate verification
[       OK ] SSLTest.PeerAddress (729 ms)
[ RUN      ] SSLTest.HTTPSGet
I0529 13:47:59.259474 31959 openssl.cpp:419] CA file path is unspecified! NOTE: Set CA file
path with LIBPROCESS_SSL_CA_FILE=<filepath>
I0529 13:47:59.259497 31959 openssl.cpp:424] CA directory path unspecified! NOTE: Set CA directory
path with LIBPROCESS_SSL_CA_DIR=<dirpath>
I0529 13:47:59.259501 31959 openssl.cpp:429] Will not verify peer certificate!
NOTE: Set LIBPROCESS_SSL_VERIFY_CERT=1 to enable peer certificate verification
I0529 13:47:59.259508 31959 openssl.cpp:435] Will only verify peer certificate if presented!
NOTE: Set LIBPROCESS_SSL_REQUIRE_CERT=1 to require peer certificate verification
[       OK ] SSLTest.HTTPSGet (190 ms)
[ RUN      ] SSLTest.HTTPSPost
I0529 13:47:59.443277 31959 openssl.cpp:419] CA file path is unspecified! NOTE: Set CA file
path with LIBPROCESS_SSL_CA_FILE=<filepath>
I0529 13:47:59.443308 31959 openssl.cpp:424] CA directory path unspecified! NOTE: Set CA directory
path with LIBPROCESS_SSL_CA_DIR=<dirpath>
I0529 13:47:59.443312 31959 openssl.cpp:429] Will not verify peer certificate!
NOTE: Set LIBPROCESS_SSL_VERIFY_CERT=1 to enable peer certificate verification
I0529 13:47:59.443316 31959 openssl.cpp:435] Will only verify peer certificate if presented!
NOTE: Set LIBPROCESS_SSL_REQUIRE_CERT=1 to require peer certificate verification
[       OK ] SSLTest.HTTPSPost (185 ms)
[ RUN      ] SSLTest.SilentSocket
I0529 13:47:59.627235 31959 openssl.cpp:419] CA file path is unspecified! NOTE: Set CA file
path with LIBPROCESS_SSL_CA_FILE=<filepath>
I0529 13:47:59.627259 31959 openssl.cpp:424] CA directory path unspecified! NOTE: Set CA directory
path with LIBPROCESS_SSL_CA_DIR=<dirpath>
I0529 13:47:59.627264 31959 openssl.cpp:429] Will not verify peer certificate!
NOTE: Set LIBPROCESS_SSL_VERIFY_CERT=1 to enable peer certificate verification
I0529 13:47:59.627267 31959 openssl.cpp:435] Will only verify peer certificate if presented!
NOTE: Set LIBPROCESS_SSL_REQUIRE_CERT=1 to require peer certificate verification
I0529 13:47:59.634969 31976 libevent_ssl_socket.cpp:1170] Socket error: error:00000000:lib(0):func(0):reason(0)
[       OK ] SSLTest.SilentSocket (186 ms)
[----------] 15 tests from SSLTest (8588 ms total)

[----------] 42 tests from Scheme/HTTPTest
[ RUN      ] Scheme/HTTPTest.Endpoints/0
I0529 13:48:00.234650 31959 openssl.cpp:419] CA file path is unspecified! NOTE: Set CA file
path with LIBPROCESS_SSL_CA_FILE=<filepath>
I0529 13:48:00.234673 31959 openssl.cpp:424] CA directory path unspecified! NOTE: Set CA directory
path with LIBPROCESS_SSL_CA_DIR=<dirpath>
I0529 13:48:00.234678 31959 openssl.cpp:429] Will not verify peer certificate!
NOTE: Set LIBPROCESS_SSL_VERIFY_CERT=1 to enable peer certificate verification
I0529 13:48:00.234680 31959 openssl.cpp:435] Will only verify peer certificate if presented!
NOTE: Set LIBPROCESS_SSL_REQUIRE_CERT=1 to require peer certificate verification
E0529 13:48:00.234984 31976 process.cpp:950] Failed to accept socket: future discarded
*** Aborted at 1496065680 (unix time) try "date -d @1496065680" if you are using GNU date
***
I0529 13:48:00.236254 31959 process.cpp:1266] libprocess is initialized on 172.17.0.3:60826
with 16 worker threads
PC: @     0x7fd6fa087c86 __memcpy_ssse3_back
*** SIGSEGV (@0x332dce8) received by PID 31959 (TID 0x7fd6eecff700) from PID 53665000; stack
trace: ***
    @     0x7fd6fab2e370 (unknown)
    @     0x7fd6fa087c86 __memcpy_ssse3_back
    @     0x7fd6fa8d48e0 (unknown)
    @     0x7fd6fa8d4f8c (unknown)
I0529 13:48:00.242650 32724 process.cpp:3730] Handling HTTP event for process '(77)' with
path: '/(77)/body'
I0529 13:48:00.246887 32719 process.cpp:3730] Handling HTTP event for process '(77)' with
path: '/(77)/pipe'
I0529 13:48:00.251395 32713 process.cpp:3730] Handling HTTP event for process '(77)' with
path: '/(77)/body'
I0529 13:48:00.251649 32719 process.cpp:3787] Failed to process request for '/(77)/body':
failure
I0529 13:48:00.251665 32709 process.cpp:1476] Returning '500 Internal Server Error' for '/(77)/body'
(failure)
[       OK ] Scheme/HTTPTest.Endpoints/0 (617 ms)
[ RUN      ] Scheme/HTTPTest.Endpoints/1
    @     0x7fd6fcd610b2 process::internal::dispatch()
    @     0x7fd6fcda6f36 process::dispatch<>()
    @     0x7fd6fcd651e8 process::ProcessBase::route()
    @     0x7fd6fcc988e4 process::Help::initialize()
    @     0x7fd6fcd62111 process::ProcessManager::resume()
    @     0x7fd6fcd6b177 _ZNSt6thread5_ImplISt12_Bind_simpleIFZN7process14ProcessManager12init_threadsEvEUt_vEEE6_M_runEv
    @     0x7fd6fa8cb230 (unknown)
    @     0x7fd6fab26dc5 start_thread
    @     0x7fd6fa03476d __clone
make[3]: *** [CMakeFiles/check] Segmentation fault
make[3]: Leaving directory `/mesos/build'
make[2]: *** [CMakeFiles/check.dir/all] Error 2make[2]: Leaving directory `/mesos/build'

make[1]: *** [CMakeFiles/check.dir/rule] Error 2
make[1]: Leaving directory `/mesos/build'
make: *** [check] Error 2
+ docker rmi mesos-1496062005-19795
Untagged: mesos-1496062005-19795:latest
Deleted: sha256:ccbcae11a21edb9cc6a493ac634b0cdb2bd5a9003622532992b4583147e915c0
Deleted: sha256:6d2f810c7998e46c26ff4272a289922c6209f7dfd83b984955c88dfa85b6f245
Deleted: sha256:c88073be5d21a434d718f9becac82b1e063186ab13bca6ce63fec7e6cb3b94aa
Deleted: sha256:b1a1f2da097b18c75c727a3d78a22f69fe68cd942d706cea5318eb1b183eccc4
Deleted: sha256:857a551b59e2e15820cc9a12307a7293dce5d0509740fcd7e1e3afc15b46f0ef
Deleted: sha256:5b9b9aa3edc4ee14466ed56639153939e39f97d79deaaac30937573bdf1bc1a9
Deleted: sha256:70fa7b8809e2969839df59c1967c23dc8788c60f0feaa7c929012de52e9ae0a8
Deleted: sha256:f3ffcb22f23fe773526a17125a663db2d8903c8716d8fff3a3699b889013741f
Deleted: sha256:9a2f7012c0efec5e337433aae615a6e0133d15a6903dbb33ecc69a428f4505c1
Deleted: sha256:b97926136506cca1b779b0ffb63ef85186c04cce1222a2ee1461a8919c17ff00
Deleted: sha256:46d88ef02cd120c1601c20bb398420867430354820ffb07e08da39d0d4637226
Deleted: sha256:e392e18a305f50b30d637bbb0cee059e2d0aedea2bb869a5894f0d31347a08e9
Deleted: sha256:078ae2bae892aac4792d6d053c26dbefd43cdfb0785eda1edcce79c12deb7632
Deleted: sha256:a1ea7bcf15d192a93ed7affb78a3b85570fffcfac9e9afe488fada237018243b
Deleted: sha256:91b494b6dcd41c30982944be6bc8f9a0679f996a7bba83df6930916d3095854b
Deleted: sha256:59155689c73d82f8f0c4883b2d707ef4e3e03a5c2c87496fc1689d8adce44c26
Deleted: sha256:5b06e270ce9645be9fc68245754c37ba272d60f24ed491a4a33be20e0b643972
Deleted: sha256:53822b1120f280aa7dcaaed95688128735bc19242a4b5f9abed1ab9415ed71b6
Deleted: sha256:e27d40b60d0df364b067ba35d45fae5f179fd3d4908bf94bfd2edc29d75c9693
Deleted: sha256:1d40e611eb5ebb9678e2449d136db68c3d1db3e331ef8fc12f454b663fab0e29
Deleted: sha256:bdc28a9c82f1fc8d9d959da239275ba3ab3cc73240a37712b3c61341798bea55
Deleted: sha256:1cda990b5d1edf6793c91ff618c6c24355c3b6688463838ae1a0bc5e8698123e
Deleted: sha256:f9965c3af75fa962231e02ea9e683dab41732f5bb7650305dc23425fa360c610
Deleted: sha256:17b7b0838ee52d662d0ba5f52f7dd30e2471b8dfd5242f7107561568cb056792
Deleted: sha256:84b1331ec8b78f53c2c7447266961512db4fcae6f990cebd11d5e49e352e9837
Build step 'Execute shell' marked build as failure
Not sending mail to unregistered user neil.conway@gmail.com

Mime
View raw message