mesos-builds mailing list archives

Site index · List index
Message view « Date » · « Thread »
Top « Date » · « Thread »
From Apache Jenkins Server <jenk...@builds.apache.org>
Subject Build failed in Jenkins: Mesos-Buildbot » autotools,gcc,--verbose,GLOG_v=1 MESOS_VERBOSE=1,ubuntu:14.04,(docker||Hadoop)&&(!ubuntu-us1)&&(!ubuntu-eu2) #3685
Date Tue, 16 May 2017 22:06:59 GMT
See <https://builds.apache.org/job/Mesos-Buildbot/BUILDTOOL=autotools,COMPILER=gcc,CONFIGURATION=--verbose,ENVIRONMENT=GLOG_v=1%20MESOS_VERBOSE=1,OS=ubuntu%3A14.04,label_exp=(docker%7C%7CHadoop)&&(!ubuntu-us1)&&(!ubuntu-eu2)/3685/display/redirect?page=changes>

Changes:

[neil.conway] Disabled support for hierarchical roles.

[neil.conway] Updated Mesos 1.3.0 CHANGELOG for removal of hierarchical roles.

------------------------------------------
[...truncated 27.07 MB...]
[       OK ] Endpoint/SlaveEndpointTest.AuthorizedRequest/1 (27 ms)
[ RUN      ] Endpoint/SlaveEndpointTest.AuthorizedRequest/2
I0516 22:06:53.397013 30650 containerizer.cpp:221] Using isolation: posix/cpu,posix/mem,filesystem/posix,network/cni
W0516 22:06:53.397506 30650 backend.cpp:76] Failed to create 'aufs' backend: AufsBackend requires
root privileges
W0516 22:06:53.397611 30650 backend.cpp:76] Failed to create 'bind' backend: BindBackend requires
root privileges
I0516 22:06:53.397644 30650 provisioner.cpp:249] Using default backend 'copy'
I0516 22:06:53.400813 30684 slave.cpp:225] Mesos agent started on (746)@172.17.0.3:52840
I0516 22:06:53.400848 30684 slave.cpp:226] Flags at startup: --acls="" --appc_simple_discovery_uri_prefix="http://"
--appc_store_dir="/tmp/mesos/store/appc" --authenticate_http_readonly="true" --authenticate_http_readwrite="true"
--authenticatee="crammd5" --authentication_backoff_factor="1secs" --authorizer="local" --cgroups_cpu_enable_pids_and_tids_count="false"
--cgroups_enable_cfs="false" --cgroups_hierarchy="/sys/fs/cgroup" --cgroups_limit_swap="false"
--cgroups_root="mesos" --container_disk_watch_interval="15secs" --containerizers="mesos" --credential="/tmp/Endpoint_SlaveEndpointTest_AuthorizedRequest_2_R6ubLq/credential"
--default_role="*" --disk_watch_interval="1mins" --docker="docker" --docker_kill_orphans="true"
--docker_registry="https://registry-1.docker.io" --docker_remove_delay="6hrs" --docker_socket="/var/run/docker.sock"
--docker_stop_timeout="0ns" --docker_store_dir="/tmp/mesos/store/docker" --docker_volume_checkpoint_dir="/var/run/mesos/isolators/docker/volume"
--enforce_container_disk_quota="false" --executor_registration_timeout="1mins" --executor_shutdown_grace_period="5secs"
--fetcher_cache_dir="/tmp/Endpoint_SlaveEndpointTest_AuthorizedRequest_2_R6ubLq/fetch" --fetcher_cache_size="2GB"
--frameworks_home="" --gc_delay="1weeks" --gc_disk_headroom="0.1" --hadoop_home="" --help="false"
--hostname_lookup="true" --http_command_executor="false" --http_credentials="/tmp/Endpoint_SlaveEndpointTest_AuthorizedRequest_2_R6ubLq/http_credentials"
--http_heartbeat_interval="30secs" --initialize_driver_logging="true" --isolation="posix/cpu,posix/mem"
--launcher="posix" --launcher_dir="/mesos/mesos-1.4.0/_build/src" --logbufsecs="0" --logging_level="INFO"
--max_completed_executors_per_framework="150" --oversubscribed_resources_interval="15secs"
--perf_duration="10secs" --perf_interval="1mins" --port="5051" --qos_correction_interval_min="0ns"
--quiet="false" --recover="reconnect" --recovery_timeout="15mins" --registration_backoff_factor="10ms"
--resources="cpus:2;gpus:0;mem:1024;disk:1024;ports:[31000-32000]" --revocable_cpu_low_priority="true"
--runtime_dir="/tmp/Endpoint_SlaveEndpointTest_AuthorizedRequest_2_R6ubLq" --sandbox_directory="/mnt/mesos/sandbox"
--strict="true" --switch_user="true" --systemd_enable_support="true" --systemd_runtime_directory="/run/systemd/system"
--version="false" --work_dir="/tmp/Endpoint_SlaveEndpointTest_AuthorizedRequest_2_h0qo1N"
I0516 22:06:53.401309 30684 credentials.hpp:86] Loading credential for authentication from
'/tmp/Endpoint_SlaveEndpointTest_AuthorizedRequest_2_R6ubLq/credential'
I0516 22:06:53.401530 30684 slave.cpp:258] Agent using credential for: test-principal
I0516 22:06:53.401551 30684 credentials.hpp:37] Loading credentials for authentication from
'/tmp/Endpoint_SlaveEndpointTest_AuthorizedRequest_2_R6ubLq/http_credentials'
I0516 22:06:53.401800 30684 http.cpp:975] Creating default 'basic' HTTP authenticator for
realm 'mesos-agent-readonly'
I0516 22:06:53.402036 30684 http.cpp:975] Creating default 'basic' HTTP authenticator for
realm 'mesos-agent-readwrite'
I0516 22:06:53.403388 30684 slave.cpp:529] Agent resources: cpus(*):2; mem(*):1024; disk(*):1024;
ports(*):[31000-32000]
I0516 22:06:53.403466 30684 slave.cpp:537] Agent attributes: [  ]
I0516 22:06:53.403487 30684 slave.cpp:542] Agent hostname: 35d228e236cf
I0516 22:06:53.403641 30677 status_update_manager.cpp:177] Pausing sending status updates
I0516 22:06:53.405184 30672 state.cpp:62] Recovering state from '/tmp/Endpoint_SlaveEndpointTest_AuthorizedRequest_2_h0qo1N/meta'
I0516 22:06:53.405567 30676 status_update_manager.cpp:203] Recovering status update manager
I0516 22:06:53.405786 30678 containerizer.cpp:608] Recovering containerizer
I0516 22:06:53.407294 30683 provisioner.cpp:410] Provisioner recovery complete
I0516 22:06:53.407694 30682 slave.cpp:5974] Finished recovery
I0516 22:06:53.408253 30682 slave.cpp:6156] Querying resource estimator for oversubscribable
resources
I0516 22:06:53.408529 30670 slave.cpp:6170] Received oversubscribable resources {} from the
resource estimator
I0516 22:06:53.411083 30675 process.cpp:3730] Handling HTTP event for process 'slave(746)'
with path: '/slave(746)/containers'
I0516 22:06:53.412292 30680 http.cpp:1115] HTTP GET for /slave(746)/containers from 172.17.0.3:55630
I0516 22:06:53.412369 30680 http.cpp:936] Authorizing principal 'test-principal' to GET the
'/containers' endpoint
I0516 22:06:53.415892 30669 slave.cpp:794] Agent terminating
[       OK ] Endpoint/SlaveEndpointTest.AuthorizedRequest/2 (28 ms)
[ RUN      ] Endpoint/SlaveEndpointTest.UnauthorizedRequest/0
I0516 22:06:53.425379 30650 containerizer.cpp:221] Using isolation: posix/cpu,posix/mem,filesystem/posix,network/cni
W0516 22:06:53.425822 30650 backend.cpp:76] Failed to create 'aufs' backend: AufsBackend requires
root privileges
W0516 22:06:53.425916 30650 backend.cpp:76] Failed to create 'bind' backend: BindBackend requires
root privileges
I0516 22:06:53.425950 30650 provisioner.cpp:249] Using default backend 'copy'
I0516 22:06:53.428716 30683 slave.cpp:225] Mesos agent started on (747)@172.17.0.3:52840
I0516 22:06:53.428740 30683 slave.cpp:226] Flags at startup: --acls="" --appc_simple_discovery_uri_prefix="http://"
--appc_store_dir="/tmp/mesos/store/appc" --authenticate_http_readonly="true" --authenticate_http_readwrite="true"
--authenticatee="crammd5" --authentication_backoff_factor="1secs" --authorizer="local" --cgroups_cpu_enable_pids_and_tids_count="false"
--cgroups_enable_cfs="false" --cgroups_hierarchy="/sys/fs/cgroup" --cgroups_limit_swap="false"
--cgroups_root="mesos" --container_disk_watch_interval="15secs" --containerizers="mesos" --credential="/tmp/Endpoint_SlaveEndpointTest_UnauthorizedRequest_0_7GL5XV/credential"
--default_role="*" --disk_watch_interval="1mins" --docker="docker" --docker_kill_orphans="true"
--docker_registry="https://registry-1.docker.io" --docker_remove_delay="6hrs" --docker_socket="/var/run/docker.sock"
--docker_stop_timeout="0ns" --docker_store_dir="/tmp/mesos/store/docker" --docker_volume_checkpoint_dir="/var/run/mesos/isolators/docker/volume"
--enforce_container_disk_quota="false" --executor_registration_timeout="1mins" --executor_shutdown_grace_period="5secs"
--fetcher_cache_dir="/tmp/Endpoint_SlaveEndpointTest_UnauthorizedRequest_0_7GL5XV/fetch" --fetcher_cache_size="2GB"
--frameworks_home="" --gc_delay="1weeks" --gc_disk_headroom="0.1" --hadoop_home="" --help="false"
--hostname_lookup="true" --http_command_executor="false" --http_credentials="/tmp/Endpoint_SlaveEndpointTest_UnauthorizedRequest_0_7GL5XV/http_credentials"
--http_heartbeat_interval="30secs" --initialize_driver_logging="true" --isolation="posix/cpu,posix/mem"
--launcher="posix" --launcher_dir="/mesos/mesos-1.4.0/_build/src" --logbufsecs="0" --logging_level="INFO"
--max_completed_executors_per_framework="150" --oversubscribed_resources_interval="15secs"
--perf_duration="10secs" --perf_interval="1mins" --port="5051" --qos_correction_interval_min="0ns"
--quiet="false" --recover="reconnect" --recovery_timeout="15mins" --registration_backoff_factor="10ms"
--resources="cpus:2;gpus:0;mem:1024;disk:1024;ports:[31000-32000]" --revocable_cpu_low_priority="true"
--runtime_dir="/tmp/Endpoint_SlaveEndpointTest_UnauthorizedRequest_0_7GL5XV" --sandbox_directory="/mnt/mesos/sandbox"
--strict="true" --switch_user="true" --systemd_enable_support="true" --systemd_runtime_directory="/run/systemd/system"
--version="false" --work_dir="/tmp/Endpoint_SlaveEndpointTest_UnauthorizedRequest_0_VOjF9i"
I0516 22:06:53.429278 30683 credentials.hpp:86] Loading credential for authentication from
'/tmp/Endpoint_SlaveEndpointTest_UnauthorizedRequest_0_7GL5XV/credential'
I0516 22:06:53.429468 30683 slave.cpp:258] Agent using credential for: test-principal
I0516 22:06:53.429497 30683 credentials.hpp:37] Loading credentials for authentication from
'/tmp/Endpoint_SlaveEndpointTest_UnauthorizedRequest_0_7GL5XV/http_credentials'
I0516 22:06:53.429796 30683 http.cpp:975] Creating default 'basic' HTTP authenticator for
realm 'mesos-agent-readonly'
I0516 22:06:53.429958 30683 http.cpp:975] Creating default 'basic' HTTP authenticator for
realm 'mesos-agent-readwrite'
I0516 22:06:53.431253 30683 slave.cpp:529] Agent resources: cpus(*):2; mem(*):1024; disk(*):1024;
ports(*):[31000-32000]
I0516 22:06:53.431325 30683 slave.cpp:537] Agent attributes: [  ]
I0516 22:06:53.431337 30683 slave.cpp:542] Agent hostname: 35d228e236cf
I0516 22:06:53.431460 30674 status_update_manager.cpp:177] Pausing sending status updates
I0516 22:06:53.432911 30674 state.cpp:62] Recovering state from '/tmp/Endpoint_SlaveEndpointTest_UnauthorizedRequest_0_VOjF9i/meta'
I0516 22:06:53.433300 30676 status_update_manager.cpp:203] Recovering status update manager
I0516 22:06:53.433480 30674 containerizer.cpp:608] Recovering containerizer
I0516 22:06:53.434834 30674 provisioner.cpp:410] Provisioner recovery complete
I0516 22:06:53.435248 30675 slave.cpp:5974] Finished recovery
I0516 22:06:53.435755 30675 slave.cpp:6156] Querying resource estimator for oversubscribable
resources
I0516 22:06:53.436031 30684 slave.cpp:6170] Received oversubscribable resources {} from the
resource estimator
I0516 22:06:53.438639 30682 process.cpp:3730] Handling HTTP event for process 'slave(747)'
with path: '/slave(747)/monitor/statistics'
I0516 22:06:53.439903 30676 http.cpp:1115] HTTP GET for /slave(747)/monitor/statistics from
172.17.0.3:55632
I0516 22:06:53.439975 30676 http.cpp:936] Authorizing principal 'test-principal' to GET the
'/monitor/statistics' endpoint
I0516 22:06:53.441995 30678 slave.cpp:794] Agent terminating
[       OK ] Endpoint/SlaveEndpointTest.UnauthorizedRequest/0 (25 ms)
[ RUN      ] Endpoint/SlaveEndpointTest.UnauthorizedRequest/1
I0516 22:06:53.451263 30650 containerizer.cpp:221] Using isolation: posix/cpu,posix/mem,filesystem/posix,network/cni
W0516 22:06:53.451759 30650 backend.cpp:76] Failed to create 'aufs' backend: AufsBackend requires
root privileges
W0516 22:06:53.451859 30650 backend.cpp:76] Failed to create 'bind' backend: BindBackend requires
root privileges
I0516 22:06:53.451900 30650 provisioner.cpp:249] Using default backend 'copy'
I0516 22:06:53.454859 30674 slave.cpp:225] Mesos agent started on (748)@172.17.0.3:52840
I0516 22:06:53.454885 30674 slave.cpp:226] Flags at startup: --acls="" --appc_simple_discovery_uri_prefix="http://"
--appc_store_dir="/tmp/mesos/store/appc" --authenticate_http_readonly="true" --authenticate_http_readwrite="true"
--authenticatee="crammd5" --authentication_backoff_factor="1secs" --authorizer="local" --cgroups_cpu_enable_pids_and_tids_count="false"
--cgroups_enable_cfs="false" --cgroups_hierarchy="/sys/fs/cgroup" --cgroups_limit_swap="false"
--cgroups_root="mesos" --container_disk_watch_interval="15secs" --containerizers="mesos" --credential="/tmp/Endpoint_SlaveEndpointTest_UnauthorizedRequest_1_fpL3rr/credential"
--default_role="*" --disk_watch_interval="1mins" --docker="docker" --docker_kill_orphans="true"
--docker_registry="https://registry-1.docker.io" --docker_remove_delay="6hrs" --docker_socket="/var/run/docker.sock"
--docker_stop_timeout="0ns" --docker_store_dir="/tmp/mesos/store/docker" --docker_volume_checkpoint_dir="/var/run/mesos/isolators/docker/volume"
--enforce_container_disk_quota="false" --executor_registration_timeout="1mins" --executor_shutdown_grace_period="5secs"
--fetcher_cache_dir="/tmp/Endpoint_SlaveEndpointTest_UnauthorizedRequest_1_fpL3rr/fetch" --fetcher_cache_size="2GB"
--frameworks_home="" --gc_delay="1weeks" --gc_disk_headroom="0.1" --hadoop_home="" --help="false"
--hostname_lookup="true" --http_command_executor="false" --http_credentials="/tmp/Endpoint_SlaveEndpointTest_UnauthorizedRequest_1_fpL3rr/http_credentials"
--http_heartbeat_interval="30secs" --initialize_driver_logging="true" --isolation="posix/cpu,posix/mem"
--launcher="posix" --launcher_dir="/mesos/mesos-1.4.0/_build/src" --logbufsecs="0" --logging_level="INFO"
--max_completed_executors_per_framework="150" --oversubscribed_resources_interval="15secs"
--perf_duration="10secs" --perf_interval="1mins" --port="5051" --qos_correction_interval_min="0ns"
--quiet="false" --recover="reconnect" --recovery_timeout="15mins" --registration_backoff_factor="10ms"
--resources="cpus:2;gpus:0;mem:1024;disk:1024;ports:[31000-32000]" --revocable_cpu_low_priority="true"
--runtime_dir="/tmp/Endpoint_SlaveEndpointTest_UnauthorizedRequest_1_fpL3rr" --sandbox_directory="/mnt/mesos/sandbox"
--strict="true" --switch_user="true" --systemd_enable_support="true" --systemd_runtime_directory="/run/systemd/system"
--version="false" --work_dir="/tmp/Endpoint_SlaveEndpointTest_UnauthorizedRequest_1_dadrzO"
I0516 22:06:53.455371 30674 credentials.hpp:86] Loading credential for authentication from
'/tmp/Endpoint_SlaveEndpointTest_UnauthorizedRequest_1_fpL3rr/credential'
I0516 22:06:53.455596 30674 slave.cpp:258] Agent using credential for: test-principal
I0516 22:06:53.455618 30674 credentials.hpp:37] Loading credentials for authentication from
'/tmp/Endpoint_SlaveEndpointTest_UnauthorizedRequest_1_fpL3rr/http_credentials'
I0516 22:06:53.455878 30674 http.cpp:975] Creating default 'basic' HTTP authenticator for
realm 'mesos-agent-readonly'
I0516 22:06:53.456051 30674 http.cpp:975] Creating default 'basic' HTTP authenticator for
realm 'mesos-agent-readwrite'
I0516 22:06:53.457303 30674 slave.cpp:529] Agent resources: cpus(*):2; mem(*):1024; disk(*):1024;
ports(*):[31000-32000]
I0516 22:06:53.457375 30674 slave.cpp:537] Agent attributes: [  ]
I0516 22:06:53.457387 30674 slave.cpp:542] Agent hostname: 35d228e236cf
I0516 22:06:53.457537 30669 status_update_manager.cpp:177] Pausing sending status updates
I0516 22:06:53.458828 30681 state.cpp:62] Recovering state from '/tmp/Endpoint_SlaveEndpointTest_UnauthorizedRequest_1_dadrzO/meta'
I0516 22:06:53.459208 30682 status_update_manager.cpp:203] Recovering status update manager
I0516 22:06:53.459419 30671 containerizer.cpp:608] Recovering containerizer
I0516 22:06:53.460830 30672 provisioner.cpp:410] Provisioner recovery complete
I0516 22:06:53.461154 30681 slave.cpp:5974] Finished recovery
I0516 22:06:53.461704 30681 slave.cpp:6156] Querying resource estimator for oversubscribable
resources
I0516 22:06:53.462002 30684 slave.cpp:6170] Received oversubscribable resources {} from the
resource estimator
I0516 22:06:53.464644 30682 process.cpp:3730] Handling HTTP event for process 'slave(748)'
with path: '/slave(748)/monitor/statistics.json'
I0516 22:06:53.465983 30670 http.cpp:1115] HTTP GET for /slave(748)/monitor/statistics.json
from 172.17.0.3:55635
I0516 22:06:53.466059 30670 http.cpp:936] Authorizing principal 'test-principal' to GET the
'/monitor/statistics.json' endpoint
I0516 22:06:53.468158 30684 slave.cpp:794] Agent terminating
[       OK ] Endpoint/SlaveEndpointTest.UnauthorizedRequest/1 (25 ms)
[ RUN      ] Endpoint/SlaveEndpointTest.UnauthorizedRequest/2
I0516 22:06:53.477519 30650 containerizer.cpp:221] Using isolation: posix/cpu,posix/mem,filesystem/posix,network/cni
W0516 22:06:53.478011 30650 backend.cpp:76] Failed to create 'aufs' backend: AufsBackend requires
root privileges
W0516 22:06:53.478109 30650 backend.cpp:76] Failed to create 'bind' backend: BindBackend requires
root privileges
I0516 22:06:53.478142 30650 provisioner.cpp:249] Using default backend 'copy'
I0516 22:06:53.481029 30684 slave.cpp:225] Mesos agent started on (749)@172.17.0.3:52840
I0516 22:06:53.481052 30684 slave.cpp:226] Flags at startup: --acls="" --appc_simple_discovery_uri_prefix="http://"
--appc_store_dir="/tmp/mesos/store/appc" --authenticate_http_readonly="true" --authenticate_http_readwrite="true"
--authenticatee="crammd5" --authentication_backoff_factor="1secs" --authorizer="local" --cgroups_cpu_enable_pids_and_tids_count="false"
--cgroups_enable_cfs="false" --cgroups_hierarchy="/sys/fs/cgroup" --cgroups_limit_swap="false"
--cgroups_root="mesos" --container_disk_watch_interval="15secs" --containerizers="mesos" --credential="/tmp/Endpoint_SlaveEndpointTest_UnauthorizedRequest_2_nuY1cX/credential"
--default_role="*" --disk_watch_interval="1mins" --docker="docker" --docker_kill_orphans="true"
--docker_registry="https://registry-1.docker.io" --docker_remove_delay="6hrs" --docker_socket="/var/run/docker.sock"
--docker_stop_timeout="0ns" --docker_store_dir="/tmp/mesos/store/docker" --docker_volume_checkpoint_dir="/var/run/mesos/isolators/docker/volume"
--enforce_container_disk_quota="false" --executor_registration_timeout="1mins" --executor_shutdown_grace_period="5secs"
--fetcher_cache_dir="/tmp/Endpoint_SlaveEndpointTest_UnauthorizedRequest_2_nuY1cX/fetch" --fetcher_cache_size="2GB"
--frameworks_home="" --gc_delay="1weeks" --gc_disk_headroom="0.1" --hadoop_home="" --help="false"
--hostname_lookup="true" --http_command_executor="false" --http_credentials="/tmp/Endpoint_SlaveEndpointTest_UnauthorizedRequest_2_nuY1cX/http_credentials"
--http_heartbeat_interval="30secs" --initialize_driver_logging="true" --isolation="posix/cpu,posix/mem"
--launcher="posix" --launcher_dir="/mesos/mesos-1.4.0/_build/src" --logbufsecs="0" --logging_level="INFO"
--max_completed_executors_per_framework="150" --oversubscribed_resources_interval="15secs"
--perf_duration="10secs" --perf_interval="1mins" --port="5051" --qos_correction_interval_min="0ns"
--quiet="false" --recover="reconnect" --recovery_timeout="15mins" --registration_backoff_factor="10ms"
--resources="cpus:2;gpus:0;mem:1024;disk:1024;ports:[31000-32000]" --revocable_cpu_low_priority="true"
--runtime_dir="/tmp/Endpoint_SlaveEndpointTest_UnauthorizedRequest_2_nuY1cX" --sandbox_directory="/mnt/mesos/sandbox"
--strict="true" --switch_user="true" --systemd_enable_support="true" --systemd_runtime_directory="/run/systemd/system"
--version="false" --work_dir="/tmp/Endpoint_SlaveEndpointTest_UnauthorizedRequest_2_V998fk"
I0516 22:06:53.481572 30684 credentials.hpp:86] Loading credential for authentication from
'/tmp/Endpoint_SlaveEndpointTest_UnauthorizedRequest_2_nuY1cX/credential'
I0516 22:06:53.481794 30684 slave.cpp:258] Agent using credential for: test-principal
I0516 22:06:53.481820 30684 credentials.hpp:37] Loading credentials for authentication from
'/tmp/Endpoint_SlaveEndpointTest_UnauthorizedRequest_2_nuY1cX/http_credentials'
I0516 22:06:53.482131 30684 http.cpp:975] Creating default 'basic' HTTP authenticator for
realm 'mesos-agent-readonly'
I0516 22:06:53.482321 30684 http.cpp:975] Creating default 'basic' HTTP authenticator for
realm 'mesos-agent-readwrite'
I0516 22:06:53.483537 30684 slave.cpp:529] Agent resources: cpus(*):2; mem(*):1024; disk(*):1024;
ports(*):[31000-32000]
I0516 22:06:53.483625 30684 slave.cpp:537] Agent attributes: [  ]
I0516 22:06:53.483640 30684 slave.cpp:542] Agent hostname: 35d228e236cf
I0516 22:06:53.483772 30679 status_update_manager.cpp:177] Pausing sending status updates
I0516 22:06:53.485021 30682 state.cpp:62] Recovering state from '/tmp/Endpoint_SlaveEndpointTest_UnauthorizedRequest_2_V998fk/meta'
I0516 22:06:53.485379 30673 status_update_manager.cpp:203] Recovering status update manager
I0516 22:06:53.485555 30673 containerizer.cpp:608] Recovering containerizer
I0516 22:06:53.486891 30677 provisioner.cpp:410] Provisioner recovery complete
I0516 22:06:53.487282 30683 slave.cpp:5974] Finished recovery
I0516 22:06:53.487824 30683 slave.cpp:6156] Querying resource estimator for oversubscribable
resources
I0516 22:06:53.488119 30672 slave.cpp:6170] Received oversubscribable resources {} from the
resource estimator
I0516 22:06:53.490746 30676 process.cpp:3730] Handling HTTP event for process 'slave(749)'
with path: '/slave(749)/containers'
I0516 22:06:53.491948 30672 http.cpp:1115] HTTP GET for /slave(749)/containers from 172.17.0.3:55638
I0516 22:06:53.492034 30672 http.cpp:936] Authorizing principal 'test-principal' to GET the
'/containers' endpoint
I0516 22:06:53.494216 30670 slave.cpp:794] Agent terminating
[       OK ] Endpoint/SlaveEndpointTest.UnauthorizedRequest/2 (26 ms)
[ RUN      ] Endpoint/SlaveEndpointTest.NoAuthorizer/0
I0516 22:06:53.505745 30650 containerizer.cpp:221] Using isolation: posix/cpu,posix/mem,filesystem/posix,network/cni
W0516 22:06:53.506465 30650 backend.cpp:76] Failed to create 'aufs' backend: AufsBackend requires
root privileges
W0516 22:06:53.506593 30650 backend.cpp:76] Failed to create 'bind' backend: BindBackend requires
root privileges
I0516 22:06:53.506636 30650 provisioner.cpp:249] Using default backend 'copy'
I0516 22:06:53.508558 30650 cluster.cpp:448] Creating default 'local' authorizer
I0516 22:06:53.510659 30679 slave.cpp:225] Mesos agent started on (750)@172.17.0.3:52840
I0516 22:06:53.510684 30679 slave.cpp:226] Flags at startup: --acls="" --appc_simple_discovery_uri_prefix="http://"
--appc_store_dir="/tmp/mesos/store/appc" --authenticate_http_readonly="true" --authenticate_http_readwrite="true"
--authenticatee="crammd5" --authentication_backoff_factor="1secs" --authorizer="local" --cgroups_cpu_enable_pids_and_tids_count="false"
--cgroups_enable_cfs="false" --cgroups_hierarchy="/sys/fs/cgroup" --cgroups_limit_swap="false"
--cgroups_root="mesos" --container_disk_watch_interval="15secs" --containerizers="mesos" --credential="/tmp/Endpoint_SlaveEndpointTest_NoAuthorizer_0_5i3kft/credential"
--default_role="*" --disk_watch_interval="1mins" --docker="docker" --docker_kill_orphans="true"
--docker_registry="https://registry-1.docker.io" --docker_remove_delay="6hrs" --docker_socket="/var/run/docker.sock"
--docker_stop_timeout="0ns" --docker_store_dir="/tmp/mesos/store/docker" --docker_volume_checkpoint_dir="/var/run/mesos/isolators/docker/volume"
--enforce_container_disk_quota="false" --executor_registration_timeout="1mins" --executor_shutdown_grace_period="5secs"
--fetcher_cache_dir="/tmp/Endpoint_SlaveEndpointTest_NoAuthorizer_0_5i3kft/fetch" --fetcher_cache_size="2GB"
--frameworks_home="" --gc_delay="1weeks" --gc_disk_headroom="0.1" --hadoop_home="" --help="false"
--hostname_lookup="true" --http_command_executor="false" --http_credentials="/tmp/Endpoint_SlaveEndpointTest_NoAuthorizer_0_5i3kft/http_credentials"
--http_heartbeat_interval="30secs" --initialize_driver_logging="true" --isolation="posix/cpu,posix/mem"
--launcher="posix" --launcher_dir="/mesos/mesos-1.4.0/_build/src" --logbufsecs="0" --logging_level="INFO"
--max_completed_executors_per_framework="150" --oversubscribed_resources_interval="15secs"
--perf_duration="10secs" --perf_interval="1mins" --port="5051" --qos_correction_interval_min="0ns"
--quiet="false" --recover="reconnect" --recovery_timeout="15mins" --registration_backoff_factor="10ms"
--resources="cpus:2;gpus:0;mem:1024;disk:1024;ports:[31000-32000]" --revocable_cpu_low_priority="true"
--runtime_dir="/tmp/Endpoint_SlaveEndpointTest_NoAuthorizer_0_5i3kft" --sandbox_directory="/mnt/mesos/sandbox"
--strict="true" --switch_user="true" --systemd_enable_support="true" --systemd_runtime_directory="/run/systemd/system"
--version="false" --work_dir="/tmp/Endpoint_SlaveEndpointTest_NoAuthorizer_0_xpd3dQ"
I0516 22:06:53.511028 30679 credentials.hpp:86] Loading credential for authentication from
'/tmp/Endpoint_SlaveEndpointTest_NoAuthorizer_0_5i3kft/credential'
I0516 22:06:53.511195 30679 slave.cpp:258] Agent using credential for: test-principal
I0516 22:06:53.511219 30679 credentials.hpp:37] Loading credentials for authentication from
'/tmp/Endpoint_SlaveEndpointTest_NoAuthorizer_0_5i3kft/http_credentials'
I0516 22:06:53.511466 30679 http.cpp:975] Creating default 'basic' HTTP authenticator for
realm 'mesos-agent-readonly'
I0516 22:06:53.511633 30679 http.cpp:975] Creating default 'basic' HTTP authenticator for
realm 'mesos-agent-readwrite'
I0516 22:06:53.512835 30679 slave.cpp:529] Agent resources: cpus(*):2; mem(*):1024; disk(*):1024;
ports(*):[31000-32000]
I0516 22:06:53.512909 30679 slave.cpp:537] Agent attributes: [  ]
I0516 22:06:53.512928 30679 slave.cpp:542] Agent hostname: 35d228e236cf
I0516 22:06:53.513072 30672 status_update_manager.cpp:177] Pausing sending status updates
I0516 22:06:53.514487 30680 state.cpp:62] Recovering state from '/tmp/Endpoint_SlaveEndpointTest_NoAuthorizer_0_xpd3dQ/meta'
I0516 22:06:53.514825 30677 status_update_manager.cpp:203] Recovering status update manager
I0516 22:06:53.515002 30676 containerizer.cpp:608] Recovering containerizer
I0516 22:06:53.516389 30670 provisioner.cpp:410] Provisioner recovery complete
I0516 22:06:53.516790 30678 slave.cpp:5974] Finished recovery
I0516 22:06:53.517375 30678 slave.cpp:6156] Querying resource estimator for oversubscribable
resources
I0516 22:06:53.517627 30680 slave.cpp:6170] Received oversubscribable resources {} from the
resource estimator
I0516 22:06:53.520144 30679 process.cpp:3730] Handling HTTP event for process 'slave(750)'
with path: '/slave(750)/monitor/statistics'
I0516 22:06:53.521396 30679 http.cpp:1115] HTTP GET for /slave(750)/monitor/statistics from
172.17.0.3:55640
I0516 22:06:53.521482 30679 http.cpp:936] Authorizing principal 'test-principal' to GET the
'/monitor/statistics' endpoint
I0516 22:06:53.524605 30683 slave.cpp:794] Agent terminating
[       OK ] Endpoint/SlaveEndpointTest.NoAuthorizer/0 (30 ms)
[ RUN      ] Endpoint/SlaveEndpointTest.NoAuthorizer/1
I0516 22:06:53.536237 30650 containerizer.cpp:221] Using isolation: posix/cpu,posix/mem,filesystem/posix,network/cni
W0516 22:06:53.536947 30650 backend.cpp:76] Failed to create 'aufs' backend: AufsBackend requires
root privileges
W0516 22:06:53.537075 30650 backend.cpp:76] Failed to create 'bind' backend: BindBackend requires
root privileges
I0516 22:06:53.537119 30650 provisioner.cpp:249] Using default backend 'copy'
I0516 22:06:53.538904 30650 cluster.cpp:448] Creating default 'local' authorizer
I0516 22:06:53.540879 30678 slave.cpp:225] Mesos agent started on (751)@172.17.0.3:52840
I0516 22:06:53.540901 30678 slave.cpp:226] Flags at startup: --acls="" --appc_simple_discovery_uri_prefix="http://"
--appc_store_dir="/tmp/mesos/store/appc" --authenticate_http_readonly="true" --authenticate_http_readwrite="true"
--authenticatee="crammd5" --authentication_backoff_factor="1secs" --authorizer="local" --cgroups_cpu_enable_pids_and_tids_count="false"
--cgroups_enable_cfs="false" --cgroups_hierarchy="/sys/fs/cgroup" --cgroups_limit_swap="false"
--cgroups_root="mesos" --container_disk_watch_interval="15secs" --containerizers="mesos" --credential="/tmp/Endpoint_SlaveEndpointTest_NoAuthorizer_1_5EJgBZ/credential"
--default_role="*" --disk_watch_interval="1mins" --docker="docker" --docker_kill_orphans="true"
--docker_registry="https://registry-1.docker.io" --docker_remove_delay="6hrs" --docker_socket="/var/run/docker.sock"
--docker_stop_timeout="0ns" --docker_store_dir="/tmp/mesos/store/docker" --docker_volume_checkpoint_dir="/var/run/mesos/isolators/docker/volume"
--enforce_container_disk_quota="false" --executor_registration_timeout="1mins" --executor_shutdown_grace_period="5secs"
--fetcher_cache_dir="/tmp/Endpoint_SlaveEndpointTest_NoAuthorizer_1_5EJgBZ/fetch" --fetcher_cache_size="2GB"
--frameworks_home="" --gc_delay="1weeks" --gc_disk_headroom="0.1" --hadoop_home="" --help="false"
--hostname_lookup="true" --http_command_executor="false" --http_credentials="/tmp/Endpoint_SlaveEndpointTest_NoAuthorizer_1_5EJgBZ/http_credentials"
--http_heartbeat_interval="30secs" --initialize_driver_logging="true" --isolation="posix/cpu,posix/mem"
--launcher="posix" --launcher_dir="/mesos/mesos-1.4.0/_build/src" --logbufsecs="0" --logging_level="INFO"
--max_completed_executors_per_framework="150" --oversubscribed_resources_interval="15secs"
--perf_duration="10secs" --perf_interval="1mins" --port="5051" --qos_correction_interval_min="0ns"
--quiet="false" --recover="reconnect" --recovery_timeout="15mins" --registration_backoff_factor="10ms"
--resources="cpus:2;gpus:0;mem:1024;disk:1024;ports:[31000-32000]" --revocable_cpu_low_priority="true"
--runtime_dir="/tmp/Endpoint_SlaveEndpointTest_NoAuthorizer_1_5EJgBZ" --sandbox_directory="/mnt/mesos/sandbox"
--strict="true" --switch_user="true" --systemd_enable_support="true" --systemd_runtime_directory="/run/systemd/system"
--version="false" --work_dir="/tmp/Endpoint_SlaveEndpointTest_NoAuthorizer_1_ToH2um"
I0516 22:06:53.541267 30678 credentials.hpp:86] Loading credential for authentication from
'/tmp/Endpoint_SlaveEndpointTest_NoAuthorizer_1_5EJgBZ/credential'
I0516 22:06:53.541436 30678 slave.cpp:258] Agent using credential for: test-principal
I0516 22:06:53.541465 30678 credentials.hpp:37] Loading credentials for authentication from
'/tmp/Endpoint_SlaveEndpointTest_NoAuthorizer_1_5EJgBZ/http_credentials'
I0516 22:06:53.541729 30678 http.cpp:975] Creating default 'basic' HTTP authenticator for
realm 'mesos-agent-readonly'
I0516 22:06:53.541889 30678 http.cpp:975] Creating default 'basic' HTTP authenticator for
realm 'mesos-agent-readwrite'
I0516 22:06:53.543104 30678 slave.cpp:529] Agent resources: cpus(*):2; mem(*):1024; disk(*):1024;
ports(*):[31000-32000]
I0516 22:06:53.543176 30678 slave.cpp:537] Agent attributes: [  ]
I0516 22:06:53.543189 30678 slave.cpp:542] Agent hostname: 35d228e236cf
I0516 22:06:53.543339 30680 status_update_manager.cpp:177] Pausing sending status updates
I0516 22:06:53.544589 30683 state.cpp:62] Recovering state from '/tmp/Endpoint_SlaveEndpointTest_NoAuthorizer_1_ToH2um/meta'
I0516 22:06:53.544950 30684 status_update_manager.cpp:203] Recovering status update manager
I0516 22:06:53.545137 30678 containerizer.cpp:608] Recovering containerizer
I0516 22:06:53.546484 30669 provisioner.cpp:410] Provisioner recovery complete
I0516 22:06:53.546805 30671 slave.cpp:5974] Finished recovery
I0516 22:06:53.547324 30671 slave.cpp:6156] Querying resource estimator for oversubscribable
resources
I0516 22:06:53.547597 30673 slave.cpp:6170] Received oversubscribable resources {} from the
resource estimator
I0516 22:06:53.550168 30684 process.cpp:3730] Handling HTTP event for process 'slave(751)'
with path: '/slave(751)/monitor/statistics.json'
I0516 22:06:53.551391 30680 http.cpp:1115] HTTP GET for /slave(751)/monitor/statistics.json
from 172.17.0.3:55641
I0516 22:06:53.551471 30680 http.cpp:936] Authorizing principal 'test-principal' to GET the
'/monitor/statistics.json' endpoint
I0516 22:06:53.554587 30672 slave.cpp:794] Agent terminating
[       OK ] Endpoint/SlaveEndpointTest.NoAuthorizer/1 (29 ms)
[ RUN      ] Endpoint/SlaveEndpointTest.NoAuthorizer/2
I0516 22:06:53.566373 30650 containerizer.cpp:221] Using isolation: posix/cpu,posix/mem,filesystem/posix,network/cni
W0516 22:06:53.567076 30650 backend.cpp:76] Failed to create 'aufs' backend: AufsBackend requires
root privileges
W0516 22:06:53.567193 30650 backend.cpp:76] Failed to create 'bind' backend: BindBackend requires
root privileges
I0516 22:06:53.567234 30650 provisioner.cpp:249] Using default backend 'copy'
I0516 22:06:53.569144 30650 cluster.cpp:448] Creating default 'local' authorizer
I0516 22:06:53.571118 30676 slave.cpp:225] Mesos agent started on (752)@172.17.0.3:52840
I0516 22:06:53.571143 30676 slave.cpp:226] Flags at startup: --acls="" --appc_simple_discovery_uri_prefix="http://"
--appc_store_dir="/tmp/mesos/store/appc" --authenticate_http_readonly="true" --authenticate_http_readwrite="true"
--authenticatee="crammd5" --authentication_backoff_factor="1secs" --authorizer="local" --cgroups_cpu_enable_pids_and_tids_count="false"
--cgroups_enable_cfs="false" --cgroups_hierarchy="/sys/fs/cgroup" --cgroups_limit_swap="false"
--cgroups_root="mesos" --container_disk_watch_interval="15secs" --containerizers="mesos" --credential="/tmp/Endpoint_SlaveEndpointTest_NoAuthorizer_2_fMWGgw/credential"
--default_role="*" --disk_watch_interval="1mins" --docker="docker" --docker_kill_orphans="true"
--docker_registry="https://registry-1.docker.io" --docker_remove_delay="6hrs" --docker_socket="/var/run/docker.sock"
--docker_stop_timeout="0ns" --docker_store_dir="/tmp/mesos/store/docker" --docker_volume_checkpoint_dir="/var/run/mesos/isolators/docker/volume"
--enforce_container_disk_quota="false" --executor_registration_timeout="1mins" --executor_shutdown_grace_period="5secs"
--fetcher_cache_dir="/tmp/Endpoint_SlaveEndpointTest_NoAuthorizer_2_fMWGgw/fetch" --fetcher_cache_size="2GB"
--frameworks_home="" --gc_delay="1weeks" --gc_disk_headroom="0.1" --hadoop_home="" --help="false"
--hostname_lookup="true" --http_command_executor="false" --http_credentials="/tmp/Endpoint_SlaveEndpointTest_NoAuthorizer_2_fMWGgw/http_credentials"
--http_heartbeat_interval="30secs" --initialize_driver_logging="true" --isolation="posix/cpu,posix/mem"
--launcher="posix" --launcher_dir="/mesos/mesos-1.4.0/_build/src" --logbufsecs="0" --logging_level="INFO"
--max_completed_executors_per_framework="150" --oversubscribed_resources_interval="15secs"
--perf_duration="10secs" --perf_interval="1mins" --port="5051" --qos_correction_interval_min="0ns"
--quiet="false" --recover="reconnect" --recovery_timeout="15mins" --registration_backoff_factor="10ms"
--resources="cpus:2;gpus:0;mem:1024;disk:1024;ports:[31000-32000]" --revocable_cpu_low_priority="true"
--runtime_dir="/tmp/Endpoint_SlaveEndpointTest_NoAuthorizer_2_fMWGgw" --sandbox_directory="/mnt/mesos/sandbox"
--strict="true" --switch_user="true" --systemd_enable_support="true" --systemd_runtime_directory="/run/systemd/system"
--version="false" --work_dir="/tmp/Endpoint_SlaveEndpointTest_NoAuthorizer_2_nKFA5S"
I0516 22:06:53.571552 30676 credentials.hpp:86] Loading credential for authentication from
'/tmp/Endpoint_SlaveEndpointTest_NoAuthorizer_2_fMWGgw/credential'
I0516 22:06:53.571758 30676 slave.cpp:258] Agent using credential for: test-principal
I0516 22:06:53.571779 30676 credentials.hpp:37] Loading credentials for authentication from
'/tmp/Endpoint_SlaveEndpointTest_NoAuthorizer_2_fMWGgw/http_credentials'
I0516 22:06:53.571997 30676 http.cpp:975] Creating default 'basic' HTTP authenticator for
realm 'mesos-agent-readonly'
I0516 22:06:53.572156 30676 http.cpp:975] Creating default 'basic' HTTP authenticator for
realm 'mesos-agent-readwrite'
I0516 22:06:53.573420 30676 slave.cpp:529] Agent resources: cpus(*):2; mem(*):1024; disk(*):1024;
ports(*):[31000-32000]
I0516 22:06:53.573489 30676 slave.cpp:537] Agent attributes: [  ]
I0516 22:06:53.573506 30676 slave.cpp:542] Agent hostname: 35d228e236cf
I0516 22:06:53.573675 30671 status_update_manager.cpp:177] Pausing sending status updates
I0516 22:06:53.575054 30675 state.cpp:62] Recovering state from '/tmp/Endpoint_SlaveEndpointTest_NoAuthorizer_2_nKFA5S/meta'
I0516 22:06:53.575371 30674 status_update_manager.cpp:203] Recovering status update manager
I0516 22:06:53.575546 30676 containerizer.cpp:608] Recovering containerizer
I0516 22:06:53.576912 30681 provisioner.cpp:410] Provisioner recovery complete
I0516 22:06:53.577297 30673 slave.cpp:5974] Finished recovery
I0516 22:06:53.577852 30673 slave.cpp:6156] Querying resource estimator for oversubscribable
resources
I0516 22:06:53.578115 30677 slave.cpp:6170] Received oversubscribable resources {} from the
resource estimator
I0516 22:06:53.580776 30671 process.cpp:3730] Handling HTTP event for process 'slave(752)'
with path: '/slave(752)/containers'
I0516 22:06:53.582120 30678 http.cpp:1115] HTTP GET for /slave(752)/containers from 172.17.0.3:55642
I0516 22:06:53.582216 30678 http.cpp:936] Authorizing principal 'test-principal' to GET the
'/containers' endpoint
I0516 22:06:53.585507 30679 slave.cpp:794] Agent terminating
[       OK ] Endpoint/SlaveEndpointTest.NoAuthorizer/2 (29 ms)
[----------] 9 tests from Endpoint/SlaveEndpointTest (255 ms total)

[----------] Global test environment tear-down
[==========] 1575 tests from 175 test cases ran. (473518 ms total)
[  PASSED  ] 1574 tests.
[  FAILED  ] 1 test, listed below:
[  FAILED  ] SlaveTest.HTTPSchedulerSlaveRestart

 1 FAILED TEST
  YOU HAVE 22 DISABLED TESTS

E0516 22:06:53.643401 30685 process.cpp:950] Failed to accept socket: future discarded
make[4]: *** [check-local] Error 1
make[4]: Leaving directory `/mesos/mesos-1.4.0/_build/src'
make[3]: *** [check-am] Error 2
make[3]: Leaving directory `/mesos/mesos-1.4.0/_build/src'
make[2]: *** [check] Error 2
make[2]: Leaving directory `/mesos/mesos-1.4.0/_build/src'
make[1]: *** [check-recursive] Error 1
make[1]: Leaving directory `/mesos/mesos-1.4.0/_build'
make: *** [distcheck] Error 1
+ docker rmi mesos-1494969398-4963
Untagged: mesos-1494969398-4963:latest
Deleted: sha256:75344de97cdcb25498ed5d569fd575497a750f9b96dae36a5f86bdfb0bee7edc
Deleted: sha256:2d9362d0309ef51523e9016d872957c41a7a207aef1941a345d4bcd5fa3eb6ba
Deleted: sha256:fdcad18faff22681841ea160f924b8916cbd25d30cd5a6efca50b92f92325a6d
Deleted: sha256:add18b77cb70facca726cb2925cdada913f95ab2cd6904ee24c9bbbfa3c74b88
Deleted: sha256:26b843471b2bd790ea19c461def9d7a4c7064d06058ca63b5855273309741090
Deleted: sha256:9e8eb9580d79ce05ec41673e9df377e2b9e730d5b87d2cb46aa30e8517e50280
Deleted: sha256:8fa60ea5e5c7fe97b5cc1eeb0a70c76819fb27973248f8526a5e0acfe26d33a0
Deleted: sha256:ab8010b823c84c135f6180f33a92ac53167e31fa598cb553eca99aab3796818d
Deleted: sha256:05e91463fe4abd1eaaa748dfcd1227eaa9aa605d6bcf41d3535dd4ef9a51d0c6
Deleted: sha256:21fbb40984b5d8e166ca73668b859677deabe0678ba7f26b198a47a6a063571d
Deleted: sha256:58c058696177ca7a80034d9af8c05de8f4987403a8a3b2fc158ada436bea362b
Deleted: sha256:53552716bac2b71242e2a602e75f2ae9cbb859d52c90c14ffd63619be405cbcc
Deleted: sha256:e605f5b9e1185321570e80cf8069af57ebd8deefb9ac7fb619cdd033d59b54f1
Deleted: sha256:13d7e2c52f25dbe76bbc465cbdfb581b4ee8b63baa9f483fa752b1322921953a
Deleted: sha256:e027d133f02a30a587bae82f0534c17583bbe33395b3687774d70a1f6aad2c46
Deleted: sha256:e779a61e9fc803c238940fd35e40de515c71276c4645abe1f5d627fefab88bc2
Deleted: sha256:9a5d2a06ff21c12af50ad59498cd2378376aa5e79a812789b01b7563821954e0
Deleted: sha256:c181671871119845bb905148296a56b91066def9291c3977f1114f00e5a5b372
Deleted: sha256:9bbde16dd8738327e6eb71bf78e26401044c0008e71db1fa0b12a1d0933f1357
Deleted: sha256:7873166939d0bb2a97fb66022942777e1f54eb4abd0a8d2d5bf2f4aa50cd5d88
Deleted: sha256:ebbcb5aa8062818f92e5fb55c811d6e71a0fc5b9784c8f73e42229a44fcf7309
Deleted: sha256:2ef4da43ab7228de1e9305fd2bbdf00112b51eabeaf0f94a4bceb2764cd65c3e
Deleted: sha256:4622117946233c4094da167369f71931c555926f9cb81b86a5095aa9ed6899f0
Deleted: sha256:780b8da8db0463f9c2e6c0e26c24c195c129d293d492edec06167fded1eee7c4
Build step 'Execute shell' marked build as failure
Not sending mail to unregistered user neil.conway@gmail.com

Mime
View raw message