mesos-builds mailing list archives

Site index · List index
Message view « Date » · « Thread »
Top « Date » · « Thread »
From Apache Jenkins Server <jenk...@builds.apache.org>
Subject Build failed in Jenkins: Mesos-Buildbot » cmake,gcc,--verbose --enable-libevent --enable-ssl,GLOG_v=1 MESOS_VERBOSE=1,centos:7,(docker||Hadoop)&&(!ubuntu-us1)&&(!ubuntu-eu2) #3738
Date Sat, 27 May 2017 13:15:50 GMT
See <https://builds.apache.org/job/Mesos-Buildbot/BUILDTOOL=cmake,COMPILER=gcc,CONFIGURATION=--verbose%20--enable-libevent%20--enable-ssl,ENVIRONMENT=GLOG_v=1%20MESOS_VERBOSE=1,OS=centos%3A7,label_exp=(docker%7C%7CHadoop)&&(!ubuntu-us1)&&(!ubuntu-eu2)/3738/display/redirect?page=changes>

Changes:

[neil.conway] Made MasterTest.MaxCompletedTasksPerFrameworkFlag less fragile.

------------------------------------------
[...truncated 27.06 MB...]
I0527 13:15:44.467418  6609 process.cpp:3730] Handling HTTP event for process 'slave(751)'
with path: '/slave(751)/containers'
I0527 13:15:44.468091  6610 http.cpp:1115] HTTP GET for /slave(751)/containers from 172.17.0.3:38564
I0527 13:15:44.468145  6610 http.cpp:936] Authorizing principal 'test-principal' to GET the
'/containers' endpoint
I0527 13:15:44.469786  6609 slave.cpp:801] Agent terminating
[       OK ] Endpoint/SlaveEndpointTest.AuthorizedRequest/2 (21 ms)
[ RUN      ] Endpoint/SlaveEndpointTest.UnauthorizedRequest/0
I0527 13:15:44.481854  1088 containerizer.cpp:230] Using isolation: posix/cpu,posix/mem,filesystem/posix,network/cni,environment_secret
W0527 13:15:44.482180  1088 backend.cpp:76] Failed to create 'aufs' backend: AufsBackend requires
root privileges
W0527 13:15:44.482303  1088 backend.cpp:76] Failed to create 'bind' backend: BindBackend requires
root privileges
I0527 13:15:44.482445  1088 provisioner.cpp:255] Using default backend 'copy'
I0527 13:15:44.483923  6608 slave.cpp:232] Mesos agent started on (752)@172.17.0.3:52656
I0527 13:15:44.483938  6608 slave.cpp:233] Flags at startup: --acls="" --appc_simple_discovery_uri_prefix="http://"
--appc_store_dir="/tmp/mesos/store/appc" --authenticate_http_executors="true" --authenticate_http_readonly="true"
--authenticate_http_readwrite="true" --authenticatee="crammd5" --authentication_backoff_factor="1secs"
--authorizer="local" --cgroups_cpu_enable_pids_and_tids_count="false" --cgroups_enable_cfs="false"
--cgroups_hierarchy="/sys/fs/cgroup" --cgroups_limit_swap="false" --cgroups_root="mesos" --container_disk_watch_interval="15secs"
--containerizers="mesos" --credential="/tmp/Endpoint_SlaveEndpointTest_UnauthorizedRequest_0_dX3sTO/credential"
--default_role="*" --disk_watch_interval="1mins" --docker="docker" --docker_kill_orphans="true"
--docker_registry="https://registry-1.docker.io" --docker_remove_delay="6hrs" --docker_socket="/var/run/docker.sock"
--docker_stop_timeout="0ns" --docker_store_dir="/tmp/mesos/store/docker" --docker_volume_checkpoint_dir="/var/run/mesos/isolators/docker/volume"
--enforce_container_disk_quota="false" --executor_registration_timeout="1mins" --executor_reregistration_timeout="2secs"
--executor_secret_key="/tmp/Endpoint_SlaveEndpointTest_UnauthorizedRequest_0_dX3sTO/executor_secret_key"
--executor_shutdown_grace_period="5secs" --fetcher_cache_dir="/tmp/Endpoint_SlaveEndpointTest_UnauthorizedRequest_0_dX3sTO/fetch"
--fetcher_cache_size="2GB" --frameworks_home="" --gc_delay="1weeks" --gc_disk_headroom="0.1"
--hadoop_home="" --help="false" --hostname_lookup="true" --http_command_executor="false" --http_credentials="/tmp/Endpoint_SlaveEndpointTest_UnauthorizedRequest_0_dX3sTO/http_credentials"
--http_heartbeat_interval="30secs" --initialize_driver_logging="true" --isolation="posix/cpu,posix/mem"
--launcher="posix" --launcher_dir="/mesos/build/src" --logbufsecs="0" --logging_level="INFO"
--max_completed_executors_per_framework="150" --oversubscribed_resources_interval="15secs"
--perf_duration="10secs" --perf_interval="1mins" --port="5051" --qos_correction_interval_min="0ns"
--quiet="false" --recover="reconnect" --recovery_timeout="15mins" --registration_backoff_factor="10ms"
--resources="cpus:2;gpus:0;mem:1024;disk:1024;ports:[31000-32000]" --revocable_cpu_low_priority="true"
--runtime_dir="/tmp/Endpoint_SlaveEndpointTest_UnauthorizedRequest_0_dX3sTO" --sandbox_directory="/mnt/mesos/sandbox"
--strict="true" --switch_user="true" --systemd_enable_support="true" --systemd_runtime_directory="/run/systemd/system"
--version="false" --work_dir="/tmp/Endpoint_SlaveEndpointTest_UnauthorizedRequest_0_4U2AOm"
I0527 13:15:44.484205  6608 credentials.hpp:86] Loading credential for authentication from
'/tmp/Endpoint_SlaveEndpointTest_UnauthorizedRequest_0_dX3sTO/credential'
I0527 13:15:44.484319  6608 slave.cpp:265] Agent using credential for: test-principal
I0527 13:15:44.484406  6608 credentials.hpp:37] Loading credentials for authentication from
'/tmp/Endpoint_SlaveEndpointTest_UnauthorizedRequest_0_dX3sTO/http_credentials'
I0527 13:15:44.484596  6608 http.cpp:975] Creating default 'basic' HTTP authenticator for
realm 'mesos-agent-executor'
I0527 13:15:44.484643  6608 http.cpp:996] Creating default 'jwt' HTTP authenticator for realm
'mesos-agent-executor'
I0527 13:15:44.484930  6608 http.cpp:975] Creating default 'basic' HTTP authenticator for
realm 'mesos-agent-readonly'
I0527 13:15:44.484998  6608 http.cpp:996] Creating default 'jwt' HTTP authenticator for realm
'mesos-agent-readonly'
I0527 13:15:44.485091  6608 http.cpp:975] Creating default 'basic' HTTP authenticator for
realm 'mesos-agent-readwrite'
I0527 13:15:44.485260  6608 http.cpp:996] Creating default 'jwt' HTTP authenticator for realm
'mesos-agent-readwrite'
I0527 13:15:44.485842  6608 slave.cpp:536] Agent resources: cpus(*):2; mem(*):1024; disk(*):1024;
ports(*):[31000-32000]
I0527 13:15:44.485880  6608 slave.cpp:544] Agent attributes: [  ]
I0527 13:15:44.485888  6608 slave.cpp:549] Agent hostname: 92c0c5fbf3b1
I0527 13:15:44.486237  6618 status_update_manager.cpp:177] Pausing sending status updates
I0527 13:15:44.486678  6608 state.cpp:62] Recovering state from '/tmp/Endpoint_SlaveEndpointTest_UnauthorizedRequest_0_4U2AOm/meta'
I0527 13:15:44.487133  6606 status_update_manager.cpp:203] Recovering status update manager
I0527 13:15:44.487205  6606 containerizer.cpp:582] Recovering containerizer
I0527 13:15:44.487771  6616 provisioner.cpp:416] Provisioner recovery complete
I0527 13:15:44.488019  6616 slave.cpp:6083] Finished recovery
I0527 13:15:44.488632  6616 slave.cpp:6265] Querying resource estimator for oversubscribable
resources
I0527 13:15:44.488971  6616 slave.cpp:6279] Received oversubscribable resources {} from the
resource estimator
I0527 13:15:44.489909  6605 process.cpp:3730] Handling HTTP event for process 'slave(752)'
with path: '/slave(752)/monitor/statistics'
I0527 13:15:44.490345  6605 http.cpp:1115] HTTP GET for /slave(752)/monitor/statistics from
172.17.0.3:38565
I0527 13:15:44.490388  6605 http.cpp:936] Authorizing principal 'test-principal' to GET the
'/monitor/statistics' endpoint
I0527 13:15:44.491683  1088 slave.cpp:801] Agent terminating
[       OK ] Endpoint/SlaveEndpointTest.UnauthorizedRequest/0 (15 ms)
[ RUN      ] Endpoint/SlaveEndpointTest.UnauthorizedRequest/1
I0527 13:15:44.497702  1088 containerizer.cpp:230] Using isolation: posix/cpu,posix/mem,filesystem/posix,network/cni,environment_secret
W0527 13:15:44.498576  1088 backend.cpp:76] Failed to create 'aufs' backend: AufsBackend requires
root privileges
W0527 13:15:44.498632  1088 backend.cpp:76] Failed to create 'bind' backend: BindBackend requires
root privileges
I0527 13:15:44.498759  1088 provisioner.cpp:255] Using default backend 'copy'
I0527 13:15:44.500463  6611 slave.cpp:232] Mesos agent started on (753)@172.17.0.3:52656
I0527 13:15:44.500484  6611 slave.cpp:233] Flags at startup: --acls="" --appc_simple_discovery_uri_prefix="http://"
--appc_store_dir="/tmp/mesos/store/appc" --authenticate_http_executors="true" --authenticate_http_readonly="true"
--authenticate_http_readwrite="true" --authenticatee="crammd5" --authentication_backoff_factor="1secs"
--authorizer="local" --cgroups_cpu_enable_pids_and_tids_count="false" --cgroups_enable_cfs="false"
--cgroups_hierarchy="/sys/fs/cgroup" --cgroups_limit_swap="false" --cgroups_root="mesos" --container_disk_watch_interval="15secs"
--containerizers="mesos" --credential="/tmp/Endpoint_SlaveEndpointTest_UnauthorizedRequest_1_HVYClD/credential"
--default_role="*" --disk_watch_interval="1mins" --docker="docker" --docker_kill_orphans="true"
--docker_registry="https://registry-1.docker.io" --docker_remove_delay="6hrs" --docker_socket="/var/run/docker.sock"
--docker_stop_timeout="0ns" --docker_store_dir="/tmp/mesos/store/docker" --docker_volume_checkpoint_dir="/var/run/mesos/isolators/docker/volume"
--enforce_container_disk_quota="false" --executor_registration_timeout="1mins" --executor_reregistration_timeout="2secs"
--executor_secret_key="/tmp/Endpoint_SlaveEndpointTest_UnauthorizedRequest_1_HVYClD/executor_secret_key"
--executor_shutdown_grace_period="5secs" --fetcher_cache_dir="/tmp/Endpoint_SlaveEndpointTest_UnauthorizedRequest_1_HVYClD/fetch"
--fetcher_cache_size="2GB" --frameworks_home="" --gc_delay="1weeks" --gc_disk_headroom="0.1"
--hadoop_home="" --help="false" --hostname_lookup="true" --http_command_executor="false" --http_credentials="/tmp/Endpoint_SlaveEndpointTest_UnauthorizedRequest_1_HVYClD/http_credentials"
--http_heartbeat_interval="30secs" --initialize_driver_logging="true" --isolation="posix/cpu,posix/mem"
--launcher="posix" --launcher_dir="/mesos/build/src" --logbufsecs="0" --logging_level="INFO"
--max_completed_executors_per_framework="150" --oversubscribed_resources_interval="15secs"
--perf_duration="10secs" --perf_interval="1mins" --port="5051" --qos_correction_interval_min="0ns"
--quiet="false" --recover="reconnect" --recovery_timeout="15mins" --registration_backoff_factor="10ms"
--resources="cpus:2;gpus:0;mem:1024;disk:1024;ports:[31000-32000]" --revocable_cpu_low_priority="true"
--runtime_dir="/tmp/Endpoint_SlaveEndpointTest_UnauthorizedRequest_1_HVYClD" --sandbox_directory="/mnt/mesos/sandbox"
--strict="true" --switch_user="true" --systemd_enable_support="true" --systemd_runtime_directory="/run/systemd/system"
--version="false" --work_dir="/tmp/Endpoint_SlaveEndpointTest_UnauthorizedRequest_1_v6Rdeb"
I0527 13:15:44.500674  6611 credentials.hpp:86] Loading credential for authentication from
'/tmp/Endpoint_SlaveEndpointTest_UnauthorizedRequest_1_HVYClD/credential'
I0527 13:15:44.500780  6611 slave.cpp:265] Agent using credential for: test-principal
I0527 13:15:44.500792  6611 credentials.hpp:37] Loading credentials for authentication from
'/tmp/Endpoint_SlaveEndpointTest_UnauthorizedRequest_1_HVYClD/http_credentials'
I0527 13:15:44.500916  6611 http.cpp:975] Creating default 'basic' HTTP authenticator for
realm 'mesos-agent-executor'
I0527 13:15:44.500957  6611 http.cpp:996] Creating default 'jwt' HTTP authenticator for realm
'mesos-agent-executor'
I0527 13:15:44.501025  6611 http.cpp:975] Creating default 'basic' HTTP authenticator for
realm 'mesos-agent-readonly'
I0527 13:15:44.501060  6611 http.cpp:996] Creating default 'jwt' HTTP authenticator for realm
'mesos-agent-readonly'
I0527 13:15:44.501149  6611 http.cpp:975] Creating default 'basic' HTTP authenticator for
realm 'mesos-agent-readwrite'
I0527 13:15:44.501245  6611 http.cpp:996] Creating default 'jwt' HTTP authenticator for realm
'mesos-agent-readwrite'
I0527 13:15:44.501667  6611 slave.cpp:536] Agent resources: cpus(*):2; mem(*):1024; disk(*):1024;
ports(*):[31000-32000]
I0527 13:15:44.501696  6611 slave.cpp:544] Agent attributes: [  ]
I0527 13:15:44.501701  6611 slave.cpp:549] Agent hostname: 92c0c5fbf3b1
I0527 13:15:44.501803  6615 status_update_manager.cpp:177] Pausing sending status updates
I0527 13:15:44.502241  6619 state.cpp:62] Recovering state from '/tmp/Endpoint_SlaveEndpointTest_UnauthorizedRequest_1_v6Rdeb/meta'
I0527 13:15:44.502395  6619 status_update_manager.cpp:203] Recovering status update manager
I0527 13:15:44.502532  6617 containerizer.cpp:582] Recovering containerizer
I0527 13:15:44.503104  6618 provisioner.cpp:416] Provisioner recovery complete
I0527 13:15:44.503232  6618 slave.cpp:6083] Finished recovery
I0527 13:15:44.503621  6618 slave.cpp:6265] Querying resource estimator for oversubscribable
resources
I0527 13:15:44.503773  6618 slave.cpp:6279] Received oversubscribable resources {} from the
resource estimator
I0527 13:15:44.504643  6618 process.cpp:3730] Handling HTTP event for process 'slave(753)'
with path: '/slave(753)/monitor/statistics.json'
I0527 13:15:44.505256  6615 http.cpp:1115] HTTP GET for /slave(753)/monitor/statistics.json
from 172.17.0.3:38566
I0527 13:15:44.505376  6615 http.cpp:936] Authorizing principal 'test-principal' to GET the
'/monitor/statistics.json' endpoint
I0527 13:15:44.506536  6620 slave.cpp:801] Agent terminating
[       OK ] Endpoint/SlaveEndpointTest.UnauthorizedRequest/1 (19 ms)
[ RUN      ] Endpoint/SlaveEndpointTest.UnauthorizedRequest/2
I0527 13:15:44.517364  1088 containerizer.cpp:230] Using isolation: posix/cpu,posix/mem,filesystem/posix,network/cni,environment_secret
W0527 13:15:44.517741  1088 backend.cpp:76] Failed to create 'aufs' backend: AufsBackend requires
root privileges
W0527 13:15:44.517788  1088 backend.cpp:76] Failed to create 'bind' backend: BindBackend requires
root privileges
I0527 13:15:44.517809  1088 provisioner.cpp:255] Using default backend 'copy'
I0527 13:15:44.519032  6613 slave.cpp:232] Mesos agent started on (754)@172.17.0.3:52656
I0527 13:15:44.519177  6613 slave.cpp:233] Flags at startup: --acls="" --appc_simple_discovery_uri_prefix="http://"
--appc_store_dir="/tmp/mesos/store/appc" --authenticate_http_executors="true" --authenticate_http_readonly="true"
--authenticate_http_readwrite="true" --authenticatee="crammd5" --authentication_backoff_factor="1secs"
--authorizer="local" --cgroups_cpu_enable_pids_and_tids_count="false" --cgroups_enable_cfs="false"
--cgroups_hierarchy="/sys/fs/cgroup" --cgroups_limit_swap="false" --cgroups_root="mesos" --container_disk_watch_interval="15secs"
--containerizers="mesos" --credential="/tmp/Endpoint_SlaveEndpointTest_UnauthorizedRequest_2_gSUGZr/credential"
--default_role="*" --disk_watch_interval="1mins" --docker="docker" --docker_kill_orphans="true"
--docker_registry="https://registry-1.docker.io" --docker_remove_delay="6hrs" --docker_socket="/var/run/docker.sock"
--docker_stop_timeout="0ns" --docker_store_dir="/tmp/mesos/store/docker" --docker_volume_checkpoint_dir="/var/run/mesos/isolators/docker/volume"
--enforce_container_disk_quota="false" --executor_registration_timeout="1mins" --executor_reregistration_timeout="2secs"
--executor_secret_key="/tmp/Endpoint_SlaveEndpointTest_UnauthorizedRequest_2_gSUGZr/executor_secret_key"
--executor_shutdown_grace_period="5secs" --fetcher_cache_dir="/tmp/Endpoint_SlaveEndpointTest_UnauthorizedRequest_2_gSUGZr/fetch"
--fetcher_cache_size="2GB" --frameworks_home="" --gc_delay="1weeks" --gc_disk_headroom="0.1"
--hadoop_home="" --help="false" --hostname_lookup="true" --http_command_executor="false" --http_credentials="/tmp/Endpoint_SlaveEndpointTest_UnauthorizedRequest_2_gSUGZr/http_credentials"
--http_heartbeat_interval="30secs" --initialize_driver_logging="true" --isolation="posix/cpu,posix/mem"
--launcher="posix" --launcher_dir="/mesos/build/src" --logbufsecs="0" --logging_level="INFO"
--max_completed_executors_per_framework="150" --oversubscribed_resources_interval="15secs"
--perf_duration="10secs" --perf_interval="1mins" --port="5051" --qos_correction_interval_min="0ns"
--quiet="false" --recover="reconnect" --recovery_timeout="15mins" --registration_backoff_factor="10ms"
--resources="cpus:2;gpus:0;mem:1024;disk:1024;ports:[31000-32000]" --revocable_cpu_low_priority="true"
--runtime_dir="/tmp/Endpoint_SlaveEndpointTest_UnauthorizedRequest_2_gSUGZr" --sandbox_directory="/mnt/mesos/sandbox"
--strict="true" --switch_user="true" --systemd_enable_support="true" --systemd_runtime_directory="/run/systemd/system"
--version="false" --work_dir="/tmp/Endpoint_SlaveEndpointTest_UnauthorizedRequest_2_tkM7OZ"
I0527 13:15:44.519426  6613 credentials.hpp:86] Loading credential for authentication from
'/tmp/Endpoint_SlaveEndpointTest_UnauthorizedRequest_2_gSUGZr/credential'
I0527 13:15:44.519551  6613 slave.cpp:265] Agent using credential for: test-principal
I0527 13:15:44.519568  6613 credentials.hpp:37] Loading credentials for authentication from
'/tmp/Endpoint_SlaveEndpointTest_UnauthorizedRequest_2_gSUGZr/http_credentials'
I0527 13:15:44.519731  6613 http.cpp:975] Creating default 'basic' HTTP authenticator for
realm 'mesos-agent-executor'
I0527 13:15:44.519775  6613 http.cpp:996] Creating default 'jwt' HTTP authenticator for realm
'mesos-agent-executor'
I0527 13:15:44.519835  6613 http.cpp:975] Creating default 'basic' HTTP authenticator for
realm 'mesos-agent-readonly'
I0527 13:15:44.519868  6613 http.cpp:996] Creating default 'jwt' HTTP authenticator for realm
'mesos-agent-readonly'
I0527 13:15:44.519912  6613 http.cpp:975] Creating default 'basic' HTTP authenticator for
realm 'mesos-agent-readwrite'
I0527 13:15:44.519942  6613 http.cpp:996] Creating default 'jwt' HTTP authenticator for realm
'mesos-agent-readwrite'
I0527 13:15:44.520352  6613 slave.cpp:536] Agent resources: cpus(*):2; mem(*):1024; disk(*):1024;
ports(*):[31000-32000]
I0527 13:15:44.520400  6613 slave.cpp:544] Agent attributes: [  ]
I0527 13:15:44.520428  6613 slave.cpp:549] Agent hostname: 92c0c5fbf3b1
I0527 13:15:44.520763  6613 status_update_manager.cpp:177] Pausing sending status updates
I0527 13:15:44.520980  6613 state.cpp:62] Recovering state from '/tmp/Endpoint_SlaveEndpointTest_UnauthorizedRequest_2_tkM7OZ/meta'
I0527 13:15:44.521116  6613 status_update_manager.cpp:203] Recovering status update manager
I0527 13:15:44.521178  6613 containerizer.cpp:582] Recovering containerizer
I0527 13:15:44.521776  6605 provisioner.cpp:416] Provisioner recovery complete
I0527 13:15:44.521981  6612 slave.cpp:6083] Finished recovery
I0527 13:15:44.522514  6612 slave.cpp:6265] Querying resource estimator for oversubscribable
resources
I0527 13:15:44.522640  6612 slave.cpp:6279] Received oversubscribable resources {} from the
resource estimator
I0527 13:15:44.523514  6618 process.cpp:3730] Handling HTTP event for process 'slave(754)'
with path: '/slave(754)/containers'
I0527 13:15:44.523988  6618 http.cpp:1115] HTTP GET for /slave(754)/containers from 172.17.0.3:38567
I0527 13:15:44.524034  6618 http.cpp:936] Authorizing principal 'test-principal' to GET the
'/containers' endpoint
I0527 13:15:44.525313  6609 slave.cpp:801] Agent terminating
[       OK ] Endpoint/SlaveEndpointTest.UnauthorizedRequest/2 (13 ms)
[ RUN      ] Endpoint/SlaveEndpointTest.NoAuthorizer/0
I0527 13:15:44.530570  1088 containerizer.cpp:230] Using isolation: posix/cpu,posix/mem,filesystem/posix,network/cni,environment_secret
W0527 13:15:44.530877  1088 backend.cpp:76] Failed to create 'aufs' backend: AufsBackend requires
root privileges
W0527 13:15:44.531025  1088 backend.cpp:76] Failed to create 'bind' backend: BindBackend requires
root privileges
I0527 13:15:44.531189  1088 provisioner.cpp:255] Using default backend 'copy'
I0527 13:15:44.532321  1088 cluster.cpp:448] Creating default 'local' authorizer
I0527 13:15:44.533277  6607 slave.cpp:232] Mesos agent started on (755)@172.17.0.3:52656
I0527 13:15:44.533293  6607 slave.cpp:233] Flags at startup: --acls="" --appc_simple_discovery_uri_prefix="http://"
--appc_store_dir="/tmp/mesos/store/appc" --authenticate_http_executors="true" --authenticate_http_readonly="true"
--authenticate_http_readwrite="true" --authenticatee="crammd5" --authentication_backoff_factor="1secs"
--authorizer="local" --cgroups_cpu_enable_pids_and_tids_count="false" --cgroups_enable_cfs="false"
--cgroups_hierarchy="/sys/fs/cgroup" --cgroups_limit_swap="false" --cgroups_root="mesos" --container_disk_watch_interval="15secs"
--containerizers="mesos" --credential="/tmp/Endpoint_SlaveEndpointTest_NoAuthorizer_0_YMSvNg/credential"
--default_role="*" --disk_watch_interval="1mins" --docker="docker" --docker_kill_orphans="true"
--docker_registry="https://registry-1.docker.io" --docker_remove_delay="6hrs" --docker_socket="/var/run/docker.sock"
--docker_stop_timeout="0ns" --docker_store_dir="/tmp/mesos/store/docker" --docker_volume_checkpoint_dir="/var/run/mesos/isolators/docker/volume"
--enforce_container_disk_quota="false" --executor_registration_timeout="1mins" --executor_reregistration_timeout="2secs"
--executor_secret_key="/tmp/Endpoint_SlaveEndpointTest_NoAuthorizer_0_YMSvNg/executor_secret_key"
--executor_shutdown_grace_period="5secs" --fetcher_cache_dir="/tmp/Endpoint_SlaveEndpointTest_NoAuthorizer_0_YMSvNg/fetch"
--fetcher_cache_size="2GB" --frameworks_home="" --gc_delay="1weeks" --gc_disk_headroom="0.1"
--hadoop_home="" --help="false" --hostname_lookup="true" --http_command_executor="false" --http_credentials="/tmp/Endpoint_SlaveEndpointTest_NoAuthorizer_0_YMSvNg/http_credentials"
--http_heartbeat_interval="30secs" --initialize_driver_logging="true" --isolation="posix/cpu,posix/mem"
--launcher="posix" --launcher_dir="/mesos/build/src" --logbufsecs="0" --logging_level="INFO"
--max_completed_executors_per_framework="150" --oversubscribed_resources_interval="15secs"
--perf_duration="10secs" --perf_interval="1mins" --port="5051" --qos_correction_interval_min="0ns"
--quiet="false" --recover="reconnect" --recovery_timeout="15mins" --registration_backoff_factor="10ms"
--resources="cpus:2;gpus:0;mem:1024;disk:1024;ports:[31000-32000]" --revocable_cpu_low_priority="true"
--runtime_dir="/tmp/Endpoint_SlaveEndpointTest_NoAuthorizer_0_YMSvNg" --sandbox_directory="/mnt/mesos/sandbox"
--strict="true" --switch_user="true" --systemd_enable_support="true" --systemd_runtime_directory="/run/systemd/system"
--version="false" --work_dir="/tmp/Endpoint_SlaveEndpointTest_NoAuthorizer_0_pgVJAO"
I0527 13:15:44.533608  6607 credentials.hpp:86] Loading credential for authentication from
'/tmp/Endpoint_SlaveEndpointTest_NoAuthorizer_0_YMSvNg/credential'
I0527 13:15:44.533792  6607 slave.cpp:265] Agent using credential for: test-principal
I0527 13:15:44.533810  6607 credentials.hpp:37] Loading credentials for authentication from
'/tmp/Endpoint_SlaveEndpointTest_NoAuthorizer_0_YMSvNg/http_credentials'
I0527 13:15:44.534107  6607 http.cpp:975] Creating default 'basic' HTTP authenticator for
realm 'mesos-agent-executor'
I0527 13:15:44.534155  6607 http.cpp:996] Creating default 'jwt' HTTP authenticator for realm
'mesos-agent-executor'
I0527 13:15:44.534268  6607 http.cpp:975] Creating default 'basic' HTTP authenticator for
realm 'mesos-agent-readonly'
I0527 13:15:44.534348  6607 http.cpp:996] Creating default 'jwt' HTTP authenticator for realm
'mesos-agent-readonly'
I0527 13:15:44.534447  6607 http.cpp:975] Creating default 'basic' HTTP authenticator for
realm 'mesos-agent-readwrite'
I0527 13:15:44.534574  6607 http.cpp:996] Creating default 'jwt' HTTP authenticator for realm
'mesos-agent-readwrite'
I0527 13:15:44.535055  6607 slave.cpp:536] Agent resources: cpus(*):2; mem(*):1024; disk(*):1024;
ports(*):[31000-32000]
I0527 13:15:44.535089  6607 slave.cpp:544] Agent attributes: [  ]
I0527 13:15:44.535097  6607 slave.cpp:549] Agent hostname: 92c0c5fbf3b1
I0527 13:15:44.535318  6606 status_update_manager.cpp:177] Pausing sending status updates
I0527 13:15:44.535773  6616 state.cpp:62] Recovering state from '/tmp/Endpoint_SlaveEndpointTest_NoAuthorizer_0_pgVJAO/meta'
I0527 13:15:44.536077  6605 status_update_manager.cpp:203] Recovering status update manager
I0527 13:15:44.536212  6605 containerizer.cpp:582] Recovering containerizer
I0527 13:15:44.536958  6620 provisioner.cpp:416] Provisioner recovery complete
I0527 13:15:44.537235  6607 slave.cpp:6083] Finished recovery
I0527 13:15:44.537968  6607 slave.cpp:6265] Querying resource estimator for oversubscribable
resources
I0527 13:15:44.538295  6607 slave.cpp:6279] Received oversubscribable resources {} from the
resource estimator
I0527 13:15:44.539266  6612 process.cpp:3730] Handling HTTP event for process 'slave(755)'
with path: '/slave(755)/monitor/statistics'
I0527 13:15:44.539783  6612 http.cpp:1115] HTTP GET for /slave(755)/monitor/statistics from
172.17.0.3:38568
I0527 13:15:44.539825  6612 http.cpp:936] Authorizing principal 'test-principal' to GET the
'/monitor/statistics' endpoint
I0527 13:15:44.541604  1088 slave.cpp:801] Agent terminating
[       OK ] Endpoint/SlaveEndpointTest.NoAuthorizer/0 (15 ms)
[ RUN      ] Endpoint/SlaveEndpointTest.NoAuthorizer/1
I0527 13:15:44.546566  1088 containerizer.cpp:230] Using isolation: posix/cpu,posix/mem,filesystem/posix,network/cni,environment_secret
W0527 13:15:44.546900  1088 backend.cpp:76] Failed to create 'aufs' backend: AufsBackend requires
root privileges
W0527 13:15:44.546946  1088 backend.cpp:76] Failed to create 'bind' backend: BindBackend requires
root privileges
I0527 13:15:44.546967  1088 provisioner.cpp:255] Using default backend 'copy'
I0527 13:15:44.547693  1088 cluster.cpp:448] Creating default 'local' authorizer
I0527 13:15:44.548229  6615 slave.cpp:232] Mesos agent started on (756)@172.17.0.3:52656
I0527 13:15:44.548249  6615 slave.cpp:233] Flags at startup: --acls="" --appc_simple_discovery_uri_prefix="http://"
--appc_store_dir="/tmp/mesos/store/appc" --authenticate_http_executors="true" --authenticate_http_readonly="true"
--authenticate_http_readwrite="true" --authenticatee="crammd5" --authentication_backoff_factor="1secs"
--authorizer="local" --cgroups_cpu_enable_pids_and_tids_count="false" --cgroups_enable_cfs="false"
--cgroups_hierarchy="/sys/fs/cgroup" --cgroups_limit_swap="false" --cgroups_root="mesos" --container_disk_watch_interval="15secs"
--containerizers="mesos" --credential="/tmp/Endpoint_SlaveEndpointTest_NoAuthorizer_1_X1GAL5/credential"
--default_role="*" --disk_watch_interval="1mins" --docker="docker" --docker_kill_orphans="true"
--docker_registry="https://registry-1.docker.io" --docker_remove_delay="6hrs" --docker_socket="/var/run/docker.sock"
--docker_stop_timeout="0ns" --docker_store_dir="/tmp/mesos/store/docker" --docker_volume_checkpoint_dir="/var/run/mesos/isolators/docker/volume"
--enforce_container_disk_quota="false" --executor_registration_timeout="1mins" --executor_reregistration_timeout="2secs"
--executor_secret_key="/tmp/Endpoint_SlaveEndpointTest_NoAuthorizer_1_X1GAL5/executor_secret_key"
--executor_shutdown_grace_period="5secs" --fetcher_cache_dir="/tmp/Endpoint_SlaveEndpointTest_NoAuthorizer_1_X1GAL5/fetch"
--fetcher_cache_size="2GB" --frameworks_home="" --gc_delay="1weeks" --gc_disk_headroom="0.1"
--hadoop_home="" --help="false" --hostname_lookup="true" --http_command_executor="false" --http_credentials="/tmp/Endpoint_SlaveEndpointTest_NoAuthorizer_1_X1GAL5/http_credentials"
--http_heartbeat_interval="30secs" --initialize_driver_logging="true" --isolation="posix/cpu,posix/mem"
--launcher="posix" --launcher_dir="/mesos/build/src" --logbufsecs="0" --logging_level="INFO"
--max_completed_executors_per_framework="150" --oversubscribed_resources_interval="15secs"
--perf_duration="10secs" --perf_interval="1mins" --port="5051" --qos_correction_interval_min="0ns"
--quiet="false" --recover="reconnect" --recovery_timeout="15mins" --registration_backoff_factor="10ms"
--resources="cpus:2;gpus:0;mem:1024;disk:1024;ports:[31000-32000]" --revocable_cpu_low_priority="true"
--runtime_dir="/tmp/Endpoint_SlaveEndpointTest_NoAuthorizer_1_X1GAL5" --sandbox_directory="/mnt/mesos/sandbox"
--strict="true" --switch_user="true" --systemd_enable_support="true" --systemd_runtime_directory="/run/systemd/system"
--version="false" --work_dir="/tmp/Endpoint_SlaveEndpointTest_NoAuthorizer_1_jgnewD"
I0527 13:15:44.549337  6615 credentials.hpp:86] Loading credential for authentication from
'/tmp/Endpoint_SlaveEndpointTest_NoAuthorizer_1_X1GAL5/credential'
I0527 13:15:44.549479  6615 slave.cpp:265] Agent using credential for: test-principal
I0527 13:15:44.549495  6615 credentials.hpp:37] Loading credentials for authentication from
'/tmp/Endpoint_SlaveEndpointTest_NoAuthorizer_1_X1GAL5/http_credentials'
I0527 13:15:44.549674  6615 http.cpp:975] Creating default 'basic' HTTP authenticator for
realm 'mesos-agent-executor'
I0527 13:15:44.549723  6615 http.cpp:996] Creating default 'jwt' HTTP authenticator for realm
'mesos-agent-executor'
I0527 13:15:44.549793  6615 http.cpp:975] Creating default 'basic' HTTP authenticator for
realm 'mesos-agent-readonly'
I0527 13:15:44.549820  6615 http.cpp:996] Creating default 'jwt' HTTP authenticator for realm
'mesos-agent-readonly'
I0527 13:15:44.549896  6615 http.cpp:975] Creating default 'basic' HTTP authenticator for
realm 'mesos-agent-readwrite'
I0527 13:15:44.549934  6615 http.cpp:996] Creating default 'jwt' HTTP authenticator for realm
'mesos-agent-readwrite'
I0527 13:15:44.550458  6615 slave.cpp:536] Agent resources: cpus(*):2; mem(*):1024; disk(*):1024;
ports(*):[31000-32000]
I0527 13:15:44.550503  6615 slave.cpp:544] Agent attributes: [  ]
I0527 13:15:44.550511  6615 slave.cpp:549] Agent hostname: 92c0c5fbf3b1
I0527 13:15:44.550598  6616 status_update_manager.cpp:177] Pausing sending status updates
I0527 13:15:44.551059  6611 state.cpp:62] Recovering state from '/tmp/Endpoint_SlaveEndpointTest_NoAuthorizer_1_jgnewD/meta'
I0527 13:15:44.551219  6611 status_update_manager.cpp:203] Recovering status update manager
I0527 13:15:44.551281  6611 containerizer.cpp:582] Recovering containerizer
I0527 13:15:44.551702  6611 provisioner.cpp:416] Provisioner recovery complete
I0527 13:15:44.551842  6611 slave.cpp:6083] Finished recovery
I0527 13:15:44.552248  6611 slave.cpp:6265] Querying resource estimator for oversubscribable
resources
I0527 13:15:44.552459  6605 slave.cpp:6279] Received oversubscribable resources {} from the
resource estimator
I0527 13:15:44.553391  6610 process.cpp:3730] Handling HTTP event for process 'slave(756)'
with path: '/slave(756)/monitor/statistics.json'
I0527 13:15:44.553819  6610 http.cpp:1115] HTTP GET for /slave(756)/monitor/statistics.json
from 172.17.0.3:38569
I0527 13:15:44.553863  6610 http.cpp:936] Authorizing principal 'test-principal' to GET the
'/monitor/statistics.json' endpoint
I0527 13:15:44.555660  6605 slave.cpp:801] Agent terminating
[       OK ] Endpoint/SlaveEndpointTest.NoAuthorizer/1 (33 ms)
[ RUN      ] Endpoint/SlaveEndpointTest.NoAuthorizer/2
I0527 13:15:44.581919  1088 containerizer.cpp:230] Using isolation: posix/cpu,posix/mem,filesystem/posix,network/cni,environment_secret
W0527 13:15:44.582285  1088 backend.cpp:76] Failed to create 'aufs' backend: AufsBackend requires
root privileges
W0527 13:15:44.582334  1088 backend.cpp:76] Failed to create 'bind' backend: BindBackend requires
root privileges
I0527 13:15:44.582356  1088 provisioner.cpp:255] Using default backend 'copy'
I0527 13:15:44.583098  1088 cluster.cpp:448] Creating default 'local' authorizer
I0527 13:15:44.583844  6605 slave.cpp:232] Mesos agent started on (757)@172.17.0.3:52656
I0527 13:15:44.583861  6605 slave.cpp:233] Flags at startup: --acls="" --appc_simple_discovery_uri_prefix="http://"
--appc_store_dir="/tmp/mesos/store/appc" --authenticate_http_executors="true" --authenticate_http_readonly="true"
--authenticate_http_readwrite="true" --authenticatee="crammd5" --authentication_backoff_factor="1secs"
--authorizer="local" --cgroups_cpu_enable_pids_and_tids_count="false" --cgroups_enable_cfs="false"
--cgroups_hierarchy="/sys/fs/cgroup" --cgroups_limit_swap="false" --cgroups_root="mesos" --container_disk_watch_interval="15secs"
--containerizers="mesos" --credential="/tmp/Endpoint_SlaveEndpointTest_NoAuthorizer_2_lfkT2U/credential"
--default_role="*" --disk_watch_interval="1mins" --docker="docker" --docker_kill_orphans="true"
--docker_registry="https://registry-1.docker.io" --docker_remove_delay="6hrs" --docker_socket="/var/run/docker.sock"
--docker_stop_timeout="0ns" --docker_store_dir="/tmp/mesos/store/docker" --docker_volume_checkpoint_dir="/var/run/mesos/isolators/docker/volume"
--enforce_container_disk_quota="false" --executor_registration_timeout="1mins" --executor_reregistration_timeout="2secs"
--executor_secret_key="/tmp/Endpoint_SlaveEndpointTest_NoAuthorizer_2_lfkT2U/executor_secret_key"
--executor_shutdown_grace_period="5secs" --fetcher_cache_dir="/tmp/Endpoint_SlaveEndpointTest_NoAuthorizer_2_lfkT2U/fetch"
--fetcher_cache_size="2GB" --frameworks_home="" --gc_delay="1weeks" --gc_disk_headroom="0.1"
--hadoop_home="" --help="false" --hostname_lookup="true" --http_command_executor="false" --http_credentials="/tmp/Endpoint_SlaveEndpointTest_NoAuthorizer_2_lfkT2U/http_credentials"
--http_heartbeat_interval="30secs" --initialize_driver_logging="true" --isolation="posix/cpu,posix/mem"
--launcher="posix" --launcher_dir="/mesos/build/src" --logbufsecs="0" --logging_level="INFO"
--max_completed_executors_per_framework="150" --oversubscribed_resources_interval="15secs"
--perf_duration="10secs" --perf_interval="1mins" --port="5051" --qos_correction_interval_min="0ns"
--quiet="false" --recover="reconnect" --recovery_timeout="15mins" --registration_backoff_factor="10ms"
--resources="cpus:2;gpus:0;mem:1024;disk:1024;ports:[31000-32000]" --revocable_cpu_low_priority="true"
--runtime_dir="/tmp/Endpoint_SlaveEndpointTest_NoAuthorizer_2_lfkT2U" --sandbox_directory="/mnt/mesos/sandbox"
--strict="true" --switch_user="true" --systemd_enable_support="true" --systemd_runtime_directory="/run/systemd/system"
--version="false" --work_dir="/tmp/Endpoint_SlaveEndpointTest_NoAuthorizer_2_vFASHs"
I0527 13:15:44.584121  6605 credentials.hpp:86] Loading credential for authentication from
'/tmp/Endpoint_SlaveEndpointTest_NoAuthorizer_2_lfkT2U/credential'
I0527 13:15:44.584211  6605 slave.cpp:265] Agent using credential for: test-principal
I0527 13:15:44.584221  6605 credentials.hpp:37] Loading credentials for authentication from
'/tmp/Endpoint_SlaveEndpointTest_NoAuthorizer_2_lfkT2U/http_credentials'
I0527 13:15:44.584338  6605 http.cpp:975] Creating default 'basic' HTTP authenticator for
realm 'mesos-agent-executor'
I0527 13:15:44.584401  6605 http.cpp:996] Creating default 'jwt' HTTP authenticator for realm
'mesos-agent-executor'
I0527 13:15:44.584470  6605 http.cpp:975] Creating default 'basic' HTTP authenticator for
realm 'mesos-agent-readonly'
I0527 13:15:44.584496  6605 http.cpp:996] Creating default 'jwt' HTTP authenticator for realm
'mesos-agent-readonly'
I0527 13:15:44.584542  6605 http.cpp:975] Creating default 'basic' HTTP authenticator for
realm 'mesos-agent-readwrite'
I0527 13:15:44.584559  6605 http.cpp:996] Creating default 'jwt' HTTP authenticator for realm
'mesos-agent-readwrite'
I0527 13:15:44.584969  6605 slave.cpp:536] Agent resources: cpus(*):2; mem(*):1024; disk(*):1024;
ports(*):[31000-32000]
I0527 13:15:44.585000  6605 slave.cpp:544] Agent attributes: [  ]
I0527 13:15:44.585005  6605 slave.cpp:549] Agent hostname: 92c0c5fbf3b1
I0527 13:15:44.585072  6619 status_update_manager.cpp:177] Pausing sending status updates
I0527 13:15:44.585430  6613 state.cpp:62] Recovering state from '/tmp/Endpoint_SlaveEndpointTest_NoAuthorizer_2_vFASHs/meta'
I0527 13:15:44.585611  6613 status_update_manager.cpp:203] Recovering status update manager
I0527 13:15:44.585722  6615 containerizer.cpp:582] Recovering containerizer
I0527 13:15:44.586254  6618 provisioner.cpp:416] Provisioner recovery complete
I0527 13:15:44.586405  6616 slave.cpp:6083] Finished recovery
I0527 13:15:44.586763  6616 slave.cpp:6265] Querying resource estimator for oversubscribable
resources
I0527 13:15:44.586854  6620 slave.cpp:6279] Received oversubscribable resources {} from the
resource estimator
I0527 13:15:44.587762  6606 process.cpp:3730] Handling HTTP event for process 'slave(757)'
with path: '/slave(757)/containers'
I0527 13:15:44.588407  6619 http.cpp:1115] HTTP GET for /slave(757)/containers from 172.17.0.3:38572
I0527 13:15:44.588529  6619 http.cpp:936] Authorizing principal 'test-principal' to GET the
'/containers' endpoint
I0527 13:15:44.589741  1088 slave.cpp:801] Agent terminating
[       OK ] Endpoint/SlaveEndpointTest.NoAuthorizer/2 (13 ms)
[----------] 9 tests from Endpoint/SlaveEndpointTest (177 ms total)

[----------] Global test environment tear-down
[==========] 1534 tests from 169 test cases ran. (218343 ms total)
[  PASSED  ] 1532 tests.
[  FAILED  ] 2 tests, listed below:
[  FAILED  ] ProvisionerDockerLocalStoreTest.LocalStoreTestWithTar
[  FAILED  ] ProvisionerDockerLocalStoreTest.MetadataManagerInitialization

 2 FAILED TESTS
  YOU HAVE 22 DISABLED TESTS

E0527 13:15:44.641837  6621 process.cpp:950] Failed to accept socket: future discarded
make[3]: *** [CMakeFiles/check] Error 1
make[3]: Leaving directory `/mesos/build'
make[2]: *** [CMakeFiles/check.dir/all] Error 2
make[2]: Leaving directory `/mesos/build'
make[1]: *** [CMakeFiles/check.dir/rule] Error 2
make[1]: Leaving directory `/mesos/build'
make: *** [check] Error 2
+ docker rmi mesos-1495887705-31357
Untagged: mesos-1495887705-31357:latest
Deleted: sha256:e9810b31512ec149ebce06bd1a7e902a2bbce50334dece5108ffc52b35347422
Deleted: sha256:7dc2166971c34528662e498cbc234300e286f1070287c41f59af9ae3d980089f
Deleted: sha256:6ca148b6ab2bdb71cb26f1c4396908c8e84d924fe12bb1969af7e2231e39de1d
Deleted: sha256:fcef75601440056d7bd3b5dacae1ede3753dabb196eb37c80d9ae324b871eefe
Deleted: sha256:0e65717b737678e4387aa2c70b09d9f520e0cb54d8a0d81d9a815941d868518a
Deleted: sha256:aae9d59b36af728b0cb50da04c1900ecca58baf923a664d970203ea1a8646df6
Deleted: sha256:4b18af11e4332911cc3647266c638347bd77f94916bfbc360feb9bd1e2a4bf38
Deleted: sha256:49fb884758fef6e460ff9e3e53a2e03ff369077c4bfc8ea80a27d2d1fb380546
Deleted: sha256:6db6b641cb75cb041d30376ac207a076fd061b5efa04d840cd3639789b12e4cc
Deleted: sha256:e66fcec0d87abafa28ada7ff961c0d61b59752db354089b2cd82f108a27e62b5
Deleted: sha256:4974b8e59e91324176acd3647de938b62d7b6612f09791f9ab4c9354b7130d5c
Deleted: sha256:7070de97cb4e6e3ecb3549c48654a6189659f0d03496ba4646955f3ac6c0f9e8
Deleted: sha256:ea414037545fbbb725c3c13159d4d94e222e9f583345a957adf80ac2a7e82303
Deleted: sha256:15503cff5d70e1267a47e9cc7b814eb6118327b0a0e975861eff076fe7ea4460
Deleted: sha256:137b7bfe3f3611f8ce6a822e4961351a8ae0cf0b10dcee502da30da00b7b1e14
Deleted: sha256:8341315c9ba56621cfc2327ba121688d8795983488a53b53f29b9314541dbfea
Deleted: sha256:74b3c36598f7f7739ac9e0fb977960cfdc2873af77939f0472d16b4efcb4d6a2
Deleted: sha256:03adba981ac50e1ff7e8f6eeb82bb5da37d39e548a1f4a4a1650f497f4ba4a20
Deleted: sha256:72ab762e4714ad27e39fa5ef1a9c6a16589dfea78d78d60839cce6fd691c3baa
Deleted: sha256:c2b5dfc1617a5fb95b32992a99f8a2b4878762d8b00f7b43253015c9047164ec
Deleted: sha256:97eacbff121300b0441b769ce54ad96761fc6e6793a8c08489f7e09ea6f8101f
Deleted: sha256:c7083379e7ad4df0da7d0c9450214fb99a80feb58832bce07fbbb48a49a556c2
Deleted: sha256:8f2d170ed18dc8231eaa6a796f6e115b27d8ec0ee6042cffaa97350bccfbf1de
Deleted: sha256:340dc90c7cbe8747195cabd55875a65537b74e596aa02a9bde4868ec885af05f
Deleted: sha256:6bd8a8c9197d2b48b3db09b50327b9c2bc380035907c51e0a35fcb40d09bd193
Build step 'Execute shell' marked build as failure
Not sending mail to unregistered user neil.conway@gmail.com

Mime
View raw message