mesos-builds mailing list archives

Site index · List index
Message view « Date » · « Thread »
Top « Date » · « Thread »
From Apache Jenkins Server <jenk...@builds.apache.org>
Subject Build failed in Jenkins: Mesos-Buildbot » autotools,gcc,--verbose,GLOG_v=1 MESOS_VERBOSE=1,ubuntu:14.04,(docker||Hadoop)&&(!ubuntu-us1)&&(!ubuntu-eu2) #3683
Date Tue, 16 May 2017 09:09:10 GMT
See <https://builds.apache.org/job/Mesos-Buildbot/BUILDTOOL=autotools,COMPILER=gcc,CONFIGURATION=--verbose,ENVIRONMENT=GLOG_v=1%20MESOS_VERBOSE=1,OS=ubuntu%3A14.04,label_exp=(docker%7C%7CHadoop)&&(!ubuntu-us1)&&(!ubuntu-eu2)/3683/display/redirect>

------------------------------------------
[...truncated 26.93 MB...]
[       OK ] Endpoint/SlaveEndpointTest.AuthorizedRequest/1 (33 ms)
[ RUN      ] Endpoint/SlaveEndpointTest.AuthorizedRequest/2
I0516 09:09:04.623495 30647 containerizer.cpp:221] Using isolation: posix/cpu,posix/mem,filesystem/posix,network/cni
W0516 09:09:04.624035 30647 backend.cpp:76] Failed to create 'aufs' backend: AufsBackend requires
root privileges
W0516 09:09:04.624150 30647 backend.cpp:76] Failed to create 'bind' backend: BindBackend requires
root privileges
I0516 09:09:04.624195 30647 provisioner.cpp:249] Using default backend 'copy'
I0516 09:09:04.628031 30681 slave.cpp:225] Mesos agent started on (745)@172.17.0.3:38296
I0516 09:09:04.628062 30681 slave.cpp:226] Flags at startup: --acls="" --appc_simple_discovery_uri_prefix="http://"
--appc_store_dir="/tmp/mesos/store/appc" --authenticate_http_readonly="true" --authenticate_http_readwrite="true"
--authenticatee="crammd5" --authentication_backoff_factor="1secs" --authorizer="local" --cgroups_cpu_enable_pids_and_tids_count="false"
--cgroups_enable_cfs="false" --cgroups_hierarchy="/sys/fs/cgroup" --cgroups_limit_swap="false"
--cgroups_root="mesos" --container_disk_watch_interval="15secs" --containerizers="mesos" --credential="/tmp/Endpoint_SlaveEndpointTest_AuthorizedRequest_2_Tz6T6r/credential"
--default_role="*" --disk_watch_interval="1mins" --docker="docker" --docker_kill_orphans="true"
--docker_registry="https://registry-1.docker.io" --docker_remove_delay="6hrs" --docker_socket="/var/run/docker.sock"
--docker_stop_timeout="0ns" --docker_store_dir="/tmp/mesos/store/docker" --docker_volume_checkpoint_dir="/var/run/mesos/isolators/docker/volume"
--enforce_container_disk_quota="false" --executor_registration_timeout="1mins" --executor_shutdown_grace_period="5secs"
--fetcher_cache_dir="/tmp/Endpoint_SlaveEndpointTest_AuthorizedRequest_2_Tz6T6r/fetch" --fetcher_cache_size="2GB"
--frameworks_home="" --gc_delay="1weeks" --gc_disk_headroom="0.1" --hadoop_home="" --help="false"
--hostname_lookup="true" --http_command_executor="false" --http_credentials="/tmp/Endpoint_SlaveEndpointTest_AuthorizedRequest_2_Tz6T6r/http_credentials"
--http_heartbeat_interval="30secs" --initialize_driver_logging="true" --isolation="posix/cpu,posix/mem"
--launcher="posix" --launcher_dir="/mesos/mesos-1.3.0/_build/src" --logbufsecs="0" --logging_level="INFO"
--max_completed_executors_per_framework="150" --oversubscribed_resources_interval="15secs"
--perf_duration="10secs" --perf_interval="1mins" --port="5051" --qos_correction_interval_min="0ns"
--quiet="false" --recover="reconnect" --recovery_timeout="15mins" --registration_backoff_factor="10ms"
--resources="cpus:2;gpus:0;mem:1024;disk:1024;ports:[31000-32000]" --revocable_cpu_low_priority="true"
--runtime_dir="/tmp/Endpoint_SlaveEndpointTest_AuthorizedRequest_2_Tz6T6r" --sandbox_directory="/mnt/mesos/sandbox"
--strict="true" --switch_user="true" --systemd_enable_support="true" --systemd_runtime_directory="/run/systemd/system"
--version="false" --work_dir="/tmp/Endpoint_SlaveEndpointTest_AuthorizedRequest_2_qyvnwX"
I0516 09:09:04.628545 30681 credentials.hpp:86] Loading credential for authentication from
'/tmp/Endpoint_SlaveEndpointTest_AuthorizedRequest_2_Tz6T6r/credential'
I0516 09:09:04.628774 30681 slave.cpp:258] Agent using credential for: test-principal
I0516 09:09:04.628803 30681 credentials.hpp:37] Loading credentials for authentication from
'/tmp/Endpoint_SlaveEndpointTest_AuthorizedRequest_2_Tz6T6r/http_credentials'
I0516 09:09:04.629127 30681 http.cpp:975] Creating default 'basic' HTTP authenticator for
realm 'mesos-agent-readonly'
I0516 09:09:04.629333 30681 http.cpp:975] Creating default 'basic' HTTP authenticator for
realm 'mesos-agent-readwrite'
I0516 09:09:04.631449 30681 slave.cpp:525] Agent resources: cpus(*):2; mem(*):1024; disk(*):1024;
ports(*):[31000-32000]
I0516 09:09:04.631604 30681 slave.cpp:533] Agent attributes: [  ]
I0516 09:09:04.631654 30681 slave.cpp:538] Agent hostname: d08d3bc3551d
I0516 09:09:04.631896 30669 status_update_manager.cpp:177] Pausing sending status updates
I0516 09:09:04.633908 30673 state.cpp:62] Recovering state from '/tmp/Endpoint_SlaveEndpointTest_AuthorizedRequest_2_qyvnwX/meta'
I0516 09:09:04.634658 30666 status_update_manager.cpp:203] Recovering status update manager
I0516 09:09:04.634917 30666 containerizer.cpp:608] Recovering containerizer
I0516 09:09:04.637681 30674 provisioner.cpp:410] Provisioner recovery complete
I0516 09:09:04.641898 30671 slave.cpp:5970] Finished recovery
I0516 09:09:04.642675 30671 slave.cpp:6152] Querying resource estimator for oversubscribable
resources
I0516 09:09:04.643075 30671 slave.cpp:6166] Received oversubscribable resources {} from the
resource estimator
I0516 09:09:04.647449 30666 process.cpp:3731] Handling HTTP event for process 'slave(745)'
with path: '/slave(745)/containers'
I0516 09:09:04.649026 30666 http.cpp:1115] HTTP GET for /slave(745)/containers from 172.17.0.3:36412
I0516 09:09:04.649111 30666 http.cpp:936] Authorizing principal 'test-principal' to GET the
'/containers' endpoint
I0516 09:09:04.654322 30668 slave.cpp:790] Agent terminating
[       OK ] Endpoint/SlaveEndpointTest.AuthorizedRequest/2 (42 ms)
[ RUN      ] Endpoint/SlaveEndpointTest.UnauthorizedRequest/0
I0516 09:09:04.667673 30647 containerizer.cpp:221] Using isolation: posix/cpu,posix/mem,filesystem/posix,network/cni
W0516 09:09:04.668594 30647 backend.cpp:76] Failed to create 'aufs' backend: AufsBackend requires
root privileges
W0516 09:09:04.668867 30647 backend.cpp:76] Failed to create 'bind' backend: BindBackend requires
root privileges
I0516 09:09:04.669070 30647 provisioner.cpp:249] Using default backend 'copy'
I0516 09:09:04.673514 30675 slave.cpp:225] Mesos agent started on (746)@172.17.0.3:38296
I0516 09:09:04.673565 30675 slave.cpp:226] Flags at startup: --acls="" --appc_simple_discovery_uri_prefix="http://"
--appc_store_dir="/tmp/mesos/store/appc" --authenticate_http_readonly="true" --authenticate_http_readwrite="true"
--authenticatee="crammd5" --authentication_backoff_factor="1secs" --authorizer="local" --cgroups_cpu_enable_pids_and_tids_count="false"
--cgroups_enable_cfs="false" --cgroups_hierarchy="/sys/fs/cgroup" --cgroups_limit_swap="false"
--cgroups_root="mesos" --container_disk_watch_interval="15secs" --containerizers="mesos" --credential="/tmp/Endpoint_SlaveEndpointTest_UnauthorizedRequest_0_tqzZQq/credential"
--default_role="*" --disk_watch_interval="1mins" --docker="docker" --docker_kill_orphans="true"
--docker_registry="https://registry-1.docker.io" --docker_remove_delay="6hrs" --docker_socket="/var/run/docker.sock"
--docker_stop_timeout="0ns" --docker_store_dir="/tmp/mesos/store/docker" --docker_volume_checkpoint_dir="/var/run/mesos/isolators/docker/volume"
--enforce_container_disk_quota="false" --executor_registration_timeout="1mins" --executor_shutdown_grace_period="5secs"
--fetcher_cache_dir="/tmp/Endpoint_SlaveEndpointTest_UnauthorizedRequest_0_tqzZQq/fetch" --fetcher_cache_size="2GB"
--frameworks_home="" --gc_delay="1weeks" --gc_disk_headroom="0.1" --hadoop_home="" --help="false"
--hostname_lookup="true" --http_command_executor="false" --http_credentials="/tmp/Endpoint_SlaveEndpointTest_UnauthorizedRequest_0_tqzZQq/http_credentials"
--http_heartbeat_interval="30secs" --initialize_driver_logging="true" --isolation="posix/cpu,posix/mem"
--launcher="posix" --launcher_dir="/mesos/mesos-1.3.0/_build/src" --logbufsecs="0" --logging_level="INFO"
--max_completed_executors_per_framework="150" --oversubscribed_resources_interval="15secs"
--perf_duration="10secs" --perf_interval="1mins" --port="5051" --qos_correction_interval_min="0ns"
--quiet="false" --recover="reconnect" --recovery_timeout="15mins" --registration_backoff_factor="10ms"
--resources="cpus:2;gpus:0;mem:1024;disk:1024;ports:[31000-32000]" --revocable_cpu_low_priority="true"
--runtime_dir="/tmp/Endpoint_SlaveEndpointTest_UnauthorizedRequest_0_tqzZQq" --sandbox_directory="/mnt/mesos/sandbox"
--strict="true" --switch_user="true" --systemd_enable_support="true" --systemd_runtime_directory="/run/systemd/system"
--version="false" --work_dir="/tmp/Endpoint_SlaveEndpointTest_UnauthorizedRequest_0_ebHs9V"
I0516 09:09:04.674618 30675 credentials.hpp:86] Loading credential for authentication from
'/tmp/Endpoint_SlaveEndpointTest_UnauthorizedRequest_0_tqzZQq/credential'
I0516 09:09:04.675065 30675 slave.cpp:258] Agent using credential for: test-principal
I0516 09:09:04.675091 30675 credentials.hpp:37] Loading credentials for authentication from
'/tmp/Endpoint_SlaveEndpointTest_UnauthorizedRequest_0_tqzZQq/http_credentials'
I0516 09:09:04.675460 30675 http.cpp:975] Creating default 'basic' HTTP authenticator for
realm 'mesos-agent-readonly'
I0516 09:09:04.675781 30675 http.cpp:975] Creating default 'basic' HTTP authenticator for
realm 'mesos-agent-readwrite'
I0516 09:09:04.677140 30675 slave.cpp:525] Agent resources: cpus(*):2; mem(*):1024; disk(*):1024;
ports(*):[31000-32000]
I0516 09:09:04.677230 30675 slave.cpp:533] Agent attributes: [  ]
I0516 09:09:04.677251 30675 slave.cpp:538] Agent hostname: d08d3bc3551d
I0516 09:09:04.677600 30668 status_update_manager.cpp:177] Pausing sending status updates
I0516 09:09:04.679183 30670 state.cpp:62] Recovering state from '/tmp/Endpoint_SlaveEndpointTest_UnauthorizedRequest_0_ebHs9V/meta'
I0516 09:09:04.679836 30669 status_update_manager.cpp:203] Recovering status update manager
I0516 09:09:04.680248 30669 containerizer.cpp:608] Recovering containerizer
I0516 09:09:04.682072 30669 provisioner.cpp:410] Provisioner recovery complete
I0516 09:09:04.682623 30676 slave.cpp:5970] Finished recovery
I0516 09:09:04.683405 30676 slave.cpp:6152] Querying resource estimator for oversubscribable
resources
I0516 09:09:04.683971 30676 slave.cpp:6166] Received oversubscribable resources {} from the
resource estimator
I0516 09:09:04.687695 30676 process.cpp:3731] Handling HTTP event for process 'slave(746)'
with path: '/slave(746)/monitor/statistics'
I0516 09:09:04.689330 30677 http.cpp:1115] HTTP GET for /slave(746)/monitor/statistics from
172.17.0.3:36414
I0516 09:09:04.689505 30677 http.cpp:936] Authorizing principal 'test-principal' to GET the
'/monitor/statistics' endpoint
I0516 09:09:04.694452 30647 slave.cpp:790] Agent terminating
[       OK ] Endpoint/SlaveEndpointTest.UnauthorizedRequest/0 (41 ms)
[ RUN      ] Endpoint/SlaveEndpointTest.UnauthorizedRequest/1
I0516 09:09:04.709622 30647 containerizer.cpp:221] Using isolation: posix/cpu,posix/mem,filesystem/posix,network/cni
W0516 09:09:04.710439 30647 backend.cpp:76] Failed to create 'aufs' backend: AufsBackend requires
root privileges
W0516 09:09:04.710588 30647 backend.cpp:76] Failed to create 'bind' backend: BindBackend requires
root privileges
I0516 09:09:04.710640 30647 provisioner.cpp:249] Using default backend 'copy'
I0516 09:09:04.715111 30672 slave.cpp:225] Mesos agent started on (747)@172.17.0.3:38296
I0516 09:09:04.715145 30672 slave.cpp:226] Flags at startup: --acls="" --appc_simple_discovery_uri_prefix="http://"
--appc_store_dir="/tmp/mesos/store/appc" --authenticate_http_readonly="true" --authenticate_http_readwrite="true"
--authenticatee="crammd5" --authentication_backoff_factor="1secs" --authorizer="local" --cgroups_cpu_enable_pids_and_tids_count="false"
--cgroups_enable_cfs="false" --cgroups_hierarchy="/sys/fs/cgroup" --cgroups_limit_swap="false"
--cgroups_root="mesos" --container_disk_watch_interval="15secs" --containerizers="mesos" --credential="/tmp/Endpoint_SlaveEndpointTest_UnauthorizedRequest_1_l5W11p/credential"
--default_role="*" --disk_watch_interval="1mins" --docker="docker" --docker_kill_orphans="true"
--docker_registry="https://registry-1.docker.io" --docker_remove_delay="6hrs" --docker_socket="/var/run/docker.sock"
--docker_stop_timeout="0ns" --docker_store_dir="/tmp/mesos/store/docker" --docker_volume_checkpoint_dir="/var/run/mesos/isolators/docker/volume"
--enforce_container_disk_quota="false" --executor_registration_timeout="1mins" --executor_shutdown_grace_period="5secs"
--fetcher_cache_dir="/tmp/Endpoint_SlaveEndpointTest_UnauthorizedRequest_1_l5W11p/fetch" --fetcher_cache_size="2GB"
--frameworks_home="" --gc_delay="1weeks" --gc_disk_headroom="0.1" --hadoop_home="" --help="false"
--hostname_lookup="true" --http_command_executor="false" --http_credentials="/tmp/Endpoint_SlaveEndpointTest_UnauthorizedRequest_1_l5W11p/http_credentials"
--http_heartbeat_interval="30secs" --initialize_driver_logging="true" --isolation="posix/cpu,posix/mem"
--launcher="posix" --launcher_dir="/mesos/mesos-1.3.0/_build/src" --logbufsecs="0" --logging_level="INFO"
--max_completed_executors_per_framework="150" --oversubscribed_resources_interval="15secs"
--perf_duration="10secs" --perf_interval="1mins" --port="5051" --qos_correction_interval_min="0ns"
--quiet="false" --recover="reconnect" --recovery_timeout="15mins" --registration_backoff_factor="10ms"
--resources="cpus:2;gpus:0;mem:1024;disk:1024;ports:[31000-32000]" --revocable_cpu_low_priority="true"
--runtime_dir="/tmp/Endpoint_SlaveEndpointTest_UnauthorizedRequest_1_l5W11p" --sandbox_directory="/mnt/mesos/sandbox"
--strict="true" --switch_user="true" --systemd_enable_support="true" --systemd_runtime_directory="/run/systemd/system"
--version="false" --work_dir="/tmp/Endpoint_SlaveEndpointTest_UnauthorizedRequest_1_yTiIdV"
I0516 09:09:04.715638 30672 credentials.hpp:86] Loading credential for authentication from
'/tmp/Endpoint_SlaveEndpointTest_UnauthorizedRequest_1_l5W11p/credential'
I0516 09:09:04.715857 30672 slave.cpp:258] Agent using credential for: test-principal
I0516 09:09:04.715883 30672 credentials.hpp:37] Loading credentials for authentication from
'/tmp/Endpoint_SlaveEndpointTest_UnauthorizedRequest_1_l5W11p/http_credentials'
I0516 09:09:04.716187 30672 http.cpp:975] Creating default 'basic' HTTP authenticator for
realm 'mesos-agent-readonly'
I0516 09:09:04.716361 30672 http.cpp:975] Creating default 'basic' HTTP authenticator for
realm 'mesos-agent-readwrite'
I0516 09:09:04.718451 30672 slave.cpp:525] Agent resources: cpus(*):2; mem(*):1024; disk(*):1024;
ports(*):[31000-32000]
I0516 09:09:04.718554 30672 slave.cpp:533] Agent attributes: [  ]
I0516 09:09:04.718567 30672 slave.cpp:538] Agent hostname: d08d3bc3551d
I0516 09:09:04.718758 30669 status_update_manager.cpp:177] Pausing sending status updates
I0516 09:09:04.720443 30677 state.cpp:62] Recovering state from '/tmp/Endpoint_SlaveEndpointTest_UnauthorizedRequest_1_yTiIdV/meta'
I0516 09:09:04.720834 30672 status_update_manager.cpp:203] Recovering status update manager
I0516 09:09:04.721247 30672 containerizer.cpp:608] Recovering containerizer
I0516 09:09:04.723440 30677 provisioner.cpp:410] Provisioner recovery complete
I0516 09:09:04.724418 30677 slave.cpp:5970] Finished recovery
I0516 09:09:04.725253 30677 slave.cpp:6152] Querying resource estimator for oversubscribable
resources
I0516 09:09:04.726441 30677 slave.cpp:6166] Received oversubscribable resources {} from the
resource estimator
I0516 09:09:04.736071 30666 process.cpp:3731] Handling HTTP event for process 'slave(747)'
with path: '/slave(747)/monitor/statistics.json'
I0516 09:09:04.737910 30679 http.cpp:1115] HTTP GET for /slave(747)/monitor/statistics.json
from 172.17.0.3:36416
I0516 09:09:04.738123 30679 http.cpp:936] Authorizing principal 'test-principal' to GET the
'/monitor/statistics.json' endpoint
I0516 09:09:04.741391 30677 slave.cpp:790] Agent terminating
[       OK ] Endpoint/SlaveEndpointTest.UnauthorizedRequest/1 (44 ms)
[ RUN      ] Endpoint/SlaveEndpointTest.UnauthorizedRequest/2
I0516 09:09:04.753129 30647 containerizer.cpp:221] Using isolation: posix/cpu,posix/mem,filesystem/posix,network/cni
W0516 09:09:04.753965 30647 backend.cpp:76] Failed to create 'aufs' backend: AufsBackend requires
root privileges
W0516 09:09:04.754101 30647 backend.cpp:76] Failed to create 'bind' backend: BindBackend requires
root privileges
I0516 09:09:04.754241 30647 provisioner.cpp:249] Using default backend 'copy'
I0516 09:09:04.758637 30666 slave.cpp:225] Mesos agent started on (748)@172.17.0.3:38296
I0516 09:09:04.758671 30666 slave.cpp:226] Flags at startup: --acls="" --appc_simple_discovery_uri_prefix="http://"
--appc_store_dir="/tmp/mesos/store/appc" --authenticate_http_readonly="true" --authenticate_http_readwrite="true"
--authenticatee="crammd5" --authentication_backoff_factor="1secs" --authorizer="local" --cgroups_cpu_enable_pids_and_tids_count="false"
--cgroups_enable_cfs="false" --cgroups_hierarchy="/sys/fs/cgroup" --cgroups_limit_swap="false"
--cgroups_root="mesos" --container_disk_watch_interval="15secs" --containerizers="mesos" --credential="/tmp/Endpoint_SlaveEndpointTest_UnauthorizedRequest_2_rxvaFp/credential"
--default_role="*" --disk_watch_interval="1mins" --docker="docker" --docker_kill_orphans="true"
--docker_registry="https://registry-1.docker.io" --docker_remove_delay="6hrs" --docker_socket="/var/run/docker.sock"
--docker_stop_timeout="0ns" --docker_store_dir="/tmp/mesos/store/docker" --docker_volume_checkpoint_dir="/var/run/mesos/isolators/docker/volume"
--enforce_container_disk_quota="false" --executor_registration_timeout="1mins" --executor_shutdown_grace_period="5secs"
--fetcher_cache_dir="/tmp/Endpoint_SlaveEndpointTest_UnauthorizedRequest_2_rxvaFp/fetch" --fetcher_cache_size="2GB"
--frameworks_home="" --gc_delay="1weeks" --gc_disk_headroom="0.1" --hadoop_home="" --help="false"
--hostname_lookup="true" --http_command_executor="false" --http_credentials="/tmp/Endpoint_SlaveEndpointTest_UnauthorizedRequest_2_rxvaFp/http_credentials"
--http_heartbeat_interval="30secs" --initialize_driver_logging="true" --isolation="posix/cpu,posix/mem"
--launcher="posix" --launcher_dir="/mesos/mesos-1.3.0/_build/src" --logbufsecs="0" --logging_level="INFO"
--max_completed_executors_per_framework="150" --oversubscribed_resources_interval="15secs"
--perf_duration="10secs" --perf_interval="1mins" --port="5051" --qos_correction_interval_min="0ns"
--quiet="false" --recover="reconnect" --recovery_timeout="15mins" --registration_backoff_factor="10ms"
--resources="cpus:2;gpus:0;mem:1024;disk:1024;ports:[31000-32000]" --revocable_cpu_low_priority="true"
--runtime_dir="/tmp/Endpoint_SlaveEndpointTest_UnauthorizedRequest_2_rxvaFp" --sandbox_directory="/mnt/mesos/sandbox"
--strict="true" --switch_user="true" --systemd_enable_support="true" --systemd_runtime_directory="/run/systemd/system"
--version="false" --work_dir="/tmp/Endpoint_SlaveEndpointTest_UnauthorizedRequest_2_MX3NJU"
I0516 09:09:04.759021 30666 credentials.hpp:86] Loading credential for authentication from
'/tmp/Endpoint_SlaveEndpointTest_UnauthorizedRequest_2_rxvaFp/credential'
I0516 09:09:04.759246 30666 slave.cpp:258] Agent using credential for: test-principal
I0516 09:09:04.759271 30666 credentials.hpp:37] Loading credentials for authentication from
'/tmp/Endpoint_SlaveEndpointTest_UnauthorizedRequest_2_rxvaFp/http_credentials'
I0516 09:09:04.759519 30666 http.cpp:975] Creating default 'basic' HTTP authenticator for
realm 'mesos-agent-readonly'
I0516 09:09:04.759680 30666 http.cpp:975] Creating default 'basic' HTTP authenticator for
realm 'mesos-agent-readwrite'
I0516 09:09:04.760845 30666 slave.cpp:525] Agent resources: cpus(*):2; mem(*):1024; disk(*):1024;
ports(*):[31000-32000]
I0516 09:09:04.760926 30666 slave.cpp:533] Agent attributes: [  ]
I0516 09:09:04.760965 30666 slave.cpp:538] Agent hostname: d08d3bc3551d
I0516 09:09:04.761171 30670 status_update_manager.cpp:177] Pausing sending status updates
I0516 09:09:04.762495 30673 state.cpp:62] Recovering state from '/tmp/Endpoint_SlaveEndpointTest_UnauthorizedRequest_2_MX3NJU/meta'
I0516 09:09:04.763022 30678 status_update_manager.cpp:203] Recovering status update manager
I0516 09:09:04.763244 30669 containerizer.cpp:608] Recovering containerizer
I0516 09:09:04.764740 30677 provisioner.cpp:410] Provisioner recovery complete
I0516 09:09:04.765144 30678 slave.cpp:5970] Finished recovery
I0516 09:09:04.766311 30678 slave.cpp:6152] Querying resource estimator for oversubscribable
resources
I0516 09:09:04.766746 30668 slave.cpp:6166] Received oversubscribable resources {} from the
resource estimator
I0516 09:09:04.769953 30667 process.cpp:3731] Handling HTTP event for process 'slave(748)'
with path: '/slave(748)/containers'
I0516 09:09:04.771620 30668 http.cpp:1115] HTTP GET for /slave(748)/containers from 172.17.0.3:36417
I0516 09:09:04.771766 30668 http.cpp:936] Authorizing principal 'test-principal' to GET the
'/containers' endpoint
I0516 09:09:04.775418 30678 slave.cpp:790] Agent terminating
[       OK ] Endpoint/SlaveEndpointTest.UnauthorizedRequest/2 (34 ms)
[ RUN      ] Endpoint/SlaveEndpointTest.NoAuthorizer/0
I0516 09:09:04.789808 30647 containerizer.cpp:221] Using isolation: posix/cpu,posix/mem,filesystem/posix,network/cni
W0516 09:09:04.790588 30647 backend.cpp:76] Failed to create 'aufs' backend: AufsBackend requires
root privileges
W0516 09:09:04.790732 30647 backend.cpp:76] Failed to create 'bind' backend: BindBackend requires
root privileges
I0516 09:09:04.790783 30647 provisioner.cpp:249] Using default backend 'copy'
I0516 09:09:04.792856 30647 cluster.cpp:448] Creating default 'local' authorizer
I0516 09:09:04.794993 30677 slave.cpp:225] Mesos agent started on (749)@172.17.0.3:38296
I0516 09:09:04.795047 30677 slave.cpp:226] Flags at startup: --acls="" --appc_simple_discovery_uri_prefix="http://"
--appc_store_dir="/tmp/mesos/store/appc" --authenticate_http_readonly="true" --authenticate_http_readwrite="true"
--authenticatee="crammd5" --authentication_backoff_factor="1secs" --authorizer="local" --cgroups_cpu_enable_pids_and_tids_count="false"
--cgroups_enable_cfs="false" --cgroups_hierarchy="/sys/fs/cgroup" --cgroups_limit_swap="false"
--cgroups_root="mesos" --container_disk_watch_interval="15secs" --containerizers="mesos" --credential="/tmp/Endpoint_SlaveEndpointTest_NoAuthorizer_0_n4brGp/credential"
--default_role="*" --disk_watch_interval="1mins" --docker="docker" --docker_kill_orphans="true"
--docker_registry="https://registry-1.docker.io" --docker_remove_delay="6hrs" --docker_socket="/var/run/docker.sock"
--docker_stop_timeout="0ns" --docker_store_dir="/tmp/mesos/store/docker" --docker_volume_checkpoint_dir="/var/run/mesos/isolators/docker/volume"
--enforce_container_disk_quota="false" --executor_registration_timeout="1mins" --executor_shutdown_grace_period="5secs"
--fetcher_cache_dir="/tmp/Endpoint_SlaveEndpointTest_NoAuthorizer_0_n4brGp/fetch" --fetcher_cache_size="2GB"
--frameworks_home="" --gc_delay="1weeks" --gc_disk_headroom="0.1" --hadoop_home="" --help="false"
--hostname_lookup="true" --http_command_executor="false" --http_credentials="/tmp/Endpoint_SlaveEndpointTest_NoAuthorizer_0_n4brGp/http_credentials"
--http_heartbeat_interval="30secs" --initialize_driver_logging="true" --isolation="posix/cpu,posix/mem"
--launcher="posix" --launcher_dir="/mesos/mesos-1.3.0/_build/src" --logbufsecs="0" --logging_level="INFO"
--max_completed_executors_per_framework="150" --oversubscribed_resources_interval="15secs"
--perf_duration="10secs" --perf_interval="1mins" --port="5051" --qos_correction_interval_min="0ns"
--quiet="false" --recover="reconnect" --recovery_timeout="15mins" --registration_backoff_factor="10ms"
--resources="cpus:2;gpus:0;mem:1024;disk:1024;ports:[31000-32000]" --revocable_cpu_low_priority="true"
--runtime_dir="/tmp/Endpoint_SlaveEndpointTest_NoAuthorizer_0_n4brGp" --sandbox_directory="/mnt/mesos/sandbox"
--strict="true" --switch_user="true" --systemd_enable_support="true" --systemd_runtime_directory="/run/systemd/system"
--version="false" --work_dir="/tmp/Endpoint_SlaveEndpointTest_NoAuthorizer_0_Y8abFU"
I0516 09:09:04.795689 30677 credentials.hpp:86] Loading credential for authentication from
'/tmp/Endpoint_SlaveEndpointTest_NoAuthorizer_0_n4brGp/credential'
I0516 09:09:04.795992 30677 slave.cpp:258] Agent using credential for: test-principal
I0516 09:09:04.796020 30677 credentials.hpp:37] Loading credentials for authentication from
'/tmp/Endpoint_SlaveEndpointTest_NoAuthorizer_0_n4brGp/http_credentials'
I0516 09:09:04.796341 30677 http.cpp:975] Creating default 'basic' HTTP authenticator for
realm 'mesos-agent-readonly'
I0516 09:09:04.796589 30677 http.cpp:975] Creating default 'basic' HTTP authenticator for
realm 'mesos-agent-readwrite'
I0516 09:09:04.798532 30677 slave.cpp:525] Agent resources: cpus(*):2; mem(*):1024; disk(*):1024;
ports(*):[31000-32000]
I0516 09:09:04.798666 30677 slave.cpp:533] Agent attributes: [  ]
I0516 09:09:04.798683 30677 slave.cpp:538] Agent hostname: d08d3bc3551d
I0516 09:09:04.798866 30675 status_update_manager.cpp:177] Pausing sending status updates
I0516 09:09:04.800861 30667 state.cpp:62] Recovering state from '/tmp/Endpoint_SlaveEndpointTest_NoAuthorizer_0_Y8abFU/meta'
I0516 09:09:04.801426 30669 status_update_manager.cpp:203] Recovering status update manager
I0516 09:09:04.801781 30679 containerizer.cpp:608] Recovering containerizer
I0516 09:09:04.803591 30671 provisioner.cpp:410] Provisioner recovery complete
I0516 09:09:04.804114 30680 slave.cpp:5970] Finished recovery
I0516 09:09:04.804689 30680 slave.cpp:6152] Querying resource estimator for oversubscribable
resources
I0516 09:09:04.805256 30668 slave.cpp:6166] Received oversubscribable resources {} from the
resource estimator
I0516 09:09:04.808296 30673 process.cpp:3731] Handling HTTP event for process 'slave(749)'
with path: '/slave(749)/monitor/statistics'
I0516 09:09:04.809994 30675 http.cpp:1115] HTTP GET for /slave(749)/monitor/statistics from
172.17.0.3:36419
I0516 09:09:04.810230 30675 http.cpp:936] Authorizing principal 'test-principal' to GET the
'/monitor/statistics' endpoint
I0516 09:09:04.814806 30647 slave.cpp:790] Agent terminating
[       OK ] Endpoint/SlaveEndpointTest.NoAuthorizer/0 (49 ms)
[ RUN      ] Endpoint/SlaveEndpointTest.NoAuthorizer/1
I0516 09:09:04.841425 30647 containerizer.cpp:221] Using isolation: posix/cpu,posix/mem,filesystem/posix,network/cni
W0516 09:09:04.842485 30647 backend.cpp:76] Failed to create 'aufs' backend: AufsBackend requires
root privileges
W0516 09:09:04.842810 30647 backend.cpp:76] Failed to create 'bind' backend: BindBackend requires
root privileges
I0516 09:09:04.843008 30647 provisioner.cpp:249] Using default backend 'copy'
I0516 09:09:04.845506 30647 cluster.cpp:448] Creating default 'local' authorizer
I0516 09:09:04.848289 30677 slave.cpp:225] Mesos agent started on (750)@172.17.0.3:38296
I0516 09:09:04.848335 30677 slave.cpp:226] Flags at startup: --acls="" --appc_simple_discovery_uri_prefix="http://"
--appc_store_dir="/tmp/mesos/store/appc" --authenticate_http_readonly="true" --authenticate_http_readwrite="true"
--authenticatee="crammd5" --authentication_backoff_factor="1secs" --authorizer="local" --cgroups_cpu_enable_pids_and_tids_count="false"
--cgroups_enable_cfs="false" --cgroups_hierarchy="/sys/fs/cgroup" --cgroups_limit_swap="false"
--cgroups_root="mesos" --container_disk_watch_interval="15secs" --containerizers="mesos" --credential="/tmp/Endpoint_SlaveEndpointTest_NoAuthorizer_1_ldDHcq/credential"
--default_role="*" --disk_watch_interval="1mins" --docker="docker" --docker_kill_orphans="true"
--docker_registry="https://registry-1.docker.io" --docker_remove_delay="6hrs" --docker_socket="/var/run/docker.sock"
--docker_stop_timeout="0ns" --docker_store_dir="/tmp/mesos/store/docker" --docker_volume_checkpoint_dir="/var/run/mesos/isolators/docker/volume"
--enforce_container_disk_quota="false" --executor_registration_timeout="1mins" --executor_shutdown_grace_period="5secs"
--fetcher_cache_dir="/tmp/Endpoint_SlaveEndpointTest_NoAuthorizer_1_ldDHcq/fetch" --fetcher_cache_size="2GB"
--frameworks_home="" --gc_delay="1weeks" --gc_disk_headroom="0.1" --hadoop_home="" --help="false"
--hostname_lookup="true" --http_command_executor="false" --http_credentials="/tmp/Endpoint_SlaveEndpointTest_NoAuthorizer_1_ldDHcq/http_credentials"
--http_heartbeat_interval="30secs" --initialize_driver_logging="true" --isolation="posix/cpu,posix/mem"
--launcher="posix" --launcher_dir="/mesos/mesos-1.3.0/_build/src" --logbufsecs="0" --logging_level="INFO"
--max_completed_executors_per_framework="150" --oversubscribed_resources_interval="15secs"
--perf_duration="10secs" --perf_interval="1mins" --port="5051" --qos_correction_interval_min="0ns"
--quiet="false" --recover="reconnect" --recovery_timeout="15mins" --registration_backoff_factor="10ms"
--resources="cpus:2;gpus:0;mem:1024;disk:1024;ports:[31000-32000]" --revocable_cpu_low_priority="true"
--runtime_dir="/tmp/Endpoint_SlaveEndpointTest_NoAuthorizer_1_ldDHcq" --sandbox_directory="/mnt/mesos/sandbox"
--strict="true" --switch_user="true" --systemd_enable_support="true" --systemd_runtime_directory="/run/systemd/system"
--version="false" --work_dir="/tmp/Endpoint_SlaveEndpointTest_NoAuthorizer_1_uJpa3U"
I0516 09:09:04.848862 30677 credentials.hpp:86] Loading credential for authentication from
'/tmp/Endpoint_SlaveEndpointTest_NoAuthorizer_1_ldDHcq/credential'
I0516 09:09:04.849182 30677 slave.cpp:258] Agent using credential for: test-principal
I0516 09:09:04.849210 30677 credentials.hpp:37] Loading credentials for authentication from
'/tmp/Endpoint_SlaveEndpointTest_NoAuthorizer_1_ldDHcq/http_credentials'
I0516 09:09:04.849566 30677 http.cpp:975] Creating default 'basic' HTTP authenticator for
realm 'mesos-agent-readonly'
I0516 09:09:04.849843 30677 http.cpp:975] Creating default 'basic' HTTP authenticator for
realm 'mesos-agent-readwrite'
I0516 09:09:04.851243 30677 slave.cpp:525] Agent resources: cpus(*):2; mem(*):1024; disk(*):1024;
ports(*):[31000-32000]
I0516 09:09:04.851325 30677 slave.cpp:533] Agent attributes: [  ]
I0516 09:09:04.851501 30677 slave.cpp:538] Agent hostname: d08d3bc3551d
I0516 09:09:04.851757 30672 status_update_manager.cpp:177] Pausing sending status updates
I0516 09:09:04.853394 30668 state.cpp:62] Recovering state from '/tmp/Endpoint_SlaveEndpointTest_NoAuthorizer_1_uJpa3U/meta'
I0516 09:09:04.853842 30679 status_update_manager.cpp:203] Recovering status update manager
I0516 09:09:04.854271 30679 containerizer.cpp:608] Recovering containerizer
I0516 09:09:04.856742 30679 provisioner.cpp:410] Provisioner recovery complete
I0516 09:09:04.857190 30677 slave.cpp:5970] Finished recovery
I0516 09:09:04.857934 30677 slave.cpp:6152] Querying resource estimator for oversubscribable
resources
I0516 09:09:04.858353 30674 slave.cpp:6166] Received oversubscribable resources {} from the
resource estimator
I0516 09:09:04.863173 30674 process.cpp:3731] Handling HTTP event for process 'slave(750)'
with path: '/slave(750)/monitor/statistics.json'
I0516 09:09:04.865131 30678 http.cpp:1115] HTTP GET for /slave(750)/monitor/statistics.json
from 172.17.0.3:36422
I0516 09:09:04.865495 30678 http.cpp:936] Authorizing principal 'test-principal' to GET the
'/monitor/statistics.json' endpoint
I0516 09:09:04.870582 30675 slave.cpp:790] Agent terminating
[       OK ] Endpoint/SlaveEndpointTest.NoAuthorizer/1 (43 ms)
[ RUN      ] Endpoint/SlaveEndpointTest.NoAuthorizer/2
I0516 09:09:04.882997 30647 containerizer.cpp:221] Using isolation: posix/cpu,posix/mem,filesystem/posix,network/cni
W0516 09:09:04.884110 30647 backend.cpp:76] Failed to create 'aufs' backend: AufsBackend requires
root privileges
W0516 09:09:04.884346 30647 backend.cpp:76] Failed to create 'bind' backend: BindBackend requires
root privileges
I0516 09:09:04.884493 30647 provisioner.cpp:249] Using default backend 'copy'
I0516 09:09:04.886667 30647 cluster.cpp:448] Creating default 'local' authorizer
I0516 09:09:04.893380 30666 slave.cpp:225] Mesos agent started on (751)@172.17.0.3:38296
I0516 09:09:04.893766 30666 slave.cpp:226] Flags at startup: --acls="" --appc_simple_discovery_uri_prefix="http://"
--appc_store_dir="/tmp/mesos/store/appc" --authenticate_http_readonly="true" --authenticate_http_readwrite="true"
--authenticatee="crammd5" --authentication_backoff_factor="1secs" --authorizer="local" --cgroups_cpu_enable_pids_and_tids_count="false"
--cgroups_enable_cfs="false" --cgroups_hierarchy="/sys/fs/cgroup" --cgroups_limit_swap="false"
--cgroups_root="mesos" --container_disk_watch_interval="15secs" --containerizers="mesos" --credential="/tmp/Endpoint_SlaveEndpointTest_NoAuthorizer_2_3i9ncr/credential"
--default_role="*" --disk_watch_interval="1mins" --docker="docker" --docker_kill_orphans="true"
--docker_registry="https://registry-1.docker.io" --docker_remove_delay="6hrs" --docker_socket="/var/run/docker.sock"
--docker_stop_timeout="0ns" --docker_store_dir="/tmp/mesos/store/docker" --docker_volume_checkpoint_dir="/var/run/mesos/isolators/docker/volume"
--enforce_container_disk_quota="false" --executor_registration_timeout="1mins" --executor_shutdown_grace_period="5secs"
--fetcher_cache_dir="/tmp/Endpoint_SlaveEndpointTest_NoAuthorizer_2_3i9ncr/fetch" --fetcher_cache_size="2GB"
--frameworks_home="" --gc_delay="1weeks" --gc_disk_headroom="0.1" --hadoop_home="" --help="false"
--hostname_lookup="true" --http_command_executor="false" --http_credentials="/tmp/Endpoint_SlaveEndpointTest_NoAuthorizer_2_3i9ncr/http_credentials"
--http_heartbeat_interval="30secs" --initialize_driver_logging="true" --isolation="posix/cpu,posix/mem"
--launcher="posix" --launcher_dir="/mesos/mesos-1.3.0/_build/src" --logbufsecs="0" --logging_level="INFO"
--max_completed_executors_per_framework="150" --oversubscribed_resources_interval="15secs"
--perf_duration="10secs" --perf_interval="1mins" --port="5051" --qos_correction_interval_min="0ns"
--quiet="false" --recover="reconnect" --recovery_timeout="15mins" --registration_backoff_factor="10ms"
--resources="cpus:2;gpus:0;mem:1024;disk:1024;ports:[31000-32000]" --revocable_cpu_low_priority="true"
--runtime_dir="/tmp/Endpoint_SlaveEndpointTest_NoAuthorizer_2_3i9ncr" --sandbox_directory="/mnt/mesos/sandbox"
--strict="true" --switch_user="true" --systemd_enable_support="true" --systemd_runtime_directory="/run/systemd/system"
--version="false" --work_dir="/tmp/Endpoint_SlaveEndpointTest_NoAuthorizer_2_mxWYVV"
I0516 09:09:04.895079 30666 credentials.hpp:86] Loading credential for authentication from
'/tmp/Endpoint_SlaveEndpointTest_NoAuthorizer_2_3i9ncr/credential'
I0516 09:09:04.895591 30666 slave.cpp:258] Agent using credential for: test-principal
I0516 09:09:04.895900 30666 credentials.hpp:37] Loading credentials for authentication from
'/tmp/Endpoint_SlaveEndpointTest_NoAuthorizer_2_3i9ncr/http_credentials'
I0516 09:09:04.896438 30666 http.cpp:975] Creating default 'basic' HTTP authenticator for
realm 'mesos-agent-readonly'
I0516 09:09:04.896657 30666 http.cpp:975] Creating default 'basic' HTTP authenticator for
realm 'mesos-agent-readwrite'
I0516 09:09:04.898506 30666 slave.cpp:525] Agent resources: cpus(*):2; mem(*):1024; disk(*):1024;
ports(*):[31000-32000]
I0516 09:09:04.898742 30666 slave.cpp:533] Agent attributes: [  ]
I0516 09:09:04.898778 30666 slave.cpp:538] Agent hostname: d08d3bc3551d
I0516 09:09:04.899251 30671 status_update_manager.cpp:177] Pausing sending status updates
I0516 09:09:04.901023 30667 state.cpp:62] Recovering state from '/tmp/Endpoint_SlaveEndpointTest_NoAuthorizer_2_mxWYVV/meta'
I0516 09:09:04.901794 30667 status_update_manager.cpp:203] Recovering status update manager
I0516 09:09:04.902056 30668 containerizer.cpp:608] Recovering containerizer
I0516 09:09:04.904352 30668 provisioner.cpp:410] Provisioner recovery complete
I0516 09:09:04.905283 30673 slave.cpp:5970] Finished recovery
I0516 09:09:04.906880 30673 slave.cpp:6152] Querying resource estimator for oversubscribable
resources
I0516 09:09:04.907296 30680 slave.cpp:6166] Received oversubscribable resources {} from the
resource estimator
I0516 09:09:04.910802 30679 process.cpp:3731] Handling HTTP event for process 'slave(751)'
with path: '/slave(751)/containers'
I0516 09:09:04.912421 30680 http.cpp:1115] HTTP GET for /slave(751)/containers from 172.17.0.3:36424
I0516 09:09:04.912503 30680 http.cpp:936] Authorizing principal 'test-principal' to GET the
'/containers' endpoint
I0516 09:09:04.917639 30667 slave.cpp:790] Agent terminating
[       OK ] Endpoint/SlaveEndpointTest.NoAuthorizer/2 (46 ms)
[----------] 9 tests from Endpoint/SlaveEndpointTest (376 ms total)

[----------] Global test environment tear-down
[==========] 1571 tests from 175 test cases ran. (472871 ms total)
[  PASSED  ] 1570 tests.
[  FAILED  ] 1 test, listed below:
[  FAILED  ] MasterTest.IgnoreOldAgentReregistration

 1 FAILED TEST
  YOU HAVE 19 DISABLED TESTS

E0516 09:09:04.982054 30682 process.cpp:951] Failed to accept socket: future discarded
make[4]: *** [check-local] Error 1
make[4]: Leaving directory `/mesos/mesos-1.3.0/_build/src'
make[3]: *** [check-am] Error 2
make[3]: Leaving directory `/mesos/mesos-1.3.0/_build/src'
make[2]: *** [check] Error 2
make[2]: Leaving directory `/mesos/mesos-1.3.0/_build/src'
make[1]: *** [check-recursive] Error 1
make[1]: Leaving directory `/mesos/mesos-1.3.0/_build'
make: *** [distcheck] Error 1
+ docker rmi mesos-1494922740-21453
Untagged: mesos-1494922740-21453:latest
Deleted: sha256:2723363895aaaa4a14eebdf421949e16c59133b6ebcf4ffc75225ffdf9ee6b5f
Deleted: sha256:7da564aad62c734209f20b98b25062e0b34a89cdf35958e2beab2025387ac3bb
Deleted: sha256:e374994a97facbec7d1be17a6a2052f26b64baf236b5e9d83591fd771829c8f2
Deleted: sha256:daa64f2ad417ba75d3c7fdb4384e083ced66e74254fb549598677accacba0844
Deleted: sha256:57767663c21b3150447c4e7d571903d4e773416cd0a6e9fb2bf8a8976335b321
Deleted: sha256:1ab5bc709023d771031d71caf4d9481d83fe658276b816696128de18ae77c1d2
Deleted: sha256:d4e373f33b4d4da72d6066e39e04b487867d1bf2d9c752c6d7f4ec0c99ce9109
Deleted: sha256:054a023395f3a94a23a1beaa28a97351b4a8123a4e4557f755ba80d40404a79c
Deleted: sha256:8f7312cbc028e6ad3e74323c41cf4c84b308484e9243ce3b172e9a83c347ebb5
Deleted: sha256:344cb1ca3b34f1bdc63d1f6f18a322f4d5bf375e9583beb05d39a44cec09db17
Deleted: sha256:4bba95587a62c3c772a88d2d71fb0c3e9392499713aadbcd0061f701c2756cb3
Deleted: sha256:58963be2d83e2f1a72500d964680c2094814c9c7e553e3bc132ce5e783f91f53
Deleted: sha256:1277a41e5bb3070ff19599d8db160e6ce7e86f23435b991eefdcbfe0ec4c504a
Deleted: sha256:497d04bab547b10df2ea6c78e2b4c1f70ad72d38bcf6a2be98d44fbe03d25250
Deleted: sha256:d5ea71d61acd26fba2930c31bafc70690cdf551aaa2573829e98375c165b848c
Deleted: sha256:5d2765ccf101a597ad39d700c613091c72b86cfcb31e0f0b785924f0d1e4f80e
Deleted: sha256:ce28320e818307fce162cac13600a6d43fa5a8fafa7e807b44190187305f64be
Deleted: sha256:97c59393e7e1a6c39c3ba3b501f56f18aed2b6bc9b9ce0ca887857306f2f6d31
Deleted: sha256:3953012ab2bf354f437194e2b4429ccf97b898ecd888737b7e2767605da08388
Deleted: sha256:3c40bf1981c74ffc7c9984c0a77a18b402a5176a55736d483dd1f55469c7b69b
Deleted: sha256:fbbdbb70b5f8a040d724451b0a74351eee1a01be1ba97fa08a73faa156594b07
Deleted: sha256:85823a1c136f22f164ca1e371a0dc0a05f6038804d0a665a6f6cf53d0b31f046
Deleted: sha256:3e41d4ca1a6c706d89612391e7f290fb694127fcf33d2a68567ca76509e0b31b
Deleted: sha256:7f8802db0977619c592542804a7bf753614a4fbf6900f87a9408f39e28fd37cb
Build step 'Execute shell' marked build as failure
Not sending mail to unregistered user yujie.jay@gmail.com

Mime
View raw message