mesos-builds mailing list archives

Site index · List index
Message view « Date » · « Thread »
Top « Date » · « Thread »
From Apache Jenkins Server <jenk...@builds.apache.org>
Subject Build failed in Jenkins: Mesos-Reviewbot #18193
Date Fri, 26 May 2017 20:42:17 GMT
See <https://builds.apache.org/job/Mesos-Reviewbot/18193/display/redirect>

------------------------------------------
[...truncated 27.47 MB...]
I0526 20:42:09.044981  4683 slave.cpp:801] Agent terminating
[       OK ] Endpoint/SlaveEndpointTest.AuthorizedRequest/1 (28 ms)
[ RUN      ] Endpoint/SlaveEndpointTest.AuthorizedRequest/2
I0526 20:42:09.068825  4661 containerizer.cpp:230] Using isolation: posix/cpu,posix/mem,filesystem/posix,network/cni,environment_secret
W0526 20:42:09.069396  4661 backend.cpp:76] Failed to create 'aufs' backend: AufsBackend requires
root privileges
W0526 20:42:09.069501  4661 backend.cpp:76] Failed to create 'bind' backend: BindBackend requires
root privileges
I0526 20:42:09.069620  4661 provisioner.cpp:255] Using default backend 'copy'
I0526 20:42:09.073048  4684 slave.cpp:232] Mesos agent started on (747)@172.17.0.2:47947
I0526 20:42:09.073079  4684 slave.cpp:233] Flags at startup: --acls="" --appc_simple_discovery_uri_prefix="http://"
--appc_store_dir="/tmp/mesos/store/appc" --authenticate_http_readonly="true" --authenticate_http_readwrite="true"
--authenticatee="crammd5" --authentication_backoff_factor="1secs" --authorizer="local" --cgroups_cpu_enable_pids_and_tids_count="false"
--cgroups_enable_cfs="false" --cgroups_hierarchy="/sys/fs/cgroup" --cgroups_limit_swap="false"
--cgroups_root="mesos" --container_disk_watch_interval="15secs" --containerizers="mesos" --credential="/tmp/Endpoint_SlaveEndpointTest_AuthorizedRequest_2_qPzD5f/credential"
--default_role="*" --disk_watch_interval="1mins" --docker="docker" --docker_kill_orphans="true"
--docker_registry="https://registry-1.docker.io" --docker_remove_delay="6hrs" --docker_socket="/var/run/docker.sock"
--docker_stop_timeout="0ns" --docker_store_dir="/tmp/mesos/store/docker" --docker_volume_checkpoint_dir="/var/run/mesos/isolators/docker/volume"
--enforce_container_disk_quota="false" --executor_registration_timeout="1mins" --executor_reregistration_timeout="2secs"
--executor_shutdown_grace_period="5secs" --fetcher_cache_dir="/tmp/Endpoint_SlaveEndpointTest_AuthorizedRequest_2_qPzD5f/fetch"
--fetcher_cache_size="2GB" --frameworks_home="" --gc_delay="1weeks" --gc_disk_headroom="0.1"
--hadoop_home="" --help="false" --hostname_lookup="true" --http_command_executor="false" --http_credentials="/tmp/Endpoint_SlaveEndpointTest_AuthorizedRequest_2_qPzD5f/http_credentials"
--http_heartbeat_interval="30secs" --initialize_driver_logging="true" --isolation="posix/cpu,posix/mem"
--launcher="posix" --launcher_dir="/mesos/mesos-1.4.0/_build/src" --logbufsecs="0" --logging_level="INFO"
--max_completed_executors_per_framework="150" --oversubscribed_resources_interval="15secs"
--perf_duration="10secs" --perf_interval="1mins" --port="5051" --qos_correction_interval_min="0ns"
--quiet="false" --recover="reconnect" --recovery_timeout="15mins" --registration_backoff_factor="10ms"
--resources="cpus:2;gpus:0;mem:1024;disk:1024;ports:[31000-32000]" --revocable_cpu_low_priority="true"
--runtime_dir="/tmp/Endpoint_SlaveEndpointTest_AuthorizedRequest_2_qPzD5f" --sandbox_directory="/mnt/mesos/sandbox"
--strict="true" --switch_user="true" --systemd_enable_support="true" --systemd_runtime_directory="/run/systemd/system"
--version="false" --work_dir="/tmp/Endpoint_SlaveEndpointTest_AuthorizedRequest_2_12CXN2"
I0526 20:42:09.073693  4684 credentials.hpp:86] Loading credential for authentication from
'/tmp/Endpoint_SlaveEndpointTest_AuthorizedRequest_2_qPzD5f/credential'
I0526 20:42:09.073912  4684 slave.cpp:265] Agent using credential for: test-principal
I0526 20:42:09.073938  4684 credentials.hpp:37] Loading credentials for authentication from
'/tmp/Endpoint_SlaveEndpointTest_AuthorizedRequest_2_qPzD5f/http_credentials'
I0526 20:42:09.074254  4684 http.cpp:975] Creating default 'basic' HTTP authenticator for
realm 'mesos-agent-readonly'
I0526 20:42:09.074411  4684 http.cpp:975] Creating default 'basic' HTTP authenticator for
realm 'mesos-agent-readwrite'
I0526 20:42:09.075616  4684 slave.cpp:536] Agent resources: cpus(*):2; mem(*):1024; disk(*):1024;
ports(*):[31000-32000]
I0526 20:42:09.075686  4684 slave.cpp:544] Agent attributes: [  ]
I0526 20:42:09.075700  4684 slave.cpp:549] Agent hostname: 492b0bbcd8e0
I0526 20:42:09.075829  4686 status_update_manager.cpp:177] Pausing sending status updates
I0526 20:42:09.077317  4686 state.cpp:62] Recovering state from '/tmp/Endpoint_SlaveEndpointTest_AuthorizedRequest_2_12CXN2/meta'
I0526 20:42:09.077774  4688 status_update_manager.cpp:203] Recovering status update manager
I0526 20:42:09.078002  4681 containerizer.cpp:582] Recovering containerizer
I0526 20:42:09.079488  4685 provisioner.cpp:416] Provisioner recovery complete
I0526 20:42:09.079866  4684 slave.cpp:6073] Finished recovery
I0526 20:42:09.080448  4684 slave.cpp:6255] Querying resource estimator for oversubscribable
resources
I0526 20:42:09.080788  4695 slave.cpp:6269] Received oversubscribable resources {} from the
resource estimator
I0526 20:42:09.083693  4684 process.cpp:3730] Handling HTTP event for process 'slave(747)'
with path: '/slave(747)/containers'
I0526 20:42:09.085130  4690 http.cpp:1115] HTTP GET for /slave(747)/containers from 172.17.0.2:40252
I0526 20:42:09.085212  4690 http.cpp:936] Authorizing principal 'test-principal' to GET the
'/containers' endpoint
I0526 20:42:09.089074  4695 slave.cpp:801] Agent terminating
[       OK ] Endpoint/SlaveEndpointTest.AuthorizedRequest/2 (31 ms)
[ RUN      ] Endpoint/SlaveEndpointTest.UnauthorizedRequest/0
I0526 20:42:09.102365  4661 containerizer.cpp:230] Using isolation: posix/cpu,posix/mem,filesystem/posix,network/cni,environment_secret
W0526 20:42:09.102946  4661 backend.cpp:76] Failed to create 'aufs' backend: AufsBackend requires
root privileges
W0526 20:42:09.103061  4661 backend.cpp:76] Failed to create 'bind' backend: BindBackend requires
root privileges
I0526 20:42:09.103104  4661 provisioner.cpp:255] Using default backend 'copy'
I0526 20:42:09.106711  4682 slave.cpp:232] Mesos agent started on (748)@172.17.0.2:47947
I0526 20:42:09.106751  4682 slave.cpp:233] Flags at startup: --acls="" --appc_simple_discovery_uri_prefix="http://"
--appc_store_dir="/tmp/mesos/store/appc" --authenticate_http_readonly="true" --authenticate_http_readwrite="true"
--authenticatee="crammd5" --authentication_backoff_factor="1secs" --authorizer="local" --cgroups_cpu_enable_pids_and_tids_count="false"
--cgroups_enable_cfs="false" --cgroups_hierarchy="/sys/fs/cgroup" --cgroups_limit_swap="false"
--cgroups_root="mesos" --container_disk_watch_interval="15secs" --containerizers="mesos" --credential="/tmp/Endpoint_SlaveEndpointTest_UnauthorizedRequest_0_EChpw7/credential"
--default_role="*" --disk_watch_interval="1mins" --docker="docker" --docker_kill_orphans="true"
--docker_registry="https://registry-1.docker.io" --docker_remove_delay="6hrs" --docker_socket="/var/run/docker.sock"
--docker_stop_timeout="0ns" --docker_store_dir="/tmp/mesos/store/docker" --docker_volume_checkpoint_dir="/var/run/mesos/isolators/docker/volume"
--enforce_container_disk_quota="false" --executor_registration_timeout="1mins" --executor_reregistration_timeout="2secs"
--executor_shutdown_grace_period="5secs" --fetcher_cache_dir="/tmp/Endpoint_SlaveEndpointTest_UnauthorizedRequest_0_EChpw7/fetch"
--fetcher_cache_size="2GB" --frameworks_home="" --gc_delay="1weeks" --gc_disk_headroom="0.1"
--hadoop_home="" --help="false" --hostname_lookup="true" --http_command_executor="false" --http_credentials="/tmp/Endpoint_SlaveEndpointTest_UnauthorizedRequest_0_EChpw7/http_credentials"
--http_heartbeat_interval="30secs" --initialize_driver_logging="true" --isolation="posix/cpu,posix/mem"
--launcher="posix" --launcher_dir="/mesos/mesos-1.4.0/_build/src" --logbufsecs="0" --logging_level="INFO"
--max_completed_executors_per_framework="150" --oversubscribed_resources_interval="15secs"
--perf_duration="10secs" --perf_interval="1mins" --port="5051" --qos_correction_interval_min="0ns"
--quiet="false" --recover="reconnect" --recovery_timeout="15mins" --registration_backoff_factor="10ms"
--resources="cpus:2;gpus:0;mem:1024;disk:1024;ports:[31000-32000]" --revocable_cpu_low_priority="true"
--runtime_dir="/tmp/Endpoint_SlaveEndpointTest_UnauthorizedRequest_0_EChpw7" --sandbox_directory="/mnt/mesos/sandbox"
--strict="true" --switch_user="true" --systemd_enable_support="true" --systemd_runtime_directory="/run/systemd/system"
--version="false" --work_dir="/tmp/Endpoint_SlaveEndpointTest_UnauthorizedRequest_0_5YKk9T"
I0526 20:42:09.107378  4682 credentials.hpp:86] Loading credential for authentication from
'/tmp/Endpoint_SlaveEndpointTest_UnauthorizedRequest_0_EChpw7/credential'
I0526 20:42:09.107592  4682 slave.cpp:265] Agent using credential for: test-principal
I0526 20:42:09.107614  4682 credentials.hpp:37] Loading credentials for authentication from
'/tmp/Endpoint_SlaveEndpointTest_UnauthorizedRequest_0_EChpw7/http_credentials'
I0526 20:42:09.107869  4682 http.cpp:975] Creating default 'basic' HTTP authenticator for
realm 'mesos-agent-readonly'
I0526 20:42:09.108027  4682 http.cpp:975] Creating default 'basic' HTTP authenticator for
realm 'mesos-agent-readwrite'
I0526 20:42:09.109258  4682 slave.cpp:536] Agent resources: cpus(*):2; mem(*):1024; disk(*):1024;
ports(*):[31000-32000]
I0526 20:42:09.109329  4682 slave.cpp:544] Agent attributes: [  ]
I0526 20:42:09.109342  4682 slave.cpp:549] Agent hostname: 492b0bbcd8e0
I0526 20:42:09.109498  4689 status_update_manager.cpp:177] Pausing sending status updates
I0526 20:42:09.110867  4681 state.cpp:62] Recovering state from '/tmp/Endpoint_SlaveEndpointTest_UnauthorizedRequest_0_5YKk9T/meta'
I0526 20:42:09.111357  4693 status_update_manager.cpp:203] Recovering status update manager
I0526 20:42:09.111680  4692 containerizer.cpp:582] Recovering containerizer
I0526 20:42:09.113436  4694 provisioner.cpp:416] Provisioner recovery complete
I0526 20:42:09.113873  4694 slave.cpp:6073] Finished recovery
I0526 20:42:09.114454  4694 slave.cpp:6255] Querying resource estimator for oversubscribable
resources
I0526 20:42:09.114713  4695 slave.cpp:6269] Received oversubscribable resources {} from the
resource estimator
I0526 20:42:09.117453  4683 process.cpp:3730] Handling HTTP event for process 'slave(748)'
with path: '/slave(748)/monitor/statistics'
I0526 20:42:09.118906  4681 http.cpp:1115] HTTP GET for /slave(748)/monitor/statistics from
172.17.0.2:40253
I0526 20:42:09.119029  4681 http.cpp:936] Authorizing principal 'test-principal' to GET the
'/monitor/statistics' endpoint
I0526 20:42:09.121752  4689 slave.cpp:801] Agent terminating
[       OK ] Endpoint/SlaveEndpointTest.UnauthorizedRequest/0 (30 ms)
[ RUN      ] Endpoint/SlaveEndpointTest.UnauthorizedRequest/1
I0526 20:42:09.133395  4661 containerizer.cpp:230] Using isolation: posix/cpu,posix/mem,filesystem/posix,network/cni,environment_secret
W0526 20:42:09.134011  4661 backend.cpp:76] Failed to create 'aufs' backend: AufsBackend requires
root privileges
W0526 20:42:09.134122  4661 backend.cpp:76] Failed to create 'bind' backend: BindBackend requires
root privileges
I0526 20:42:09.134168  4661 provisioner.cpp:255] Using default backend 'copy'
I0526 20:42:09.137699  4692 slave.cpp:232] Mesos agent started on (749)@172.17.0.2:47947
I0526 20:42:09.137745  4692 slave.cpp:233] Flags at startup: --acls="" --appc_simple_discovery_uri_prefix="http://"
--appc_store_dir="/tmp/mesos/store/appc" --authenticate_http_readonly="true" --authenticate_http_readwrite="true"
--authenticatee="crammd5" --authentication_backoff_factor="1secs" --authorizer="local" --cgroups_cpu_enable_pids_and_tids_count="false"
--cgroups_enable_cfs="false" --cgroups_hierarchy="/sys/fs/cgroup" --cgroups_limit_swap="false"
--cgroups_root="mesos" --container_disk_watch_interval="15secs" --containerizers="mesos" --credential="/tmp/Endpoint_SlaveEndpointTest_UnauthorizedRequest_1_UfqQhZ/credential"
--default_role="*" --disk_watch_interval="1mins" --docker="docker" --docker_kill_orphans="true"
--docker_registry="https://registry-1.docker.io" --docker_remove_delay="6hrs" --docker_socket="/var/run/docker.sock"
--docker_stop_timeout="0ns" --docker_store_dir="/tmp/mesos/store/docker" --docker_volume_checkpoint_dir="/var/run/mesos/isolators/docker/volume"
--enforce_container_disk_quota="false" --executor_registration_timeout="1mins" --executor_reregistration_timeout="2secs"
--executor_shutdown_grace_period="5secs" --fetcher_cache_dir="/tmp/Endpoint_SlaveEndpointTest_UnauthorizedRequest_1_UfqQhZ/fetch"
--fetcher_cache_size="2GB" --frameworks_home="" --gc_delay="1weeks" --gc_disk_headroom="0.1"
--hadoop_home="" --help="false" --hostname_lookup="true" --http_command_executor="false" --http_credentials="/tmp/Endpoint_SlaveEndpointTest_UnauthorizedRequest_1_UfqQhZ/http_credentials"
--http_heartbeat_interval="30secs" --initialize_driver_logging="true" --isolation="posix/cpu,posix/mem"
--launcher="posix" --launcher_dir="/mesos/mesos-1.4.0/_build/src" --logbufsecs="0" --logging_level="INFO"
--max_completed_executors_per_framework="150" --oversubscribed_resources_interval="15secs"
--perf_duration="10secs" --perf_interval="1mins" --port="5051" --qos_correction_interval_min="0ns"
--quiet="false" --recover="reconnect" --recovery_timeout="15mins" --registration_backoff_factor="10ms"
--resources="cpus:2;gpus:0;mem:1024;disk:1024;ports:[31000-32000]" --revocable_cpu_low_priority="true"
--runtime_dir="/tmp/Endpoint_SlaveEndpointTest_UnauthorizedRequest_1_UfqQhZ" --sandbox_directory="/mnt/mesos/sandbox"
--strict="true" --switch_user="true" --systemd_enable_support="true" --systemd_runtime_directory="/run/systemd/system"
--version="false" --work_dir="/tmp/Endpoint_SlaveEndpointTest_UnauthorizedRequest_1_z9UIPL"
I0526 20:42:09.138353  4692 credentials.hpp:86] Loading credential for authentication from
'/tmp/Endpoint_SlaveEndpointTest_UnauthorizedRequest_1_UfqQhZ/credential'
I0526 20:42:09.138600  4692 slave.cpp:265] Agent using credential for: test-principal
I0526 20:42:09.138718  4692 credentials.hpp:37] Loading credentials for authentication from
'/tmp/Endpoint_SlaveEndpointTest_UnauthorizedRequest_1_UfqQhZ/http_credentials'
I0526 20:42:09.139006  4692 http.cpp:975] Creating default 'basic' HTTP authenticator for
realm 'mesos-agent-readonly'
I0526 20:42:09.139181  4692 http.cpp:975] Creating default 'basic' HTTP authenticator for
realm 'mesos-agent-readwrite'
I0526 20:42:09.140377  4692 slave.cpp:536] Agent resources: cpus(*):2; mem(*):1024; disk(*):1024;
ports(*):[31000-32000]
I0526 20:42:09.140445  4692 slave.cpp:544] Agent attributes: [  ]
I0526 20:42:09.140460  4692 slave.cpp:549] Agent hostname: 492b0bbcd8e0
I0526 20:42:09.140619  4695 status_update_manager.cpp:177] Pausing sending status updates
I0526 20:42:09.142083  4690 state.cpp:62] Recovering state from '/tmp/Endpoint_SlaveEndpointTest_UnauthorizedRequest_1_z9UIPL/meta'
I0526 20:42:09.142675  4685 status_update_manager.cpp:203] Recovering status update manager
I0526 20:42:09.142879  4692 containerizer.cpp:582] Recovering containerizer
I0526 20:42:09.144497  4681 provisioner.cpp:416] Provisioner recovery complete
I0526 20:42:09.144901  4691 slave.cpp:6073] Finished recovery
I0526 20:42:09.145457  4691 slave.cpp:6255] Querying resource estimator for oversubscribable
resources
I0526 20:42:09.145804  4687 slave.cpp:6269] Received oversubscribable resources {} from the
resource estimator
I0526 20:42:09.148885  4681 process.cpp:3730] Handling HTTP event for process 'slave(749)'
with path: '/slave(749)/monitor/statistics.json'
I0526 20:42:09.150431  4690 http.cpp:1115] HTTP GET for /slave(749)/monitor/statistics.json
from 172.17.0.2:40254
I0526 20:42:09.150557  4690 http.cpp:936] Authorizing principal 'test-principal' to GET the
'/monitor/statistics.json' endpoint
I0526 20:42:09.153149  4687 slave.cpp:801] Agent terminating
[       OK ] Endpoint/SlaveEndpointTest.UnauthorizedRequest/1 (30 ms)
[ RUN      ] Endpoint/SlaveEndpointTest.UnauthorizedRequest/2
I0526 20:42:09.163123  4661 containerizer.cpp:230] Using isolation: posix/cpu,posix/mem,filesystem/posix,network/cni,environment_secret
W0526 20:42:09.163646  4661 backend.cpp:76] Failed to create 'aufs' backend: AufsBackend requires
root privileges
W0526 20:42:09.163748  4661 backend.cpp:76] Failed to create 'bind' backend: BindBackend requires
root privileges
I0526 20:42:09.163790  4661 provisioner.cpp:255] Using default backend 'copy'
I0526 20:42:09.168043  4689 slave.cpp:232] Mesos agent started on (750)@172.17.0.2:47947
I0526 20:42:09.168084  4689 slave.cpp:233] Flags at startup: --acls="" --appc_simple_discovery_uri_prefix="http://"
--appc_store_dir="/tmp/mesos/store/appc" --authenticate_http_readonly="true" --authenticate_http_readwrite="true"
--authenticatee="crammd5" --authentication_backoff_factor="1secs" --authorizer="local" --cgroups_cpu_enable_pids_and_tids_count="false"
--cgroups_enable_cfs="false" --cgroups_hierarchy="/sys/fs/cgroup" --cgroups_limit_swap="false"
--cgroups_root="mesos" --container_disk_watch_interval="15secs" --containerizers="mesos" --credential="/tmp/Endpoint_SlaveEndpointTest_UnauthorizedRequest_2_3FuZmR/credential"
--default_role="*" --disk_watch_interval="1mins" --docker="docker" --docker_kill_orphans="true"
--docker_registry="https://registry-1.docker.io" --docker_remove_delay="6hrs" --docker_socket="/var/run/docker.sock"
--docker_stop_timeout="0ns" --docker_store_dir="/tmp/mesos/store/docker" --docker_volume_checkpoint_dir="/var/run/mesos/isolators/docker/volume"
--enforce_container_disk_quota="false" --executor_registration_timeout="1mins" --executor_reregistration_timeout="2secs"
--executor_shutdown_grace_period="5secs" --fetcher_cache_dir="/tmp/Endpoint_SlaveEndpointTest_UnauthorizedRequest_2_3FuZmR/fetch"
--fetcher_cache_size="2GB" --frameworks_home="" --gc_delay="1weeks" --gc_disk_headroom="0.1"
--hadoop_home="" --help="false" --hostname_lookup="true" --http_command_executor="false" --http_credentials="/tmp/Endpoint_SlaveEndpointTest_UnauthorizedRequest_2_3FuZmR/http_credentials"
--http_heartbeat_interval="30secs" --initialize_driver_logging="true" --isolation="posix/cpu,posix/mem"
--launcher="posix" --launcher_dir="/mesos/mesos-1.4.0/_build/src" --logbufsecs="0" --logging_level="INFO"
--max_completed_executors_per_framework="150" --oversubscribed_resources_interval="15secs"
--perf_duration="10secs" --perf_interval="1mins" --port="5051" --qos_correction_interval_min="0ns"
--quiet="false" --recover="reconnect" --recovery_timeout="15mins" --registration_backoff_factor="10ms"
--resources="cpus:2;gpus:0;mem:1024;disk:1024;ports:[31000-32000]" --revocable_cpu_low_priority="true"
--runtime_dir="/tmp/Endpoint_SlaveEndpointTest_UnauthorizedRequest_2_3FuZmR" --sandbox_directory="/mnt/mesos/sandbox"
--strict="true" --switch_user="true" --systemd_enable_support="true" --systemd_runtime_directory="/run/systemd/system"
--version="false" --work_dir="/tmp/Endpoint_SlaveEndpointTest_UnauthorizedRequest_2_OFCZPD"
I0526 20:42:09.168541  4689 credentials.hpp:86] Loading credential for authentication from
'/tmp/Endpoint_SlaveEndpointTest_UnauthorizedRequest_2_3FuZmR/credential'
I0526 20:42:09.168740  4689 slave.cpp:265] Agent using credential for: test-principal
I0526 20:42:09.168763  4689 credentials.hpp:37] Loading credentials for authentication from
'/tmp/Endpoint_SlaveEndpointTest_UnauthorizedRequest_2_3FuZmR/http_credentials'
I0526 20:42:09.169008  4689 http.cpp:975] Creating default 'basic' HTTP authenticator for
realm 'mesos-agent-readonly'
I0526 20:42:09.169173  4689 http.cpp:975] Creating default 'basic' HTTP authenticator for
realm 'mesos-agent-readwrite'
I0526 20:42:09.170415  4689 slave.cpp:536] Agent resources: cpus(*):2; mem(*):1024; disk(*):1024;
ports(*):[31000-32000]
I0526 20:42:09.170483  4689 slave.cpp:544] Agent attributes: [  ]
I0526 20:42:09.170496  4689 slave.cpp:549] Agent hostname: 492b0bbcd8e0
I0526 20:42:09.170625  4695 status_update_manager.cpp:177] Pausing sending status updates
I0526 20:42:09.172056  4681 state.cpp:62] Recovering state from '/tmp/Endpoint_SlaveEndpointTest_UnauthorizedRequest_2_OFCZPD/meta'
I0526 20:42:09.172422  4691 status_update_manager.cpp:203] Recovering status update manager
I0526 20:42:09.172680  4681 containerizer.cpp:582] Recovering containerizer
I0526 20:42:09.174460  4683 provisioner.cpp:416] Provisioner recovery complete
I0526 20:42:09.174876  4682 slave.cpp:6073] Finished recovery
I0526 20:42:09.175470  4682 slave.cpp:6255] Querying resource estimator for oversubscribable
resources
I0526 20:42:09.175758  4685 slave.cpp:6269] Received oversubscribable resources {} from the
resource estimator
I0526 20:42:09.178758  4687 process.cpp:3730] Handling HTTP event for process 'slave(750)'
with path: '/slave(750)/containers'
I0526 20:42:09.180174  4687 http.cpp:1115] HTTP GET for /slave(750)/containers from 172.17.0.2:40255
I0526 20:42:09.180261  4687 http.cpp:936] Authorizing principal 'test-principal' to GET the
'/containers' endpoint
I0526 20:42:09.182901  4683 slave.cpp:801] Agent terminating
[       OK ] Endpoint/SlaveEndpointTest.UnauthorizedRequest/2 (30 ms)
[ RUN      ] Endpoint/SlaveEndpointTest.NoAuthorizer/0
I0526 20:42:09.202932  4661 containerizer.cpp:230] Using isolation: posix/cpu,posix/mem,filesystem/posix,network/cni,environment_secret
W0526 20:42:09.203614  4661 backend.cpp:76] Failed to create 'aufs' backend: AufsBackend requires
root privileges
W0526 20:42:09.203745  4661 backend.cpp:76] Failed to create 'bind' backend: BindBackend requires
root privileges
I0526 20:42:09.203794  4661 provisioner.cpp:255] Using default backend 'copy'
I0526 20:42:09.205756  4661 cluster.cpp:448] Creating default 'local' authorizer
I0526 20:42:09.207465  4681 slave.cpp:232] Mesos agent started on (751)@172.17.0.2:47947
I0526 20:42:09.207489  4681 slave.cpp:233] Flags at startup: --acls="" --appc_simple_discovery_uri_prefix="http://"
--appc_store_dir="/tmp/mesos/store/appc" --authenticate_http_readonly="true" --authenticate_http_readwrite="true"
--authenticatee="crammd5" --authentication_backoff_factor="1secs" --authorizer="local" --cgroups_cpu_enable_pids_and_tids_count="false"
--cgroups_enable_cfs="false" --cgroups_hierarchy="/sys/fs/cgroup" --cgroups_limit_swap="false"
--cgroups_root="mesos" --container_disk_watch_interval="15secs" --containerizers="mesos" --credential="/tmp/Endpoint_SlaveEndpointTest_NoAuthorizer_0_BddaPJ/credential"
--default_role="*" --disk_watch_interval="1mins" --docker="docker" --docker_kill_orphans="true"
--docker_registry="https://registry-1.docker.io" --docker_remove_delay="6hrs" --docker_socket="/var/run/docker.sock"
--docker_stop_timeout="0ns" --docker_store_dir="/tmp/mesos/store/docker" --docker_volume_checkpoint_dir="/var/run/mesos/isolators/docker/volume"
--enforce_container_disk_quota="false" --executor_registration_timeout="1mins" --executor_reregistration_timeout="2secs"
--executor_shutdown_grace_period="5secs" --fetcher_cache_dir="/tmp/Endpoint_SlaveEndpointTest_NoAuthorizer_0_BddaPJ/fetch"
--fetcher_cache_size="2GB" --frameworks_home="" --gc_delay="1weeks" --gc_disk_headroom="0.1"
--hadoop_home="" --help="false" --hostname_lookup="true" --http_command_executor="false" --http_credentials="/tmp/Endpoint_SlaveEndpointTest_NoAuthorizer_0_BddaPJ/http_credentials"
--http_heartbeat_interval="30secs" --initialize_driver_logging="true" --isolation="posix/cpu,posix/mem"
--launcher="posix" --launcher_dir="/mesos/mesos-1.4.0/_build/src" --logbufsecs="0" --logging_level="INFO"
--max_completed_executors_per_framework="150" --oversubscribed_resources_interval="15secs"
--perf_duration="10secs" --perf_interval="1mins" --port="5051" --qos_correction_interval_min="0ns"
--quiet="false" --recover="reconnect" --recovery_timeout="15mins" --registration_backoff_factor="10ms"
--resources="cpus:2;gpus:0;mem:1024;disk:1024;ports:[31000-32000]" --revocable_cpu_low_priority="true"
--runtime_dir="/tmp/Endpoint_SlaveEndpointTest_NoAuthorizer_0_BddaPJ" --sandbox_directory="/mnt/mesos/sandbox"
--strict="true" --switch_user="true" --systemd_enable_support="true" --systemd_runtime_directory="/run/systemd/system"
--version="false" --work_dir="/tmp/Endpoint_SlaveEndpointTest_NoAuthorizer_0_UXg4bw"
I0526 20:42:09.208043  4681 credentials.hpp:86] Loading credential for authentication from
'/tmp/Endpoint_SlaveEndpointTest_NoAuthorizer_0_BddaPJ/credential'
I0526 20:42:09.208256  4681 slave.cpp:265] Agent using credential for: test-principal
I0526 20:42:09.208283  4681 credentials.hpp:37] Loading credentials for authentication from
'/tmp/Endpoint_SlaveEndpointTest_NoAuthorizer_0_BddaPJ/http_credentials'
I0526 20:42:09.208591  4681 http.cpp:975] Creating default 'basic' HTTP authenticator for
realm 'mesos-agent-readonly'
I0526 20:42:09.208794  4681 http.cpp:975] Creating default 'basic' HTTP authenticator for
realm 'mesos-agent-readwrite'
I0526 20:42:09.210276  4681 slave.cpp:536] Agent resources: cpus(*):2; mem(*):1024; disk(*):1024;
ports(*):[31000-32000]
I0526 20:42:09.210362  4681 slave.cpp:544] Agent attributes: [  ]
I0526 20:42:09.210376  4681 slave.cpp:549] Agent hostname: 492b0bbcd8e0
I0526 20:42:09.210551  4689 status_update_manager.cpp:177] Pausing sending status updates
I0526 20:42:09.211875  4683 state.cpp:62] Recovering state from '/tmp/Endpoint_SlaveEndpointTest_NoAuthorizer_0_UXg4bw/meta'
I0526 20:42:09.212191  4680 status_update_manager.cpp:203] Recovering status update manager
I0526 20:42:09.212419  4688 containerizer.cpp:582] Recovering containerizer
I0526 20:42:09.214063  4690 provisioner.cpp:416] Provisioner recovery complete
I0526 20:42:09.214532  4680 slave.cpp:6073] Finished recovery
I0526 20:42:09.215145  4680 slave.cpp:6255] Querying resource estimator for oversubscribable
resources
I0526 20:42:09.215428  4693 slave.cpp:6269] Received oversubscribable resources {} from the
resource estimator
I0526 20:42:09.218614  4684 process.cpp:3730] Handling HTTP event for process 'slave(751)'
with path: '/slave(751)/monitor/statistics'
I0526 20:42:09.220180  4687 http.cpp:1115] HTTP GET for /slave(751)/monitor/statistics from
172.17.0.2:40256
I0526 20:42:09.220288  4687 http.cpp:936] Authorizing principal 'test-principal' to GET the
'/monitor/statistics' endpoint
I0526 20:42:09.224496  4682 slave.cpp:801] Agent terminating
[       OK ] Endpoint/SlaveEndpointTest.NoAuthorizer/0 (35 ms)
[ RUN      ] Endpoint/SlaveEndpointTest.NoAuthorizer/1
I0526 20:42:09.236172  4661 containerizer.cpp:230] Using isolation: posix/cpu,posix/mem,filesystem/posix,network/cni,environment_secret
W0526 20:42:09.236779  4661 backend.cpp:76] Failed to create 'aufs' backend: AufsBackend requires
root privileges
W0526 20:42:09.236886  4661 backend.cpp:76] Failed to create 'bind' backend: BindBackend requires
root privileges
I0526 20:42:09.236920  4661 provisioner.cpp:255] Using default backend 'copy'
I0526 20:42:09.238817  4661 cluster.cpp:448] Creating default 'local' authorizer
I0526 20:42:09.240418  4692 slave.cpp:232] Mesos agent started on (752)@172.17.0.2:47947
I0526 20:42:09.240449  4692 slave.cpp:233] Flags at startup: --acls="" --appc_simple_discovery_uri_prefix="http://"
--appc_store_dir="/tmp/mesos/store/appc" --authenticate_http_readonly="true" --authenticate_http_readwrite="true"
--authenticatee="crammd5" --authentication_backoff_factor="1secs" --authorizer="local" --cgroups_cpu_enable_pids_and_tids_count="false"
--cgroups_enable_cfs="false" --cgroups_hierarchy="/sys/fs/cgroup" --cgroups_limit_swap="false"
--cgroups_root="mesos" --container_disk_watch_interval="15secs" --containerizers="mesos" --credential="/tmp/Endpoint_SlaveEndpointTest_NoAuthorizer_1_LbyOEC/credential"
--default_role="*" --disk_watch_interval="1mins" --docker="docker" --docker_kill_orphans="true"
--docker_registry="https://registry-1.docker.io" --docker_remove_delay="6hrs" --docker_socket="/var/run/docker.sock"
--docker_stop_timeout="0ns" --docker_store_dir="/tmp/mesos/store/docker" --docker_volume_checkpoint_dir="/var/run/mesos/isolators/docker/volume"
--enforce_container_disk_quota="false" --executor_registration_timeout="1mins" --executor_reregistration_timeout="2secs"
--executor_shutdown_grace_period="5secs" --fetcher_cache_dir="/tmp/Endpoint_SlaveEndpointTest_NoAuthorizer_1_LbyOEC/fetch"
--fetcher_cache_size="2GB" --frameworks_home="" --gc_delay="1weeks" --gc_disk_headroom="0.1"
--hadoop_home="" --help="false" --hostname_lookup="true" --http_command_executor="false" --http_credentials="/tmp/Endpoint_SlaveEndpointTest_NoAuthorizer_1_LbyOEC/http_credentials"
--http_heartbeat_interval="30secs" --initialize_driver_logging="true" --isolation="posix/cpu,posix/mem"
--launcher="posix" --launcher_dir="/mesos/mesos-1.4.0/_build/src" --logbufsecs="0" --logging_level="INFO"
--max_completed_executors_per_framework="150" --oversubscribed_resources_interval="15secs"
--perf_duration="10secs" --perf_interval="1mins" --port="5051" --qos_correction_interval_min="0ns"
--quiet="false" --recover="reconnect" --recovery_timeout="15mins" --registration_backoff_factor="10ms"
--resources="cpus:2;gpus:0;mem:1024;disk:1024;ports:[31000-32000]" --revocable_cpu_low_priority="true"
--runtime_dir="/tmp/Endpoint_SlaveEndpointTest_NoAuthorizer_1_LbyOEC" --sandbox_directory="/mnt/mesos/sandbox"
--strict="true" --switch_user="true" --systemd_enable_support="true" --systemd_runtime_directory="/run/systemd/system"
--version="false" --work_dir="/tmp/Endpoint_SlaveEndpointTest_NoAuthorizer_1_PeG3Vo"
I0526 20:42:09.241058  4692 credentials.hpp:86] Loading credential for authentication from
'/tmp/Endpoint_SlaveEndpointTest_NoAuthorizer_1_LbyOEC/credential'
I0526 20:42:09.241288  4692 slave.cpp:265] Agent using credential for: test-principal
I0526 20:42:09.241314  4692 credentials.hpp:37] Loading credentials for authentication from
'/tmp/Endpoint_SlaveEndpointTest_NoAuthorizer_1_LbyOEC/http_credentials'
I0526 20:42:09.241663  4692 http.cpp:975] Creating default 'basic' HTTP authenticator for
realm 'mesos-agent-readonly'
I0526 20:42:09.241850  4692 http.cpp:975] Creating default 'basic' HTTP authenticator for
realm 'mesos-agent-readwrite'
I0526 20:42:09.243484  4692 slave.cpp:536] Agent resources: cpus(*):2; mem(*):1024; disk(*):1024;
ports(*):[31000-32000]
I0526 20:42:09.243577  4692 slave.cpp:544] Agent attributes: [  ]
I0526 20:42:09.243592  4692 slave.cpp:549] Agent hostname: 492b0bbcd8e0
I0526 20:42:09.243774  4686 status_update_manager.cpp:177] Pausing sending status updates
I0526 20:42:09.245312  4682 state.cpp:62] Recovering state from '/tmp/Endpoint_SlaveEndpointTest_NoAuthorizer_1_PeG3Vo/meta'
I0526 20:42:09.245858  4682 status_update_manager.cpp:203] Recovering status update manager
I0526 20:42:09.246145  4691 containerizer.cpp:582] Recovering containerizer
I0526 20:42:09.248020  4695 provisioner.cpp:416] Provisioner recovery complete
I0526 20:42:09.248394  4692 slave.cpp:6073] Finished recovery
I0526 20:42:09.248961  4692 slave.cpp:6255] Querying resource estimator for oversubscribable
resources
I0526 20:42:09.249389  4688 slave.cpp:6269] Received oversubscribable resources {} from the
resource estimator
I0526 20:42:09.253046  4687 process.cpp:3730] Handling HTTP event for process 'slave(752)'
with path: '/slave(752)/monitor/statistics.json'
I0526 20:42:09.254606  4693 http.cpp:1115] HTTP GET for /slave(752)/monitor/statistics.json
from 172.17.0.2:40257
I0526 20:42:09.254724  4693 http.cpp:936] Authorizing principal 'test-principal' to GET the
'/monitor/statistics.json' endpoint
I0526 20:42:09.259116  4684 slave.cpp:801] Agent terminating
[       OK ] Endpoint/SlaveEndpointTest.NoAuthorizer/1 (34 ms)
[ RUN      ] Endpoint/SlaveEndpointTest.NoAuthorizer/2
I0526 20:42:09.270359  4661 containerizer.cpp:230] Using isolation: posix/cpu,posix/mem,filesystem/posix,network/cni,environment_secret
W0526 20:42:09.270889  4661 backend.cpp:76] Failed to create 'aufs' backend: AufsBackend requires
root privileges
W0526 20:42:09.270993  4661 backend.cpp:76] Failed to create 'bind' backend: BindBackend requires
root privileges
I0526 20:42:09.271035  4661 provisioner.cpp:255] Using default backend 'copy'
I0526 20:42:09.272970  4661 cluster.cpp:448] Creating default 'local' authorizer
I0526 20:42:09.274623  4684 slave.cpp:232] Mesos agent started on (753)@172.17.0.2:47947
I0526 20:42:09.274648  4684 slave.cpp:233] Flags at startup: --acls="" --appc_simple_discovery_uri_prefix="http://"
--appc_store_dir="/tmp/mesos/store/appc" --authenticate_http_readonly="true" --authenticate_http_readwrite="true"
--authenticatee="crammd5" --authentication_backoff_factor="1secs" --authorizer="local" --cgroups_cpu_enable_pids_and_tids_count="false"
--cgroups_enable_cfs="false" --cgroups_hierarchy="/sys/fs/cgroup" --cgroups_limit_swap="false"
--cgroups_root="mesos" --container_disk_watch_interval="15secs" --containerizers="mesos" --credential="/tmp/Endpoint_SlaveEndpointTest_NoAuthorizer_2_EnzQQv/credential"
--default_role="*" --disk_watch_interval="1mins" --docker="docker" --docker_kill_orphans="true"
--docker_registry="https://registry-1.docker.io" --docker_remove_delay="6hrs" --docker_socket="/var/run/docker.sock"
--docker_stop_timeout="0ns" --docker_store_dir="/tmp/mesos/store/docker" --docker_volume_checkpoint_dir="/var/run/mesos/isolators/docker/volume"
--enforce_container_disk_quota="false" --executor_registration_timeout="1mins" --executor_reregistration_timeout="2secs"
--executor_shutdown_grace_period="5secs" --fetcher_cache_dir="/tmp/Endpoint_SlaveEndpointTest_NoAuthorizer_2_EnzQQv/fetch"
--fetcher_cache_size="2GB" --frameworks_home="" --gc_delay="1weeks" --gc_disk_headroom="0.1"
--hadoop_home="" --help="false" --hostname_lookup="true" --http_command_executor="false" --http_credentials="/tmp/Endpoint_SlaveEndpointTest_NoAuthorizer_2_EnzQQv/http_credentials"
--http_heartbeat_interval="30secs" --initialize_driver_logging="true" --isolation="posix/cpu,posix/mem"
--launcher="posix" --launcher_dir="/mesos/mesos-1.4.0/_build/src" --logbufsecs="0" --logging_level="INFO"
--max_completed_executors_per_framework="150" --oversubscribed_resources_interval="15secs"
--perf_duration="10secs" --perf_interval="1mins" --port="5051" --qos_correction_interval_min="0ns"
--quiet="false" --recover="reconnect" --recovery_timeout="15mins" --registration_backoff_factor="10ms"
--resources="cpus:2;gpus:0;mem:1024;disk:1024;ports:[31000-32000]" --revocable_cpu_low_priority="true"
--runtime_dir="/tmp/Endpoint_SlaveEndpointTest_NoAuthorizer_2_EnzQQv" --sandbox_directory="/mnt/mesos/sandbox"
--strict="true" --switch_user="true" --systemd_enable_support="true" --systemd_runtime_directory="/run/systemd/system"
--version="false" --work_dir="/tmp/Endpoint_SlaveEndpointTest_NoAuthorizer_2_jmYt2h"
I0526 20:42:09.275104  4684 credentials.hpp:86] Loading credential for authentication from
'/tmp/Endpoint_SlaveEndpointTest_NoAuthorizer_2_EnzQQv/credential'
I0526 20:42:09.275281  4684 slave.cpp:265] Agent using credential for: test-principal
I0526 20:42:09.275305  4684 credentials.hpp:37] Loading credentials for authentication from
'/tmp/Endpoint_SlaveEndpointTest_NoAuthorizer_2_EnzQQv/http_credentials'
I0526 20:42:09.275542  4684 http.cpp:975] Creating default 'basic' HTTP authenticator for
realm 'mesos-agent-readonly'
I0526 20:42:09.275678  4684 http.cpp:975] Creating default 'basic' HTTP authenticator for
realm 'mesos-agent-readwrite'
I0526 20:42:09.276885  4684 slave.cpp:536] Agent resources: cpus(*):2; mem(*):1024; disk(*):1024;
ports(*):[31000-32000]
I0526 20:42:09.276955  4684 slave.cpp:544] Agent attributes: [  ]
I0526 20:42:09.276973  4684 slave.cpp:549] Agent hostname: 492b0bbcd8e0
I0526 20:42:09.277125  4694 status_update_manager.cpp:177] Pausing sending status updates
I0526 20:42:09.278424  4695 state.cpp:62] Recovering state from '/tmp/Endpoint_SlaveEndpointTest_NoAuthorizer_2_jmYt2h/meta'
I0526 20:42:09.278765  4691 status_update_manager.cpp:203] Recovering status update manager
I0526 20:42:09.278949  4684 containerizer.cpp:582] Recovering containerizer
I0526 20:42:09.280417  4695 provisioner.cpp:416] Provisioner recovery complete
I0526 20:42:09.280861  4686 slave.cpp:6073] Finished recovery
I0526 20:42:09.281440  4686 slave.cpp:6255] Querying resource estimator for oversubscribable
resources
I0526 20:42:09.281877  4687 slave.cpp:6269] Received oversubscribable resources {} from the
resource estimator
I0526 20:42:09.284576  4683 process.cpp:3730] Handling HTTP event for process 'slave(753)'
with path: '/slave(753)/containers'
I0526 20:42:09.285856  4691 http.cpp:1115] HTTP GET for /slave(753)/containers from 172.17.0.2:40258
I0526 20:42:09.285950  4691 http.cpp:936] Authorizing principal 'test-principal' to GET the
'/containers' endpoint
I0526 20:42:09.289611  4685 slave.cpp:801] Agent terminating
[       OK ] Endpoint/SlaveEndpointTest.NoAuthorizer/2 (29 ms)
[----------] 9 tests from Endpoint/SlaveEndpointTest (304 ms total)

[----------] Global test environment tear-down
[==========] 1580 tests from 176 test cases ran. (557567 ms total)
[  PASSED  ] 1579 tests.
[  FAILED  ] 1 test, listed below:
[  FAILED  ] ExamplesTest.PythonFramework

 1 FAILED TEST
  YOU HAVE 22 DISABLED TESTS

E0526 20:42:09.347671  4696 process.cpp:950] Failed to accept socket: future discarded
make[4]: *** [check-local] Error 1
make[4]: Leaving directory `/mesos/mesos-1.4.0/_build/src'
make[3]: *** [check-am] Error 2
make[3]: Leaving directory `/mesos/mesos-1.4.0/_build/src'
make[2]: *** [check] Error 2
make[2]: Leaving directory `/mesos/mesos-1.4.0/_build/src'
make[1]: *** [check-recursive] Error 1
make[1]: Leaving directory `/mesos/mesos-1.4.0/_build'
make: *** [distcheck] Error 1
+ docker rmi mesos-1495827844-30367
Untagged: mesos-1495827844-30367:latest
Deleted: sha256:c2059d6b348c420ed57510d86e44ee9b2313d2f5f5aefc491b9d8d2fb8c841b8
Deleted: sha256:ea7b8cf10003f10159a44cc8b0a0b987f068d6c61161921b5429d28c4130d10a
Deleted: sha256:172015f197d54c919228b06ac024495a066677c8802cf6bbc97ebc580df20c08
Deleted: sha256:0aa7364e43740f1ae857011f1f8548b1bc7cb368825612e6d0beaf1a561b3da2
Deleted: sha256:c998b572ba4c0dfedea3d3cb39b839b85339aa49c85826eb2b36cf0b680261f8
Deleted: sha256:b4c620319cc88ce87596ba29c8064ee0b5ffb74b533a181957a759a74e69519b
Deleted: sha256:04f47b88b3c9a0e9e96949919202bd0c5ebb2d2883563b439c6e8210f0928783
Deleted: sha256:ae3a6166531135e3d3e772a2cf1c84a31e5393847f1a0dfbe047f395fa7256c6
Deleted: sha256:536caee6d095cd68a1a134b9e6872e80a81526a5ccbf0bc8ecfdc7ca83cba9c2
Deleted: sha256:db73add518a1e9685946957ac60e6f252b4938aa53773b427e74f2b620690cdd
Deleted: sha256:ece4847a532d2271c9332ab0c26d4630d19d80daf59d8db2ef059556af6a51d1
Deleted: sha256:c6caf77bce295529a8704f45c7362d4f6c1881887944bb7cc9b1f114b55fdd42
Deleted: sha256:c08fd4d54c3393aefeb74121ce678ac760d96ad4a1522009b58d002afba10e21
Deleted: sha256:5366d5f904e9d2904bca57632fc56de276a49bac10451e23e51f82458e51bd6c
Deleted: sha256:3788451686fd380817d393e12c189ad2096016cabdd5a650a9b06fcb084e9beb
Deleted: sha256:8ba18d4f94c4fdd0f3f29116acc447c6c2ce1bd7a1941ef1d3e832c3dc18d958
Deleted: sha256:1b248eed27efc34a91d6cdad205515aeddfa6d0db824ed255b5d589bec6db94f
Deleted: sha256:fb82c579a9dd428acd8299a7c33f3b89bc3ed83d902ce4a897680f8d9b8dadaa
Deleted: sha256:7cde044e9d372ddfac52fd5bead8ef6646fcddcbc3d97afef2f32071d0171418
Deleted: sha256:7bc6f285d3203dfff76fd0a80d9016c3ece41c828de99dfc226d58d3b4b983bc
Deleted: sha256:b238ac01ebc1a0c6778dd59e3645c91ef69173090e48f3f32bf4cdea0054f0f9
Deleted: sha256:c31ae25efefd992b0887afb35825d0de4fd2d1ff2fc6b96dec9df5ba5396b5a5
Deleted: sha256:1c568364298adcaddd95499e89a367729860fab478bde855398bf8559e028879
Deleted: sha256:5bafbc3eb74dbff1982de9284f36d6eeaeb00fdfef12bb369c0f6c85fe77116f
Build step 'Execute shell' marked build as failure

Mime
View raw message