mesos-builds mailing list archives

Site index · List index
Message view « Date » · « Thread »
Top « Date » · « Thread »
From Apache Jenkins Server <jenk...@builds.apache.org>
Subject Build failed in Jenkins: Mesos-Buildbot » autotools,gcc,--verbose --enable-libevent --enable-ssl,GLOG_v=1 MESOS_VERBOSE=1,ubuntu:14.04,(docker||Hadoop)&&(!ubuntu-us1)&&(!ubuntu-eu2) #3742
Date Mon, 29 May 2017 17:31:00 GMT
See <https://builds.apache.org/job/Mesos-Buildbot/BUILDTOOL=autotools,COMPILER=gcc,CONFIGURATION=--verbose%20--enable-libevent%20--enable-ssl,ENVIRONMENT=GLOG_v=1%20MESOS_VERBOSE=1,OS=ubuntu%3A14.04,label_exp=(docker%7C%7CHadoop)&&(!ubuntu-us1)&&(!ubuntu-eu2)/3742/display/redirect>

------------------------------------------
[...truncated 28.75 MB...]
I0529 17:30:53.133538 25094 process.cpp:3730] Handling HTTP event for process 'slave(757)'
with path: '/slave(757)/containers'
I0529 17:30:53.135406 25102 http.cpp:1115] HTTP GET for /slave(757)/containers from 172.17.0.3:54198
I0529 17:30:53.135486 25102 http.cpp:936] Authorizing principal 'test-principal' to GET the
'/containers' endpoint
I0529 17:30:53.138967  6929 slave.cpp:801] Agent terminating
[       OK ] Endpoint/SlaveEndpointTest.AuthorizedRequest/2 (29 ms)
[ RUN      ] Endpoint/SlaveEndpointTest.UnauthorizedRequest/0
I0529 17:30:53.149371  6929 containerizer.cpp:230] Using isolation: posix/cpu,posix/mem,filesystem/posix,network/cni,environment_secret
W0529 17:30:53.149859  6929 backend.cpp:76] Failed to create 'aufs' backend: AufsBackend requires
root privileges
W0529 17:30:53.149950  6929 backend.cpp:76] Failed to create 'bind' backend: BindBackend requires
root privileges
I0529 17:30:53.149996  6929 provisioner.cpp:255] Using default backend 'copy'
I0529 17:30:53.152899 25089 slave.cpp:232] Mesos agent started on (758)@172.17.0.3:55104
I0529 17:30:53.152918 25089 slave.cpp:233] Flags at startup: --acls="" --appc_simple_discovery_uri_prefix="http://"
--appc_store_dir="/tmp/mesos/store/appc" --authenticate_http_executors="true" --authenticate_http_readonly="true"
--authenticate_http_readwrite="true" --authenticatee="crammd5" --authentication_backoff_factor="1secs"
--authorizer="local" --cgroups_cpu_enable_pids_and_tids_count="false" --cgroups_enable_cfs="false"
--cgroups_hierarchy="/sys/fs/cgroup" --cgroups_limit_swap="false" --cgroups_root="mesos" --container_disk_watch_interval="15secs"
--containerizers="mesos" --credential="/tmp/Endpoint_SlaveEndpointTest_UnauthorizedRequest_0_MMTDha/credential"
--default_role="*" --disk_watch_interval="1mins" --docker="docker" --docker_kill_orphans="true"
--docker_registry="https://registry-1.docker.io" --docker_remove_delay="6hrs" --docker_socket="/var/run/docker.sock"
--docker_stop_timeout="0ns" --docker_store_dir="/tmp/mesos/store/docker" --docker_volume_checkpoint_dir="/var/run/mesos/isolators/docker/volume"
--enforce_container_disk_quota="false" --executor_registration_timeout="1mins" --executor_reregistration_timeout="2secs"
--executor_secret_key="/tmp/Endpoint_SlaveEndpointTest_UnauthorizedRequest_0_MMTDha/executor_secret_key"
--executor_shutdown_grace_period="5secs" --fetcher_cache_dir="/tmp/Endpoint_SlaveEndpointTest_UnauthorizedRequest_0_MMTDha/fetch"
--fetcher_cache_size="2GB" --frameworks_home="" --gc_delay="1weeks" --gc_disk_headroom="0.1"
--hadoop_home="" --help="false" --hostname_lookup="true" --http_command_executor="false" --http_credentials="/tmp/Endpoint_SlaveEndpointTest_UnauthorizedRequest_0_MMTDha/http_credentials"
--http_heartbeat_interval="30secs" --initialize_driver_logging="true" --isolation="posix/cpu,posix/mem"
--launcher="posix" --launcher_dir="/mesos/mesos-1.4.0/_build/src" --logbufsecs="0" --logging_level="INFO"
--max_completed_executors_per_framework="150" --oversubscribed_resources_interval="15secs"
--perf_duration="10secs" --perf_interval="1mins" --port="5051" --qos_correction_interval_min="0ns"
--quiet="false" --recover="reconnect" --recovery_timeout="15mins" --registration_backoff_factor="10ms"
--resources="cpus:2;gpus:0;mem:1024;disk:1024;ports:[31000-32000]" --revocable_cpu_low_priority="true"
--runtime_dir="/tmp/Endpoint_SlaveEndpointTest_UnauthorizedRequest_0_MMTDha" --sandbox_directory="/mnt/mesos/sandbox"
--strict="true" --switch_user="true" --systemd_enable_support="true" --systemd_runtime_directory="/run/systemd/system"
--version="false" --work_dir="/tmp/Endpoint_SlaveEndpointTest_UnauthorizedRequest_0_qw3fcr"
I0529 17:30:53.153337 25089 credentials.hpp:86] Loading credential for authentication from
'/tmp/Endpoint_SlaveEndpointTest_UnauthorizedRequest_0_MMTDha/credential'
I0529 17:30:53.153504 25089 slave.cpp:265] Agent using credential for: test-principal
I0529 17:30:53.153529 25089 credentials.hpp:37] Loading credentials for authentication from
'/tmp/Endpoint_SlaveEndpointTest_UnauthorizedRequest_0_MMTDha/http_credentials'
I0529 17:30:53.153847 25089 http.cpp:975] Creating default 'basic' HTTP authenticator for
realm 'mesos-agent-executor'
I0529 17:30:53.153965 25089 http.cpp:996] Creating default 'jwt' HTTP authenticator for realm
'mesos-agent-executor'
I0529 17:30:53.154189 25089 http.cpp:975] Creating default 'basic' HTTP authenticator for
realm 'mesos-agent-readonly'
I0529 17:30:53.154717 25089 http.cpp:996] Creating default 'jwt' HTTP authenticator for realm
'mesos-agent-readonly'
I0529 17:30:53.154894 25089 http.cpp:975] Creating default 'basic' HTTP authenticator for
realm 'mesos-agent-readwrite'
I0529 17:30:53.154996 25089 http.cpp:996] Creating default 'jwt' HTTP authenticator for realm
'mesos-agent-readwrite'
I0529 17:30:53.156339 25089 slave.cpp:536] Agent resources: cpus(*):2; mem(*):1024; disk(*):1024;
ports(*):[31000-32000]
I0529 17:30:53.156407 25089 slave.cpp:544] Agent attributes: [  ]
I0529 17:30:53.156420 25089 slave.cpp:549] Agent hostname: 2d621b27ff7a
I0529 17:30:53.156553 25098 status_update_manager.cpp:177] Pausing sending status updates
I0529 17:30:53.157721 25098 state.cpp:62] Recovering state from '/tmp/Endpoint_SlaveEndpointTest_UnauthorizedRequest_0_qw3fcr/meta'
I0529 17:30:53.158077 25093 status_update_manager.cpp:203] Recovering status update manager
I0529 17:30:53.158298 25096 containerizer.cpp:582] Recovering containerizer
I0529 17:30:53.159924 25089 provisioner.cpp:416] Provisioner recovery complete
I0529 17:30:53.160320 25092 slave.cpp:6083] Finished recovery
I0529 17:30:53.160893 25092 slave.cpp:6265] Querying resource estimator for oversubscribable
resources
I0529 17:30:53.161312 25089 slave.cpp:6279] Received oversubscribable resources {} from the
resource estimator
I0529 17:30:53.163455 25090 process.cpp:3730] Handling HTTP event for process 'slave(758)'
with path: '/slave(758)/monitor/statistics'
I0529 17:30:53.165454 25097 http.cpp:1115] HTTP GET for /slave(758)/monitor/statistics from
172.17.0.3:54199
I0529 17:30:53.165539 25097 http.cpp:936] Authorizing principal 'test-principal' to GET the
'/monitor/statistics' endpoint
I0529 17:30:53.167716 25099 slave.cpp:801] Agent terminating
[       OK ] Endpoint/SlaveEndpointTest.UnauthorizedRequest/0 (28 ms)
[ RUN      ] Endpoint/SlaveEndpointTest.UnauthorizedRequest/1
I0529 17:30:53.180750  6929 containerizer.cpp:230] Using isolation: posix/cpu,posix/mem,filesystem/posix,network/cni,environment_secret
W0529 17:30:53.181437  6929 backend.cpp:76] Failed to create 'aufs' backend: AufsBackend requires
root privileges
W0529 17:30:53.181560  6929 backend.cpp:76] Failed to create 'bind' backend: BindBackend requires
root privileges
I0529 17:30:53.181605  6929 provisioner.cpp:255] Using default backend 'copy'
I0529 17:30:53.185775 25093 slave.cpp:232] Mesos agent started on (759)@172.17.0.3:55104
I0529 17:30:53.185820 25093 slave.cpp:233] Flags at startup: --acls="" --appc_simple_discovery_uri_prefix="http://"
--appc_store_dir="/tmp/mesos/store/appc" --authenticate_http_executors="true" --authenticate_http_readonly="true"
--authenticate_http_readwrite="true" --authenticatee="crammd5" --authentication_backoff_factor="1secs"
--authorizer="local" --cgroups_cpu_enable_pids_and_tids_count="false" --cgroups_enable_cfs="false"
--cgroups_hierarchy="/sys/fs/cgroup" --cgroups_limit_swap="false" --cgroups_root="mesos" --container_disk_watch_interval="15secs"
--containerizers="mesos" --credential="/tmp/Endpoint_SlaveEndpointTest_UnauthorizedRequest_1_0xcDT4/credential"
--default_role="*" --disk_watch_interval="1mins" --docker="docker" --docker_kill_orphans="true"
--docker_registry="https://registry-1.docker.io" --docker_remove_delay="6hrs" --docker_socket="/var/run/docker.sock"
--docker_stop_timeout="0ns" --docker_store_dir="/tmp/mesos/store/docker" --docker_volume_checkpoint_dir="/var/run/mesos/isolators/docker/volume"
--enforce_container_disk_quota="false" --executor_registration_timeout="1mins" --executor_reregistration_timeout="2secs"
--executor_secret_key="/tmp/Endpoint_SlaveEndpointTest_UnauthorizedRequest_1_0xcDT4/executor_secret_key"
--executor_shutdown_grace_period="5secs" --fetcher_cache_dir="/tmp/Endpoint_SlaveEndpointTest_UnauthorizedRequest_1_0xcDT4/fetch"
--fetcher_cache_size="2GB" --frameworks_home="" --gc_delay="1weeks" --gc_disk_headroom="0.1"
--hadoop_home="" --help="false" --hostname_lookup="true" --http_command_executor="false" --http_credentials="/tmp/Endpoint_SlaveEndpointTest_UnauthorizedRequest_1_0xcDT4/http_credentials"
--http_heartbeat_interval="30secs" --initialize_driver_logging="true" --isolation="posix/cpu,posix/mem"
--launcher="posix" --launcher_dir="/mesos/mesos-1.4.0/_build/src" --logbufsecs="0" --logging_level="INFO"
--max_completed_executors_per_framework="150" --oversubscribed_resources_interval="15secs"
--perf_duration="10secs" --perf_interval="1mins" --port="5051" --qos_correction_interval_min="0ns"
--quiet="false" --recover="reconnect" --recovery_timeout="15mins" --registration_backoff_factor="10ms"
--resources="cpus:2;gpus:0;mem:1024;disk:1024;ports:[31000-32000]" --revocable_cpu_low_priority="true"
--runtime_dir="/tmp/Endpoint_SlaveEndpointTest_UnauthorizedRequest_1_0xcDT4" --sandbox_directory="/mnt/mesos/sandbox"
--strict="true" --switch_user="true" --systemd_enable_support="true" --systemd_runtime_directory="/run/systemd/system"
--version="false" --work_dir="/tmp/Endpoint_SlaveEndpointTest_UnauthorizedRequest_1_aVBlJl"
I0529 17:30:53.186550 25093 credentials.hpp:86] Loading credential for authentication from
'/tmp/Endpoint_SlaveEndpointTest_UnauthorizedRequest_1_0xcDT4/credential'
I0529 17:30:53.186976 25093 slave.cpp:265] Agent using credential for: test-principal
I0529 17:30:53.187006 25093 credentials.hpp:37] Loading credentials for authentication from
'/tmp/Endpoint_SlaveEndpointTest_UnauthorizedRequest_1_0xcDT4/http_credentials'
I0529 17:30:53.187399 25093 http.cpp:975] Creating default 'basic' HTTP authenticator for
realm 'mesos-agent-executor'
I0529 17:30:53.187592 25093 http.cpp:996] Creating default 'jwt' HTTP authenticator for realm
'mesos-agent-executor'
I0529 17:30:53.187813 25093 http.cpp:975] Creating default 'basic' HTTP authenticator for
realm 'mesos-agent-readonly'
I0529 17:30:53.187912 25093 http.cpp:996] Creating default 'jwt' HTTP authenticator for realm
'mesos-agent-readonly'
I0529 17:30:53.188076 25093 http.cpp:975] Creating default 'basic' HTTP authenticator for
realm 'mesos-agent-readwrite'
I0529 17:30:53.188172 25093 http.cpp:996] Creating default 'jwt' HTTP authenticator for realm
'mesos-agent-readwrite'
I0529 17:30:53.189924 25093 slave.cpp:536] Agent resources: cpus(*):2; mem(*):1024; disk(*):1024;
ports(*):[31000-32000]
I0529 17:30:53.190034 25093 slave.cpp:544] Agent attributes: [  ]
I0529 17:30:53.190054 25093 slave.cpp:549] Agent hostname: 2d621b27ff7a
I0529 17:30:53.190250 25096 status_update_manager.cpp:177] Pausing sending status updates
I0529 17:30:53.192088 25101 state.cpp:62] Recovering state from '/tmp/Endpoint_SlaveEndpointTest_UnauthorizedRequest_1_aVBlJl/meta'
I0529 17:30:53.192469 25097 status_update_manager.cpp:203] Recovering status update manager
I0529 17:30:53.192670 25100 containerizer.cpp:582] Recovering containerizer
I0529 17:30:53.193970 25091 provisioner.cpp:416] Provisioner recovery complete
I0529 17:30:53.194358 25089 slave.cpp:6083] Finished recovery
I0529 17:30:53.194861 25089 slave.cpp:6265] Querying resource estimator for oversubscribable
resources
I0529 17:30:53.195114 25097 slave.cpp:6279] Received oversubscribable resources {} from the
resource estimator
I0529 17:30:53.197202 25095 process.cpp:3730] Handling HTTP event for process 'slave(759)'
with path: '/slave(759)/monitor/statistics.json'
I0529 17:30:53.198796 25096 http.cpp:1115] HTTP GET for /slave(759)/monitor/statistics.json
from 172.17.0.3:54202
I0529 17:30:53.198865 25096 http.cpp:936] Authorizing principal 'test-principal' to GET the
'/monitor/statistics.json' endpoint
I0529 17:30:53.200906 25089 slave.cpp:801] Agent terminating
[       OK ] Endpoint/SlaveEndpointTest.UnauthorizedRequest/1 (32 ms)
[ RUN      ] Endpoint/SlaveEndpointTest.UnauthorizedRequest/2
I0529 17:30:53.211117  6929 containerizer.cpp:230] Using isolation: posix/cpu,posix/mem,filesystem/posix,network/cni,environment_secret
W0529 17:30:53.211604  6929 backend.cpp:76] Failed to create 'aufs' backend: AufsBackend requires
root privileges
W0529 17:30:53.211711  6929 backend.cpp:76] Failed to create 'bind' backend: BindBackend requires
root privileges
I0529 17:30:53.211753  6929 provisioner.cpp:255] Using default backend 'copy'
I0529 17:30:53.214438 25094 slave.cpp:232] Mesos agent started on (760)@172.17.0.3:55104
I0529 17:30:53.214498 25094 slave.cpp:233] Flags at startup: --acls="" --appc_simple_discovery_uri_prefix="http://"
--appc_store_dir="/tmp/mesos/store/appc" --authenticate_http_executors="true" --authenticate_http_readonly="true"
--authenticate_http_readwrite="true" --authenticatee="crammd5" --authentication_backoff_factor="1secs"
--authorizer="local" --cgroups_cpu_enable_pids_and_tids_count="false" --cgroups_enable_cfs="false"
--cgroups_hierarchy="/sys/fs/cgroup" --cgroups_limit_swap="false" --cgroups_root="mesos" --container_disk_watch_interval="15secs"
--containerizers="mesos" --credential="/tmp/Endpoint_SlaveEndpointTest_UnauthorizedRequest_2_PsNMQZ/credential"
--default_role="*" --disk_watch_interval="1mins" --docker="docker" --docker_kill_orphans="true"
--docker_registry="https://registry-1.docker.io" --docker_remove_delay="6hrs" --docker_socket="/var/run/docker.sock"
--docker_stop_timeout="0ns" --docker_store_dir="/tmp/mesos/store/docker" --docker_volume_checkpoint_dir="/var/run/mesos/isolators/docker/volume"
--enforce_container_disk_quota="false" --executor_registration_timeout="1mins" --executor_reregistration_timeout="2secs"
--executor_secret_key="/tmp/Endpoint_SlaveEndpointTest_UnauthorizedRequest_2_PsNMQZ/executor_secret_key"
--executor_shutdown_grace_period="5secs" --fetcher_cache_dir="/tmp/Endpoint_SlaveEndpointTest_UnauthorizedRequest_2_PsNMQZ/fetch"
--fetcher_cache_size="2GB" --frameworks_home="" --gc_delay="1weeks" --gc_disk_headroom="0.1"
--hadoop_home="" --help="false" --hostname_lookup="true" --http_command_executor="false" --http_credentials="/tmp/Endpoint_SlaveEndpointTest_UnauthorizedRequest_2_PsNMQZ/http_credentials"
--http_heartbeat_interval="30secs" --initialize_driver_logging="true" --isolation="posix/cpu,posix/mem"
--launcher="posix" --launcher_dir="/mesos/mesos-1.4.0/_build/src" --logbufsecs="0" --logging_level="INFO"
--max_completed_executors_per_framework="150" --oversubscribed_resources_interval="15secs"
--perf_duration="10secs" --perf_interval="1mins" --port="5051" --qos_correction_interval_min="0ns"
--quiet="false" --recover="reconnect" --recovery_timeout="15mins" --registration_backoff_factor="10ms"
--resources="cpus:2;gpus:0;mem:1024;disk:1024;ports:[31000-32000]" --revocable_cpu_low_priority="true"
--runtime_dir="/tmp/Endpoint_SlaveEndpointTest_UnauthorizedRequest_2_PsNMQZ" --sandbox_directory="/mnt/mesos/sandbox"
--strict="true" --switch_user="true" --systemd_enable_support="true" --systemd_runtime_directory="/run/systemd/system"
--version="false" --work_dir="/tmp/Endpoint_SlaveEndpointTest_UnauthorizedRequest_2_eWrlBg"
I0529 17:30:53.214998 25094 credentials.hpp:86] Loading credential for authentication from
'/tmp/Endpoint_SlaveEndpointTest_UnauthorizedRequest_2_PsNMQZ/credential'
I0529 17:30:53.215179 25094 slave.cpp:265] Agent using credential for: test-principal
I0529 17:30:53.215205 25094 credentials.hpp:37] Loading credentials for authentication from
'/tmp/Endpoint_SlaveEndpointTest_UnauthorizedRequest_2_PsNMQZ/http_credentials'
I0529 17:30:53.215548 25094 http.cpp:975] Creating default 'basic' HTTP authenticator for
realm 'mesos-agent-executor'
I0529 17:30:53.215667 25094 http.cpp:996] Creating default 'jwt' HTTP authenticator for realm
'mesos-agent-executor'
I0529 17:30:53.215870 25094 http.cpp:975] Creating default 'basic' HTTP authenticator for
realm 'mesos-agent-readonly'
I0529 17:30:53.215960 25094 http.cpp:996] Creating default 'jwt' HTTP authenticator for realm
'mesos-agent-readonly'
I0529 17:30:53.216127 25094 http.cpp:975] Creating default 'basic' HTTP authenticator for
realm 'mesos-agent-readwrite'
I0529 17:30:53.216212 25094 http.cpp:996] Creating default 'jwt' HTTP authenticator for realm
'mesos-agent-readwrite'
I0529 17:30:53.217380 25094 slave.cpp:536] Agent resources: cpus(*):2; mem(*):1024; disk(*):1024;
ports(*):[31000-32000]
I0529 17:30:53.217445 25094 slave.cpp:544] Agent attributes: [  ]
I0529 17:30:53.217458 25094 slave.cpp:549] Agent hostname: 2d621b27ff7a
I0529 17:30:53.217571 25097 status_update_manager.cpp:177] Pausing sending status updates
I0529 17:30:53.218811 25090 state.cpp:62] Recovering state from '/tmp/Endpoint_SlaveEndpointTest_UnauthorizedRequest_2_eWrlBg/meta'
I0529 17:30:53.219127 25095 status_update_manager.cpp:203] Recovering status update manager
I0529 17:30:53.219306 25097 containerizer.cpp:582] Recovering containerizer
I0529 17:30:53.220536 25093 provisioner.cpp:416] Provisioner recovery complete
I0529 17:30:53.220883 25098 slave.cpp:6083] Finished recovery
I0529 17:30:53.221338 25098 slave.cpp:6265] Querying resource estimator for oversubscribable
resources
I0529 17:30:53.221621 25100 slave.cpp:6279] Received oversubscribable resources {} from the
resource estimator
I0529 17:30:53.223613 25101 process.cpp:3730] Handling HTTP event for process 'slave(760)'
with path: '/slave(760)/containers'
I0529 17:30:53.225263 25094 http.cpp:1115] HTTP GET for /slave(760)/containers from 172.17.0.3:54205
I0529 17:30:53.225332 25094 http.cpp:936] Authorizing principal 'test-principal' to GET the
'/containers' endpoint
I0529 17:30:53.227406 25097 slave.cpp:801] Agent terminating
[       OK ] Endpoint/SlaveEndpointTest.UnauthorizedRequest/2 (26 ms)
[ RUN      ] Endpoint/SlaveEndpointTest.NoAuthorizer/0
I0529 17:30:53.237028  6929 containerizer.cpp:230] Using isolation: posix/cpu,posix/mem,filesystem/posix,network/cni,environment_secret
W0529 17:30:53.237457  6929 backend.cpp:76] Failed to create 'aufs' backend: AufsBackend requires
root privileges
W0529 17:30:53.237545  6929 backend.cpp:76] Failed to create 'bind' backend: BindBackend requires
root privileges
I0529 17:30:53.237582  6929 provisioner.cpp:255] Using default backend 'copy'
I0529 17:30:53.239130  6929 cluster.cpp:448] Creating default 'local' authorizer
I0529 17:30:53.240506 25101 slave.cpp:232] Mesos agent started on (761)@172.17.0.3:55104
I0529 17:30:53.240531 25101 slave.cpp:233] Flags at startup: --acls="" --appc_simple_discovery_uri_prefix="http://"
--appc_store_dir="/tmp/mesos/store/appc" --authenticate_http_executors="true" --authenticate_http_readonly="true"
--authenticate_http_readwrite="true" --authenticatee="crammd5" --authentication_backoff_factor="1secs"
--authorizer="local" --cgroups_cpu_enable_pids_and_tids_count="false" --cgroups_enable_cfs="false"
--cgroups_hierarchy="/sys/fs/cgroup" --cgroups_limit_swap="false" --cgroups_root="mesos" --container_disk_watch_interval="15secs"
--containerizers="mesos" --credential="/tmp/Endpoint_SlaveEndpointTest_NoAuthorizer_0_DRXI4U/credential"
--default_role="*" --disk_watch_interval="1mins" --docker="docker" --docker_kill_orphans="true"
--docker_registry="https://registry-1.docker.io" --docker_remove_delay="6hrs" --docker_socket="/var/run/docker.sock"
--docker_stop_timeout="0ns" --docker_store_dir="/tmp/mesos/store/docker" --docker_volume_checkpoint_dir="/var/run/mesos/isolators/docker/volume"
--enforce_container_disk_quota="false" --executor_registration_timeout="1mins" --executor_reregistration_timeout="2secs"
--executor_secret_key="/tmp/Endpoint_SlaveEndpointTest_NoAuthorizer_0_DRXI4U/executor_secret_key"
--executor_shutdown_grace_period="5secs" --fetcher_cache_dir="/tmp/Endpoint_SlaveEndpointTest_NoAuthorizer_0_DRXI4U/fetch"
--fetcher_cache_size="2GB" --frameworks_home="" --gc_delay="1weeks" --gc_disk_headroom="0.1"
--hadoop_home="" --help="false" --hostname_lookup="true" --http_command_executor="false" --http_credentials="/tmp/Endpoint_SlaveEndpointTest_NoAuthorizer_0_DRXI4U/http_credentials"
--http_heartbeat_interval="30secs" --initialize_driver_logging="true" --isolation="posix/cpu,posix/mem"
--launcher="posix" --launcher_dir="/mesos/mesos-1.4.0/_build/src" --logbufsecs="0" --logging_level="INFO"
--max_completed_executors_per_framework="150" --oversubscribed_resources_interval="15secs"
--perf_duration="10secs" --perf_interval="1mins" --port="5051" --qos_correction_interval_min="0ns"
--quiet="false" --recover="reconnect" --recovery_timeout="15mins" --registration_backoff_factor="10ms"
--resources="cpus:2;gpus:0;mem:1024;disk:1024;ports:[31000-32000]" --revocable_cpu_low_priority="true"
--runtime_dir="/tmp/Endpoint_SlaveEndpointTest_NoAuthorizer_0_DRXI4U" --sandbox_directory="/mnt/mesos/sandbox"
--strict="true" --switch_user="true" --systemd_enable_support="true" --systemd_runtime_directory="/run/systemd/system"
--version="false" --work_dir="/tmp/Endpoint_SlaveEndpointTest_NoAuthorizer_0_4kV7Kb"
I0529 17:30:53.241058 25101 credentials.hpp:86] Loading credential for authentication from
'/tmp/Endpoint_SlaveEndpointTest_NoAuthorizer_0_DRXI4U/credential'
I0529 17:30:53.241250 25101 slave.cpp:265] Agent using credential for: test-principal
I0529 17:30:53.241276 25101 credentials.hpp:37] Loading credentials for authentication from
'/tmp/Endpoint_SlaveEndpointTest_NoAuthorizer_0_DRXI4U/http_credentials'
I0529 17:30:53.241636 25101 http.cpp:975] Creating default 'basic' HTTP authenticator for
realm 'mesos-agent-executor'
I0529 17:30:53.241760 25101 http.cpp:996] Creating default 'jwt' HTTP authenticator for realm
'mesos-agent-executor'
I0529 17:30:53.241993 25101 http.cpp:975] Creating default 'basic' HTTP authenticator for
realm 'mesos-agent-readonly'
I0529 17:30:53.242101 25101 http.cpp:996] Creating default 'jwt' HTTP authenticator for realm
'mesos-agent-readonly'
I0529 17:30:53.242347 25101 http.cpp:975] Creating default 'basic' HTTP authenticator for
realm 'mesos-agent-readwrite'
I0529 17:30:53.242458 25101 http.cpp:996] Creating default 'jwt' HTTP authenticator for realm
'mesos-agent-readwrite'
I0529 17:30:53.243767 25101 slave.cpp:536] Agent resources: cpus(*):2; mem(*):1024; disk(*):1024;
ports(*):[31000-32000]
I0529 17:30:53.243831 25101 slave.cpp:544] Agent attributes: [  ]
I0529 17:30:53.243844 25101 slave.cpp:549] Agent hostname: 2d621b27ff7a
I0529 17:30:53.243999 25099 status_update_manager.cpp:177] Pausing sending status updates
I0529 17:30:53.245117 25096 state.cpp:62] Recovering state from '/tmp/Endpoint_SlaveEndpointTest_NoAuthorizer_0_4kV7Kb/meta'
I0529 17:30:53.245549 25089 status_update_manager.cpp:203] Recovering status update manager
I0529 17:30:53.245731 25102 containerizer.cpp:582] Recovering containerizer
I0529 17:30:53.247061 25087 provisioner.cpp:416] Provisioner recovery complete
I0529 17:30:53.247424 25097 slave.cpp:6083] Finished recovery
I0529 17:30:53.247917 25097 slave.cpp:6265] Querying resource estimator for oversubscribable
resources
I0529 17:30:53.248154 25088 slave.cpp:6279] Received oversubscribable resources {} from the
resource estimator
I0529 17:30:53.250072 25101 process.cpp:3730] Handling HTTP event for process 'slave(761)'
with path: '/slave(761)/monitor/statistics'
I0529 17:30:53.251688 25088 http.cpp:1115] HTTP GET for /slave(761)/monitor/statistics from
172.17.0.3:54207
I0529 17:30:53.251798 25088 http.cpp:936] Authorizing principal 'test-principal' to GET the
'/monitor/statistics' endpoint
I0529 17:30:53.254674 25096 slave.cpp:801] Agent terminating
[       OK ] Endpoint/SlaveEndpointTest.NoAuthorizer/0 (27 ms)
[ RUN      ] Endpoint/SlaveEndpointTest.NoAuthorizer/1
I0529 17:30:53.264672  6929 containerizer.cpp:230] Using isolation: posix/cpu,posix/mem,filesystem/posix,network/cni,environment_secret
W0529 17:30:53.265138  6929 backend.cpp:76] Failed to create 'aufs' backend: AufsBackend requires
root privileges
W0529 17:30:53.265244  6929 backend.cpp:76] Failed to create 'bind' backend: BindBackend requires
root privileges
I0529 17:30:53.265282  6929 provisioner.cpp:255] Using default backend 'copy'
I0529 17:30:53.266860  6929 cluster.cpp:448] Creating default 'local' authorizer
I0529 17:30:53.268165 25098 slave.cpp:232] Mesos agent started on (762)@172.17.0.3:55104
I0529 17:30:53.268188 25098 slave.cpp:233] Flags at startup: --acls="" --appc_simple_discovery_uri_prefix="http://"
--appc_store_dir="/tmp/mesos/store/appc" --authenticate_http_executors="true" --authenticate_http_readonly="true"
--authenticate_http_readwrite="true" --authenticatee="crammd5" --authentication_backoff_factor="1secs"
--authorizer="local" --cgroups_cpu_enable_pids_and_tids_count="false" --cgroups_enable_cfs="false"
--cgroups_hierarchy="/sys/fs/cgroup" --cgroups_limit_swap="false" --cgroups_root="mesos" --container_disk_watch_interval="15secs"
--containerizers="mesos" --credential="/tmp/Endpoint_SlaveEndpointTest_NoAuthorizer_1_GQQsAQ/credential"
--default_role="*" --disk_watch_interval="1mins" --docker="docker" --docker_kill_orphans="true"
--docker_registry="https://registry-1.docker.io" --docker_remove_delay="6hrs" --docker_socket="/var/run/docker.sock"
--docker_stop_timeout="0ns" --docker_store_dir="/tmp/mesos/store/docker" --docker_volume_checkpoint_dir="/var/run/mesos/isolators/docker/volume"
--enforce_container_disk_quota="false" --executor_registration_timeout="1mins" --executor_reregistration_timeout="2secs"
--executor_secret_key="/tmp/Endpoint_SlaveEndpointTest_NoAuthorizer_1_GQQsAQ/executor_secret_key"
--executor_shutdown_grace_period="5secs" --fetcher_cache_dir="/tmp/Endpoint_SlaveEndpointTest_NoAuthorizer_1_GQQsAQ/fetch"
--fetcher_cache_size="2GB" --frameworks_home="" --gc_delay="1weeks" --gc_disk_headroom="0.1"
--hadoop_home="" --help="false" --hostname_lookup="true" --http_command_executor="false" --http_credentials="/tmp/Endpoint_SlaveEndpointTest_NoAuthorizer_1_GQQsAQ/http_credentials"
--http_heartbeat_interval="30secs" --initialize_driver_logging="true" --isolation="posix/cpu,posix/mem"
--launcher="posix" --launcher_dir="/mesos/mesos-1.4.0/_build/src" --logbufsecs="0" --logging_level="INFO"
--max_completed_executors_per_framework="150" --oversubscribed_resources_interval="15secs"
--perf_duration="10secs" --perf_interval="1mins" --port="5051" --qos_correction_interval_min="0ns"
--quiet="false" --recover="reconnect" --recovery_timeout="15mins" --registration_backoff_factor="10ms"
--resources="cpus:2;gpus:0;mem:1024;disk:1024;ports:[31000-32000]" --revocable_cpu_low_priority="true"
--runtime_dir="/tmp/Endpoint_SlaveEndpointTest_NoAuthorizer_1_GQQsAQ" --sandbox_directory="/mnt/mesos/sandbox"
--strict="true" --switch_user="true" --systemd_enable_support="true" --systemd_runtime_directory="/run/systemd/system"
--version="false" --work_dir="/tmp/Endpoint_SlaveEndpointTest_NoAuthorizer_1_xQNmc7"
I0529 17:30:53.268682 25098 credentials.hpp:86] Loading credential for authentication from
'/tmp/Endpoint_SlaveEndpointTest_NoAuthorizer_1_GQQsAQ/credential'
I0529 17:30:53.268864 25098 slave.cpp:265] Agent using credential for: test-principal
I0529 17:30:53.268889 25098 credentials.hpp:37] Loading credentials for authentication from
'/tmp/Endpoint_SlaveEndpointTest_NoAuthorizer_1_GQQsAQ/http_credentials'
I0529 17:30:53.269225 25098 http.cpp:975] Creating default 'basic' HTTP authenticator for
realm 'mesos-agent-executor'
I0529 17:30:53.269340 25098 http.cpp:996] Creating default 'jwt' HTTP authenticator for realm
'mesos-agent-executor'
I0529 17:30:53.269542 25098 http.cpp:975] Creating default 'basic' HTTP authenticator for
realm 'mesos-agent-readonly'
I0529 17:30:53.269631 25098 http.cpp:996] Creating default 'jwt' HTTP authenticator for realm
'mesos-agent-readonly'
I0529 17:30:53.269791 25098 http.cpp:975] Creating default 'basic' HTTP authenticator for
realm 'mesos-agent-readwrite'
I0529 17:30:53.269879 25098 http.cpp:996] Creating default 'jwt' HTTP authenticator for realm
'mesos-agent-readwrite'
I0529 17:30:53.271095 25098 slave.cpp:536] Agent resources: cpus(*):2; mem(*):1024; disk(*):1024;
ports(*):[31000-32000]
I0529 17:30:53.271162 25098 slave.cpp:544] Agent attributes: [  ]
I0529 17:30:53.271173 25098 slave.cpp:549] Agent hostname: 2d621b27ff7a
I0529 17:30:53.271324 25090 status_update_manager.cpp:177] Pausing sending status updates
I0529 17:30:53.272488 25097 state.cpp:62] Recovering state from '/tmp/Endpoint_SlaveEndpointTest_NoAuthorizer_1_xQNmc7/meta'
I0529 17:30:53.272773 25089 status_update_manager.cpp:203] Recovering status update manager
I0529 17:30:53.273012 25087 containerizer.cpp:582] Recovering containerizer
I0529 17:30:53.274421 25099 provisioner.cpp:416] Provisioner recovery complete
I0529 17:30:53.274718 25094 slave.cpp:6083] Finished recovery
I0529 17:30:53.275173 25094 slave.cpp:6265] Querying resource estimator for oversubscribable
resources
I0529 17:30:53.275432 25089 slave.cpp:6279] Received oversubscribable resources {} from the
resource estimator
I0529 17:30:53.277382 25088 process.cpp:3730] Handling HTTP event for process 'slave(762)'
with path: '/slave(762)/monitor/statistics.json'
I0529 17:30:53.278981 25094 http.cpp:1115] HTTP GET for /slave(762)/monitor/statistics.json
from 172.17.0.3:54210
I0529 17:30:53.279052 25094 http.cpp:936] Authorizing principal 'test-principal' to GET the
'/monitor/statistics.json' endpoint
I0529 17:30:53.281939 25095 slave.cpp:801] Agent terminating
[       OK ] Endpoint/SlaveEndpointTest.NoAuthorizer/1 (27 ms)
[ RUN      ] Endpoint/SlaveEndpointTest.NoAuthorizer/2
I0529 17:30:53.292861  6929 containerizer.cpp:230] Using isolation: posix/cpu,posix/mem,filesystem/posix,network/cni,environment_secret
W0529 17:30:53.293315  6929 backend.cpp:76] Failed to create 'aufs' backend: AufsBackend requires
root privileges
W0529 17:30:53.293406  6929 backend.cpp:76] Failed to create 'bind' backend: BindBackend requires
root privileges
I0529 17:30:53.293443  6929 provisioner.cpp:255] Using default backend 'copy'
I0529 17:30:53.294962  6929 cluster.cpp:448] Creating default 'local' authorizer
I0529 17:30:53.296360 25095 slave.cpp:232] Mesos agent started on (763)@172.17.0.3:55104
I0529 17:30:53.296385 25095 slave.cpp:233] Flags at startup: --acls="" --appc_simple_discovery_uri_prefix="http://"
--appc_store_dir="/tmp/mesos/store/appc" --authenticate_http_executors="true" --authenticate_http_readonly="true"
--authenticate_http_readwrite="true" --authenticatee="crammd5" --authentication_backoff_factor="1secs"
--authorizer="local" --cgroups_cpu_enable_pids_and_tids_count="false" --cgroups_enable_cfs="false"
--cgroups_hierarchy="/sys/fs/cgroup" --cgroups_limit_swap="false" --cgroups_root="mesos" --container_disk_watch_interval="15secs"
--containerizers="mesos" --credential="/tmp/Endpoint_SlaveEndpointTest_NoAuthorizer_2_cH0hoM/credential"
--default_role="*" --disk_watch_interval="1mins" --docker="docker" --docker_kill_orphans="true"
--docker_registry="https://registry-1.docker.io" --docker_remove_delay="6hrs" --docker_socket="/var/run/docker.sock"
--docker_stop_timeout="0ns" --docker_store_dir="/tmp/mesos/store/docker" --docker_volume_checkpoint_dir="/var/run/mesos/isolators/docker/volume"
--enforce_container_disk_quota="false" --executor_registration_timeout="1mins" --executor_reregistration_timeout="2secs"
--executor_secret_key="/tmp/Endpoint_SlaveEndpointTest_NoAuthorizer_2_cH0hoM/executor_secret_key"
--executor_shutdown_grace_period="5secs" --fetcher_cache_dir="/tmp/Endpoint_SlaveEndpointTest_NoAuthorizer_2_cH0hoM/fetch"
--fetcher_cache_size="2GB" --frameworks_home="" --gc_delay="1weeks" --gc_disk_headroom="0.1"
--hadoop_home="" --help="false" --hostname_lookup="true" --http_command_executor="false" --http_credentials="/tmp/Endpoint_SlaveEndpointTest_NoAuthorizer_2_cH0hoM/http_credentials"
--http_heartbeat_interval="30secs" --initialize_driver_logging="true" --isolation="posix/cpu,posix/mem"
--launcher="posix" --launcher_dir="/mesos/mesos-1.4.0/_build/src" --logbufsecs="0" --logging_level="INFO"
--max_completed_executors_per_framework="150" --oversubscribed_resources_interval="15secs"
--perf_duration="10secs" --perf_interval="1mins" --port="5051" --qos_correction_interval_min="0ns"
--quiet="false" --recover="reconnect" --recovery_timeout="15mins" --registration_backoff_factor="10ms"
--resources="cpus:2;gpus:0;mem:1024;disk:1024;ports:[31000-32000]" --revocable_cpu_low_priority="true"
--runtime_dir="/tmp/Endpoint_SlaveEndpointTest_NoAuthorizer_2_cH0hoM" --sandbox_directory="/mnt/mesos/sandbox"
--strict="true" --switch_user="true" --systemd_enable_support="true" --systemd_runtime_directory="/run/systemd/system"
--version="false" --work_dir="/tmp/Endpoint_SlaveEndpointTest_NoAuthorizer_2_RgNDV2"
I0529 17:30:53.296928 25095 credentials.hpp:86] Loading credential for authentication from
'/tmp/Endpoint_SlaveEndpointTest_NoAuthorizer_2_cH0hoM/credential'
I0529 17:30:53.297127 25095 slave.cpp:265] Agent using credential for: test-principal
I0529 17:30:53.297155 25095 credentials.hpp:37] Loading credentials for authentication from
'/tmp/Endpoint_SlaveEndpointTest_NoAuthorizer_2_cH0hoM/http_credentials'
I0529 17:30:53.297523 25095 http.cpp:975] Creating default 'basic' HTTP authenticator for
realm 'mesos-agent-executor'
I0529 17:30:53.297652 25095 http.cpp:996] Creating default 'jwt' HTTP authenticator for realm
'mesos-agent-executor'
I0529 17:30:53.297888 25095 http.cpp:975] Creating default 'basic' HTTP authenticator for
realm 'mesos-agent-readonly'
I0529 17:30:53.297993 25095 http.cpp:996] Creating default 'jwt' HTTP authenticator for realm
'mesos-agent-readonly'
I0529 17:30:53.298250 25095 http.cpp:975] Creating default 'basic' HTTP authenticator for
realm 'mesos-agent-readwrite'
I0529 17:30:53.298359 25095 http.cpp:996] Creating default 'jwt' HTTP authenticator for realm
'mesos-agent-readwrite'
I0529 17:30:53.299651 25095 slave.cpp:536] Agent resources: cpus(*):2; mem(*):1024; disk(*):1024;
ports(*):[31000-32000]
I0529 17:30:53.299718 25095 slave.cpp:544] Agent attributes: [  ]
I0529 17:30:53.299731 25095 slave.cpp:549] Agent hostname: 2d621b27ff7a
I0529 17:30:53.299872 25090 status_update_manager.cpp:177] Pausing sending status updates
I0529 17:30:53.301084 25087 state.cpp:62] Recovering state from '/tmp/Endpoint_SlaveEndpointTest_NoAuthorizer_2_RgNDV2/meta'
I0529 17:30:53.301417 25089 status_update_manager.cpp:203] Recovering status update manager
I0529 17:30:53.301622 25097 containerizer.cpp:582] Recovering containerizer
I0529 17:30:53.302896 25102 provisioner.cpp:416] Provisioner recovery complete
I0529 17:30:53.303295 25098 slave.cpp:6083] Finished recovery
I0529 17:30:53.303864 25098 slave.cpp:6265] Querying resource estimator for oversubscribable
resources
I0529 17:30:53.304126 25095 slave.cpp:6279] Received oversubscribable resources {} from the
resource estimator
I0529 17:30:53.306032 25091 process.cpp:3730] Handling HTTP event for process 'slave(763)'
with path: '/slave(763)/containers'
I0529 17:30:53.307793 25093 http.cpp:1115] HTTP GET for /slave(763)/containers from 172.17.0.3:54211
I0529 17:30:53.307873 25093 http.cpp:936] Authorizing principal 'test-principal' to GET the
'/containers' endpoint
I0529 17:30:53.310601 25099 slave.cpp:801] Agent terminating
[       OK ] Endpoint/SlaveEndpointTest.NoAuthorizer/2 (27 ms)
[----------] 9 tests from Endpoint/SlaveEndpointTest (274 ms total)

[----------] Global test environment tear-down
[==========] 1591 tests from 178 test cases ran. (469752 ms total)
[  PASSED  ] 1590 tests.
[  FAILED  ] 1 test, listed below:
[  FAILED  ] ExamplesTest.PythonFramework

 1 FAILED TEST
  YOU HAVE 22 DISABLED TESTS

E0529 17:30:53.367043 25103 process.cpp:950] Failed to accept socket: future discarded
make[4]: *** [check-local] Error 1
make[4]: Leaving directory `/mesos/mesos-1.4.0/_build/src'
make[3]: *** [check-am] Error 2
make[3]: Leaving directory `/mesos/mesos-1.4.0/_build/src'
make[2]: *** [check] Error 2
make[2]: Leaving directory `/mesos/mesos-1.4.0/_build/src'
make[1]: *** [check-recursive] Error 1
make[1]: Leaving directory `/mesos/mesos-1.4.0/_build'
make: *** [distcheck] Error 1
+ docker rmi mesos-1496075746-9044
Untagged: mesos-1496075746-9044:latest
Deleted: sha256:8a903fc876aab57c47eb6cbc5357f85215db9a2f0a7916c152a4ac5fa50060b5
Deleted: sha256:b195dc9a9084d3942c7bcd2a4a61ffdfcede7973ba753fdbdc4c62e9469de075
Deleted: sha256:da61db5d9f07ec9b95d88cf9244d048101cdf6e419b2b44b9a5067e6c6edc64a
Deleted: sha256:777a20fcb024fa5c4855f85a4c4bebe8c6be65d767e995bbb90c16e992a8db71
Deleted: sha256:0c8e5d58196210cf1a49d12d9c4df7ca843b7e5ada198a30badedc87b727325a
Deleted: sha256:edc519e809c48dde238971c1bfca11cd3a2ed918869212712fb50a957eb9799b
Deleted: sha256:6ed2a9a31d0c7f112aef8aae4406721efd64c9bc0af43ba0e30210b3bf2ac107
Deleted: sha256:96f26fdc1aa1d498ce8eb95b9801c7ae9d56eced665a0d9a3f8370859debf911
Deleted: sha256:4d85fb81dea67290dac7fbc35ce7a17505d94dba9c45ce30ff004b43213405c6
Deleted: sha256:c60e3a39e5c115da30568cae1a6b66697356e7a0d06dd683f697703b98be5836
Deleted: sha256:b379565c61976ae9512cc3acd81ea3a63ea2e6c364993d7d86c7b8c0070ac021
Deleted: sha256:1ee9d03e9e89a70c2303d2512795f6afe67257185bedec8114b087641d487a65
Deleted: sha256:7684e693ff9ab76bfaf6fa80823a28139effaa66a8a3e514cf932cd191918a5e
Deleted: sha256:eb301da9b709acc3045852faacf6ff5fec99095fbd2c13acc2bd60cf0a045202
Deleted: sha256:750f0122f66e630dc5415fc709f3e8a324860f181d5d495359adad3472a9f32c
Deleted: sha256:ec9a423ac23abb0690f20387e179f954d8f0cfee0359919f820ca2cd947e3c0b
Deleted: sha256:0084b39f8ec3bdf9328226835ec061004a9f08ec0541c797ea94afdf7557b1f7
Deleted: sha256:ec1e9a0c7ec64810afe208d861aa5a9f17b89b0e9ac77e89e91fa518b7b4b132
Deleted: sha256:025cddee49ec1fad14b671dc47a3055dc84be35a6aae545a7286178aafa988bc
Deleted: sha256:7751bb520010a0acdb911b76697c8e91e9c2a63127f881e407fef8a78dc44eb3
Deleted: sha256:417fd4b3b4cc0df0c90752b6e84502983c1c53064e16706e12613dab74990d8c
Deleted: sha256:5133a894e29d17f6ba33c29bc4be5b0e1453e35ade79f1aa10c89820eb2dd40e
Deleted: sha256:df6d3c1457b0aaf770c36fb4df1784668025784c91bdb4fb4267cebc53d1c168
Deleted: sha256:17ed5b9b591155b4332997bf048ebcfed3ac3d31f8391bdaf4fe83bde532855b
Build step 'Execute shell' marked build as failure
Not sending mail to unregistered user neil.conway@gmail.com

Mime
View raw message