mesos-builds mailing list archives

Site index · List index
Message view « Date » · « Thread »
Top « Date » · « Thread »
From Apache Jenkins Server <jenk...@builds.apache.org>
Subject Build failed in Jenkins: Mesos-Buildbot » cmake,gcc,--verbose --enable-libevent --enable-ssl,GLOG_v=1 MESOS_VERBOSE=1,ubuntu:14.04,(docker||Hadoop)&&(!ubuntu-us1)&&(!ubuntu-eu2) #3622
Date Mon, 08 May 2017 14:40:32 GMT
See <https://builds.apache.org/job/Mesos-Buildbot/BUILDTOOL=cmake,COMPILER=gcc,CONFIGURATION=--verbose%20--enable-libevent%20--enable-ssl,ENVIRONMENT=GLOG_v=1%20MESOS_VERBOSE=1,OS=ubuntu%3A14.04,label_exp=(docker%7C%7CHadoop)&&(!ubuntu-us1)&&(!ubuntu-eu2)/3622/display/redirect?page=changes>

Changes:

[yujie.jay] Added basic resource provider Event/Call types.

[yujie.jay] Added internal wrapper messages for local resource provider Event/Call.

------------------------------------------
[...truncated 734.90 KB...]
[ 27%] Building CXX object 3rdparty/stout/tests/CMakeFiles/stout-tests.dir/hashset_tests.cpp.o
cd /mesos/build/3rdparty/stout/tests && /usr/bin/g++   -DBUILD_FLAGS=\"\" -DBUILD_JAVA_JVM_LIBRARY=\"\" -DHAS_AUTHENTICATION=1 -DLIBDIR=\"/usr/local/libmesos\" -DPICOJSON_USE_INT64 -DPKGDATADIR=\"/usr/local/share/mesos\" -DPKGLIBEXECDIR=\"/usr/local/libexec/mesos\" -DUSE_CMAKE_BUILD_CONFIG -DUSE_SSL_SOCKET=1 -DUSE_STATIC_LIB -DVERSION=\"1.4.0\" -D__STDC_FORMAT_MACROS -O2 -std=c++11 -g -fPIE -isystem /usr/include/apr-1.0 -isystem /mesos/build/3rdparty/boost-1.53.0/src/boost-1.53.0 -isystem /mesos/build/3rdparty/elfio-3.2/src/elfio-3.2 -isystem /mesos/build/3rdparty/glog-0.3.3/src/glog-0.3.3-lib/lib/include -isystem /mesos/build/3rdparty/nvml-352.79/src/nvml-352.79 -isystem /mesos/build/3rdparty/picojson-1.3.0/src/picojson-1.3.0 -isystem /mesos/build/3rdparty/protobuf-2.6.1/src/protobuf-2.6.1-lib/lib/include -isystem /usr/include/subversion-1 -isystem /mesos/build/3rdparty/gmock-1.7.0/src/gmock-1.7.0/include -isystem /mesos/build/3rdparty/gmock-1.7.0/src/gmock-1.7.0/gtest/include -I/mesos/3rdparty/stout/include    -o CMakeFiles/stout-tests.dir/hashset_tests.cpp.o -c /mesos/3rdparty/stout/tests/hashset_tests.cpp
/usr/bin/cmake -E cmake_progress_report /mesos/build/CMakeFiles 
[ 27%] Building CXX object src/CMakeFiles/mesos-protobufs.dir/__/include/mesos/scheduler/scheduler.pb.cc.o
cd /mesos/build/src && /usr/bin/g++   -DBUILD_FLAGS=\"\" -DBUILD_JAVA_JVM_LIBRARY=\"\" -DHAS_AUTHENTICATION=1 -DLIBDIR=\"/usr/local/libmesos\" -DPICOJSON_USE_INT64 -DPKGDATADIR=\"/usr/local/share/mesos\" -DPKGLIBEXECDIR=\"/usr/local/libexec/mesos\" -DUSE_CMAKE_BUILD_CONFIG -DUSE_SSL_SOCKET=1 -DUSE_STATIC_LIB -DVERSION=\"1.4.0\" -D__STDC_FORMAT_MACROS -Dmesos_protobufs_EXPORTS -O2 -std=c++11 -g -fPIC -I/mesos/build/include -I/mesos/build/include/mesos -I/mesos/build/src -I/mesos/src -isystem /mesos/build/3rdparty/protobuf-2.6.1/src/protobuf-2.6.1-lib/lib/include -isystem /mesos/3rdparty/libprocess/include -isystem /usr/include/apr-1.0 -isystem /mesos/build/3rdparty/boost-1.53.0/src/boost-1.53.0 -isystem /mesos/build/3rdparty/elfio-3.2/src/elfio-3.2 -isystem /mesos/build/3rdparty/glog-0.3.3/src/glog-0.3.3-lib/lib/include -isystem /mesos/build/3rdparty/nvml-352.79/src/nvml-352.79 -isystem /mesos/build/3rdparty/picojson-1.3.0/src/picojson-1.3.0 -isystem /usr/include/subversion-1 -isystem /mesos/3rdparty/stout/include -isystem /mesos/build/3rdparty/http_parser-2.6.2/src/http_parser-2.6.2 -isystem /mesos/build/3rdparty/libevent-2.1.5-beta/src/libevent-2.1.5-beta-lib/lib/include -isystem /mesos/build/3rdparty/zookeeper-3.4.8/src/zookeeper-3.4.8/src/c/include -isystem /mesos/build/3rdparty/zookeeper-3.4.8/src/zookeeper-3.4.8/src/c/generated -isystem /mesos/build/3rdparty/leveldb-1.19/src/leveldb-1.19/include -I/mesos/include    -o CMakeFiles/mesos-protobufs.dir/__/include/mesos/scheduler/scheduler.pb.cc.o -c /mesos/build/include/mesos/scheduler/scheduler.pb.cc
/usr/bin/cmake -E cmake_progress_report /mesos/build/CMakeFiles 
[ 27%] Building CXX object 3rdparty/libprocess/src/CMakeFiles/process-0.0.1.dir/pid.cpp.o
cd /mesos/build/3rdparty/libprocess/src && /usr/bin/g++   -DBUILD_FLAGS=\"\" -DBUILD_JAVA_JVM_LIBRARY=\"\" -DHAS_AUTHENTICATION=1 -DLIBDIR=\"/usr/local/libmesos\" -DPICOJSON_USE_INT64 -DPKGDATADIR=\"/usr/local/share/mesos\" -DPKGLIBEXECDIR=\"/usr/local/libexec/mesos\" -DUSE_CMAKE_BUILD_CONFIG -DUSE_SSL_SOCKET=1 -DUSE_STATIC_LIB -DVERSION=\"1.4.0\" -D__STDC_FORMAT_MACROS -Dprocess_0_0_1_EXPORTS -O2 -std=c++11 -g -fPIC -isystem /usr/include/apr-1.0 -isystem /mesos/build/3rdparty/boost-1.53.0/src/boost-1.53.0 -isystem /mesos/build/3rdparty/elfio-3.2/src/elfio-3.2 -isystem /mesos/build/3rdparty/glog-0.3.3/src/glog-0.3.3-lib/lib/include -isystem /mesos/build/3rdparty/nvml-352.79/src/nvml-352.79 -isystem /mesos/build/3rdparty/picojson-1.3.0/src/picojson-1.3.0 -isystem /mesos/build/3rdparty/protobuf-2.6.1/src/protobuf-2.6.1-lib/lib/include -isystem /usr/include/subversion-1 -isystem /mesos/3rdparty/stout/include -isystem /mesos/build/3rdparty/http_parser-2.6.2/src/http_parser-2.6.2 -isystem /mesos/build/3rdparty/libevent-2.1.5-beta/src/libevent-2.1.5-beta-lib/lib/include -I/mesos/3rdparty/libprocess/include    -o CMakeFiles/process-0.0.1.dir/pid.cpp.o -c /mesos/3rdparty/libprocess/src/pid.cpp
/usr/bin/cmake -E cmake_progress_report /mesos/build/CMakeFiles 
[ 27%] Building CXX object 3rdparty/stout/tests/CMakeFiles/stout-tests.dir/interval_tests.cpp.o
cd /mesos/build/3rdparty/stout/tests && /usr/bin/g++   -DBUILD_FLAGS=\"\" -DBUILD_JAVA_JVM_LIBRARY=\"\" -DHAS_AUTHENTICATION=1 -DLIBDIR=\"/usr/local/libmesos\" -DPICOJSON_USE_INT64 -DPKGDATADIR=\"/usr/local/share/mesos\" -DPKGLIBEXECDIR=\"/usr/local/libexec/mesos\" -DUSE_CMAKE_BUILD_CONFIG -DUSE_SSL_SOCKET=1 -DUSE_STATIC_LIB -DVERSION=\"1.4.0\" -D__STDC_FORMAT_MACROS -O2 -std=c++11 -g -fPIE -isystem /usr/include/apr-1.0 -isystem /mesos/build/3rdparty/boost-1.53.0/src/boost-1.53.0 -isystem /mesos/build/3rdparty/elfio-3.2/src/elfio-3.2 -isystem /mesos/build/3rdparty/glog-0.3.3/src/glog-0.3.3-lib/lib/include -isystem /mesos/build/3rdparty/nvml-352.79/src/nvml-352.79 -isystem /mesos/build/3rdparty/picojson-1.3.0/src/picojson-1.3.0 -isystem /mesos/build/3rdparty/protobuf-2.6.1/src/protobuf-2.6.1-lib/lib/include -isystem /usr/include/subversion-1 -isystem /mesos/build/3rdparty/gmock-1.7.0/src/gmock-1.7.0/include -isystem /mesos/build/3rdparty/gmock-1.7.0/src/gmock-1.7.0/gtest/include -I/mesos/3rdparty/stout/include    -o CMakeFiles/stout-tests.dir/interval_tests.cpp.o -c /mesos/3rdparty/stout/tests/interval_tests.cpp
/usr/bin/cmake -E cmake_progress_report /mesos/build/CMakeFiles 
[ 27%] Building CXX object 3rdparty/libprocess/src/CMakeFiles/process-0.0.1.dir/poll_socket.cpp.o
cd /mesos/build/3rdparty/libprocess/src && /usr/bin/g++   -DBUILD_FLAGS=\"\" -DBUILD_JAVA_JVM_LIBRARY=\"\" -DHAS_AUTHENTICATION=1 -DLIBDIR=\"/usr/local/libmesos\" -DPICOJSON_USE_INT64 -DPKGDATADIR=\"/usr/local/share/mesos\" -DPKGLIBEXECDIR=\"/usr/local/libexec/mesos\" -DUSE_CMAKE_BUILD_CONFIG -DUSE_SSL_SOCKET=1 -DUSE_STATIC_LIB -DVERSION=\"1.4.0\" -D__STDC_FORMAT_MACROS -Dprocess_0_0_1_EXPORTS -O2 -std=c++11 -g -fPIC -isystem /usr/include/apr-1.0 -isystem /mesos/build/3rdparty/boost-1.53.0/src/boost-1.53.0 -isystem /mesos/build/3rdparty/elfio-3.2/src/elfio-3.2 -isystem /mesos/build/3rdparty/glog-0.3.3/src/glog-0.3.3-lib/lib/include -isystem /mesos/build/3rdparty/nvml-352.79/src/nvml-352.79 -isystem /mesos/build/3rdparty/picojson-1.3.0/src/picojson-1.3.0 -isystem /mesos/build/3rdparty/protobuf-2.6.1/src/protobuf-2.6.1-lib/lib/include -isystem /usr/include/subversion-1 -isystem /mesos/3rdparty/stout/include -isystem /mesos/build/3rdparty/http_parser-2.6.2/src/http_parser-2.6.2 -isystem /mesos/build/3rdparty/libevent-2.1.5-beta/src/libevent-2.1.5-beta-lib/lib/include -I/mesos/3rdparty/libprocess/include    -o CMakeFiles/process-0.0.1.dir/poll_socket.cpp.o -c /mesos/3rdparty/libprocess/src/poll_socket.cpp
/usr/bin/cmake -E cmake_progress_report /mesos/build/CMakeFiles 84
[ 28%] Building CXX object 3rdparty/libprocess/src/CMakeFiles/process-0.0.1.dir/profiler.cpp.o
cd /mesos/build/3rdparty/libprocess/src && /usr/bin/g++   -DBUILD_FLAGS=\"\" -DBUILD_JAVA_JVM_LIBRARY=\"\" -DHAS_AUTHENTICATION=1 -DLIBDIR=\"/usr/local/libmesos\" -DPICOJSON_USE_INT64 -DPKGDATADIR=\"/usr/local/share/mesos\" -DPKGLIBEXECDIR=\"/usr/local/libexec/mesos\" -DUSE_CMAKE_BUILD_CONFIG -DUSE_SSL_SOCKET=1 -DUSE_STATIC_LIB -DVERSION=\"1.4.0\" -D__STDC_FORMAT_MACROS -Dprocess_0_0_1_EXPORTS -O2 -std=c++11 -g -fPIC -isystem /usr/include/apr-1.0 -isystem /mesos/build/3rdparty/boost-1.53.0/src/boost-1.53.0 -isystem /mesos/build/3rdparty/elfio-3.2/src/elfio-3.2 -isystem /mesos/build/3rdparty/glog-0.3.3/src/glog-0.3.3-lib/lib/include -isystem /mesos/build/3rdparty/nvml-352.79/src/nvml-352.79 -isystem /mesos/build/3rdparty/picojson-1.3.0/src/picojson-1.3.0 -isystem /mesos/build/3rdparty/protobuf-2.6.1/src/protobuf-2.6.1-lib/lib/include -isystem /usr/include/subversion-1 -isystem /mesos/3rdparty/stout/include -isystem /mesos/build/3rdparty/http_parser-2.6.2/src/http_parser-2.6.2 -isystem /mesos/build/3rdparty/libevent-2.1.5-beta/src/libevent-2.1.5-beta-lib/lib/include -I/mesos/3rdparty/libprocess/include    -o CMakeFiles/process-0.0.1.dir/profiler.cpp.o -c /mesos/3rdparty/libprocess/src/profiler.cpp
/usr/bin/cmake -E cmake_progress_report /mesos/build/CMakeFiles 
[ 28%] Building CXX object src/CMakeFiles/mesos-protobufs.dir/__/include/mesos/state/state.pb.cc.o
cd /mesos/build/src && /usr/bin/g++   -DBUILD_FLAGS=\"\" -DBUILD_JAVA_JVM_LIBRARY=\"\" -DHAS_AUTHENTICATION=1 -DLIBDIR=\"/usr/local/libmesos\" -DPICOJSON_USE_INT64 -DPKGDATADIR=\"/usr/local/share/mesos\" -DPKGLIBEXECDIR=\"/usr/local/libexec/mesos\" -DUSE_CMAKE_BUILD_CONFIG -DUSE_SSL_SOCKET=1 -DUSE_STATIC_LIB -DVERSION=\"1.4.0\" -D__STDC_FORMAT_MACROS -Dmesos_protobufs_EXPORTS -O2 -std=c++11 -g -fPIC -I/mesos/build/include -I/mesos/build/include/mesos -I/mesos/build/src -I/mesos/src -isystem /mesos/build/3rdparty/protobuf-2.6.1/src/protobuf-2.6.1-lib/lib/include -isystem /mesos/3rdparty/libprocess/include -isystem /usr/include/apr-1.0 -isystem /mesos/build/3rdparty/boost-1.53.0/src/boost-1.53.0 -isystem /mesos/build/3rdparty/elfio-3.2/src/elfio-3.2 -isystem /mesos/build/3rdparty/glog-0.3.3/src/glog-0.3.3-lib/lib/include -isystem /mesos/build/3rdparty/nvml-352.79/src/nvml-352.79 -isystem /mesos/build/3rdparty/picojson-1.3.0/src/picojson-1.3.0 -isystem /usr/include/subversion-1 -isystem /mesos/3rdparty/stout/include -isystem /mesos/build/3rdparty/http_parser-2.6.2/src/http_parser-2.6.2 -isystem /mesos/build/3rdparty/libevent-2.1.5-beta/src/libevent-2.1.5-beta-lib/lib/include -isystem /mesos/build/3rdparty/zookeeper-3.4.8/src/zookeeper-3.4.8/src/c/include -isystem /mesos/build/3rdparty/zookeeper-3.4.8/src/zookeeper-3.4.8/src/c/generated -isystem /mesos/build/3rdparty/leveldb-1.19/src/leveldb-1.19/include -I/mesos/include    -o CMakeFiles/mesos-protobufs.dir/__/include/mesos/state/state.pb.cc.o -c /mesos/build/include/mesos/state/state.pb.cc
/usr/bin/cmake -E cmake_progress_report /mesos/build/CMakeFiles 
[ 28%] Building CXX object 3rdparty/stout/tests/CMakeFiles/stout-tests.dir/ip_tests.cpp.o
cd /mesos/build/3rdparty/stout/tests && /usr/bin/g++   -DBUILD_FLAGS=\"\" -DBUILD_JAVA_JVM_LIBRARY=\"\" -DHAS_AUTHENTICATION=1 -DLIBDIR=\"/usr/local/libmesos\" -DPICOJSON_USE_INT64 -DPKGDATADIR=\"/usr/local/share/mesos\" -DPKGLIBEXECDIR=\"/usr/local/libexec/mesos\" -DUSE_CMAKE_BUILD_CONFIG -DUSE_SSL_SOCKET=1 -DUSE_STATIC_LIB -DVERSION=\"1.4.0\" -D__STDC_FORMAT_MACROS -O2 -std=c++11 -g -fPIE -isystem /usr/include/apr-1.0 -isystem /mesos/build/3rdparty/boost-1.53.0/src/boost-1.53.0 -isystem /mesos/build/3rdparty/elfio-3.2/src/elfio-3.2 -isystem /mesos/build/3rdparty/glog-0.3.3/src/glog-0.3.3-lib/lib/include -isystem /mesos/build/3rdparty/nvml-352.79/src/nvml-352.79 -isystem /mesos/build/3rdparty/picojson-1.3.0/src/picojson-1.3.0 -isystem /mesos/build/3rdparty/protobuf-2.6.1/src/protobuf-2.6.1-lib/lib/include -isystem /usr/include/subversion-1 -isystem /mesos/build/3rdparty/gmock-1.7.0/src/gmock-1.7.0/include -isystem /mesos/build/3rdparty/gmock-1.7.0/src/gmock-1.7.0/gtest/include -I/mesos/3rdparty/stout/include    -o CMakeFiles/stout-tests.dir/ip_tests.cpp.o -c /mesos/3rdparty/stout/tests/ip_tests.cpp
/usr/bin/cmake -E cmake_progress_report /mesos/build/CMakeFiles 
[ 28%] Building CXX object 3rdparty/stout/tests/CMakeFiles/stout-tests.dir/json_tests.cpp.o
cd /mesos/build/3rdparty/stout/tests && /usr/bin/g++   -DBUILD_FLAGS=\"\" -DBUILD_JAVA_JVM_LIBRARY=\"\" -DHAS_AUTHENTICATION=1 -DLIBDIR=\"/usr/local/libmesos\" -DPICOJSON_USE_INT64 -DPKGDATADIR=\"/usr/local/share/mesos\" -DPKGLIBEXECDIR=\"/usr/local/libexec/mesos\" -DUSE_CMAKE_BUILD_CONFIG -DUSE_SSL_SOCKET=1 -DUSE_STATIC_LIB -DVERSION=\"1.4.0\" -D__STDC_FORMAT_MACROS -O2 -std=c++11 -g -fPIE -isystem /usr/include/apr-1.0 -isystem /mesos/build/3rdparty/boost-1.53.0/src/boost-1.53.0 -isystem /mesos/build/3rdparty/elfio-3.2/src/elfio-3.2 -isystem /mesos/build/3rdparty/glog-0.3.3/src/glog-0.3.3-lib/lib/include -isystem /mesos/build/3rdparty/nvml-352.79/src/nvml-352.79 -isystem /mesos/build/3rdparty/picojson-1.3.0/src/picojson-1.3.0 -isystem /mesos/build/3rdparty/protobuf-2.6.1/src/protobuf-2.6.1-lib/lib/include -isystem /usr/include/subversion-1 -isystem /mesos/build/3rdparty/gmock-1.7.0/src/gmock-1.7.0/include -isystem /mesos/build/3rdparty/gmock-1.7.0/src/gmock-1.7.0/gtest/include -I/mesos/3rdparty/stout/include    -o CMakeFiles/stout-tests.dir/json_tests.cpp.o -c /mesos/3rdparty/stout/tests/json_tests.cpp
/usr/bin/cmake -E cmake_progress_report /mesos/build/CMakeFiles 
[ 28%] Building CXX object src/CMakeFiles/mesos-protobufs.dir/__/include/mesos/uri/uri.pb.cc.o
cd /mesos/build/src && /usr/bin/g++   -DBUILD_FLAGS=\"\" -DBUILD_JAVA_JVM_LIBRARY=\"\" -DHAS_AUTHENTICATION=1 -DLIBDIR=\"/usr/local/libmesos\" -DPICOJSON_USE_INT64 -DPKGDATADIR=\"/usr/local/share/mesos\" -DPKGLIBEXECDIR=\"/usr/local/libexec/mesos\" -DUSE_CMAKE_BUILD_CONFIG -DUSE_SSL_SOCKET=1 -DUSE_STATIC_LIB -DVERSION=\"1.4.0\" -D__STDC_FORMAT_MACROS -Dmesos_protobufs_EXPORTS -O2 -std=c++11 -g -fPIC -I/mesos/build/include -I/mesos/build/include/mesos -I/mesos/build/src -I/mesos/src -isystem /mesos/build/3rdparty/protobuf-2.6.1/src/protobuf-2.6.1-lib/lib/include -isystem /mesos/3rdparty/libprocess/include -isystem /usr/include/apr-1.0 -isystem /mesos/build/3rdparty/boost-1.53.0/src/boost-1.53.0 -isystem /mesos/build/3rdparty/elfio-3.2/src/elfio-3.2 -isystem /mesos/build/3rdparty/glog-0.3.3/src/glog-0.3.3-lib/lib/include -isystem /mesos/build/3rdparty/nvml-352.79/src/nvml-352.79 -isystem /mesos/build/3rdparty/picojson-1.3.0/src/picojson-1.3.0 -isystem /usr/include/subversion-1 -isystem /mesos/3rdparty/stout/include -isystem /mesos/build/3rdparty/http_parser-2.6.2/src/http_parser-2.6.2 -isystem /mesos/build/3rdparty/libevent-2.1.5-beta/src/libevent-2.1.5-beta-lib/lib/include -isystem /mesos/build/3rdparty/zookeeper-3.4.8/src/zookeeper-3.4.8/src/c/include -isystem /mesos/build/3rdparty/zookeeper-3.4.8/src/zookeeper-3.4.8/src/c/generated -isystem /mesos/build/3rdparty/leveldb-1.19/src/leveldb-1.19/include -I/mesos/include    -o CMakeFiles/mesos-protobufs.dir/__/include/mesos/uri/uri.pb.cc.o -c /mesos/build/include/mesos/uri/uri.pb.cc
/usr/bin/cmake -E cmake_progress_report /mesos/build/CMakeFiles 
[ 28%] Building CXX object src/CMakeFiles/mesos-protobufs.dir/__/include/mesos/v1/agent/agent.pb.cc.o
cd /mesos/build/src && /usr/bin/g++   -DBUILD_FLAGS=\"\" -DBUILD_JAVA_JVM_LIBRARY=\"\" -DHAS_AUTHENTICATION=1 -DLIBDIR=\"/usr/local/libmesos\" -DPICOJSON_USE_INT64 -DPKGDATADIR=\"/usr/local/share/mesos\" -DPKGLIBEXECDIR=\"/usr/local/libexec/mesos\" -DUSE_CMAKE_BUILD_CONFIG -DUSE_SSL_SOCKET=1 -DUSE_STATIC_LIB -DVERSION=\"1.4.0\" -D__STDC_FORMAT_MACROS -Dmesos_protobufs_EXPORTS -O2 -std=c++11 -g -fPIC -I/mesos/build/include -I/mesos/build/include/mesos -I/mesos/build/src -I/mesos/src -isystem /mesos/build/3rdparty/protobuf-2.6.1/src/protobuf-2.6.1-lib/lib/include -isystem /mesos/3rdparty/libprocess/include -isystem /usr/include/apr-1.0 -isystem /mesos/build/3rdparty/boost-1.53.0/src/boost-1.53.0 -isystem /mesos/build/3rdparty/elfio-3.2/src/elfio-3.2 -isystem /mesos/build/3rdparty/glog-0.3.3/src/glog-0.3.3-lib/lib/include -isystem /mesos/build/3rdparty/nvml-352.79/src/nvml-352.79 -isystem /mesos/build/3rdparty/picojson-1.3.0/src/picojson-1.3.0 -isystem /usr/include/subversion-1 -isystem /mesos/3rdparty/stout/include -isystem /mesos/build/3rdparty/http_parser-2.6.2/src/http_parser-2.6.2 -isystem /mesos/build/3rdparty/libevent-2.1.5-beta/src/libevent-2.1.5-beta-lib/lib/include -isystem /mesos/build/3rdparty/zookeeper-3.4.8/src/zookeeper-3.4.8/src/c/include -isystem /mesos/build/3rdparty/zookeeper-3.4.8/src/zookeeper-3.4.8/src/c/generated -isystem /mesos/build/3rdparty/leveldb-1.19/src/leveldb-1.19/include -I/mesos/include    -o CMakeFiles/mesos-protobufs.dir/__/include/mesos/v1/agent/agent.pb.cc.o -c /mesos/build/include/mesos/v1/agent/agent.pb.cc
/usr/bin/cmake -E cmake_progress_report /mesos/build/CMakeFiles 
[ 28%] Building CXX object src/CMakeFiles/mesos-protobufs.dir/__/include/mesos/v1/allocator/allocator.pb.cc.o
cd /mesos/build/src && /usr/bin/g++   -DBUILD_FLAGS=\"\" -DBUILD_JAVA_JVM_LIBRARY=\"\" -DHAS_AUTHENTICATION=1 -DLIBDIR=\"/usr/local/libmesos\" -DPICOJSON_USE_INT64 -DPKGDATADIR=\"/usr/local/share/mesos\" -DPKGLIBEXECDIR=\"/usr/local/libexec/mesos\" -DUSE_CMAKE_BUILD_CONFIG -DUSE_SSL_SOCKET=1 -DUSE_STATIC_LIB -DVERSION=\"1.4.0\" -D__STDC_FORMAT_MACROS -Dmesos_protobufs_EXPORTS -O2 -std=c++11 -g -fPIC -I/mesos/build/include -I/mesos/build/include/mesos -I/mesos/build/src -I/mesos/src -isystem /mesos/build/3rdparty/protobuf-2.6.1/src/protobuf-2.6.1-lib/lib/include -isystem /mesos/3rdparty/libprocess/include -isystem /usr/include/apr-1.0 -isystem /mesos/build/3rdparty/boost-1.53.0/src/boost-1.53.0 -isystem /mesos/build/3rdparty/elfio-3.2/src/elfio-3.2 -isystem /mesos/build/3rdparty/glog-0.3.3/src/glog-0.3.3-lib/lib/include -isystem /mesos/build/3rdparty/nvml-352.79/src/nvml-352.79 -isystem /mesos/build/3rdparty/picojson-1.3.0/src/picojson-1.3.0 -isystem /usr/include/subversion-1 -isystem /mesos/3rdparty/stout/include -isystem /mesos/build/3rdparty/http_parser-2.6.2/src/http_parser-2.6.2 -isystem /mesos/build/3rdparty/libevent-2.1.5-beta/src/libevent-2.1.5-beta-lib/lib/include -isystem /mesos/build/3rdparty/zookeeper-3.4.8/src/zookeeper-3.4.8/src/c/include -isystem /mesos/build/3rdparty/zookeeper-3.4.8/src/zookeeper-3.4.8/src/c/generated -isystem /mesos/build/3rdparty/leveldb-1.19/src/leveldb-1.19/include -I/mesos/include    -o CMakeFiles/mesos-protobufs.dir/__/include/mesos/v1/allocator/allocator.pb.cc.o -c /mesos/build/include/mesos/v1/allocator/allocator.pb.cc
/usr/bin/cmake -E cmake_progress_report /mesos/build/CMakeFiles 
[ 28%] Building CXX object src/CMakeFiles/mesos-protobufs.dir/__/include/mesos/v1/executor/executor.pb.cc.o
cd /mesos/build/src && /usr/bin/g++   -DBUILD_FLAGS=\"\" -DBUILD_JAVA_JVM_LIBRARY=\"\" -DHAS_AUTHENTICATION=1 -DLIBDIR=\"/usr/local/libmesos\" -DPICOJSON_USE_INT64 -DPKGDATADIR=\"/usr/local/share/mesos\" -DPKGLIBEXECDIR=\"/usr/local/libexec/mesos\" -DUSE_CMAKE_BUILD_CONFIG -DUSE_SSL_SOCKET=1 -DUSE_STATIC_LIB -DVERSION=\"1.4.0\" -D__STDC_FORMAT_MACROS -Dmesos_protobufs_EXPORTS -O2 -std=c++11 -g -fPIC -I/mesos/build/include -I/mesos/build/include/mesos -I/mesos/build/src -I/mesos/src -isystem /mesos/build/3rdparty/protobuf-2.6.1/src/protobuf-2.6.1-lib/lib/include -isystem /mesos/3rdparty/libprocess/include -isystem /usr/include/apr-1.0 -isystem /mesos/build/3rdparty/boost-1.53.0/src/boost-1.53.0 -isystem /mesos/build/3rdparty/elfio-3.2/src/elfio-3.2 -isystem /mesos/build/3rdparty/glog-0.3.3/src/glog-0.3.3-lib/lib/include -isystem /mesos/build/3rdparty/nvml-352.79/src/nvml-352.79 -isystem /mesos/build/3rdparty/picojson-1.3.0/src/picojson-1.3.0 -isystem /usr/include/subversion-1 -isystem /mesos/3rdparty/stout/include -isystem /mesos/build/3rdparty/http_parser-2.6.2/src/http_parser-2.6.2 -isystem /mesos/build/3rdparty/libevent-2.1.5-beta/src/libevent-2.1.5-beta-lib/lib/include -isystem /mesos/build/3rdparty/zookeeper-3.4.8/src/zookeeper-3.4.8/src/c/include -isystem /mesos/build/3rdparty/zookeeper-3.4.8/src/zookeeper-3.4.8/src/c/generated -isystem /mesos/build/3rdparty/leveldb-1.19/src/leveldb-1.19/include -I/mesos/include    -o CMakeFiles/mesos-protobufs.dir/__/include/mesos/v1/executor/executor.pb.cc.o -c /mesos/build/include/mesos/v1/executor/executor.pb.cc
/usr/bin/cmake -E cmake_progress_report /mesos/build/CMakeFiles 
[ 28%] Building CXX object 3rdparty/stout/tests/CMakeFiles/stout-tests.dir/jsonify_tests.cpp.o
cd /mesos/build/3rdparty/stout/tests && /usr/bin/g++   -DBUILD_FLAGS=\"\" -DBUILD_JAVA_JVM_LIBRARY=\"\" -DHAS_AUTHENTICATION=1 -DLIBDIR=\"/usr/local/libmesos\" -DPICOJSON_USE_INT64 -DPKGDATADIR=\"/usr/local/share/mesos\" -DPKGLIBEXECDIR=\"/usr/local/libexec/mesos\" -DUSE_CMAKE_BUILD_CONFIG -DUSE_SSL_SOCKET=1 -DUSE_STATIC_LIB -DVERSION=\"1.4.0\" -D__STDC_FORMAT_MACROS -O2 -std=c++11 -g -fPIE -isystem /usr/include/apr-1.0 -isystem /mesos/build/3rdparty/boost-1.53.0/src/boost-1.53.0 -isystem /mesos/build/3rdparty/elfio-3.2/src/elfio-3.2 -isystem /mesos/build/3rdparty/glog-0.3.3/src/glog-0.3.3-lib/lib/include -isystem /mesos/build/3rdparty/nvml-352.79/src/nvml-352.79 -isystem /mesos/build/3rdparty/picojson-1.3.0/src/picojson-1.3.0 -isystem /mesos/build/3rdparty/protobuf-2.6.1/src/protobuf-2.6.1-lib/lib/include -isystem /usr/include/subversion-1 -isystem /mesos/build/3rdparty/gmock-1.7.0/src/gmock-1.7.0/include -isystem /mesos/build/3rdparty/gmock-1.7.0/src/gmock-1.7.0/gtest/include -I/mesos/3rdparty/stout/include    -o CMakeFiles/stout-tests.dir/jsonify_tests.cpp.o -c /mesos/3rdparty/stout/tests/jsonify_tests.cpp
/usr/bin/cmake -E cmake_progress_report /mesos/build/CMakeFiles 90
[ 29%] Building CXX object 3rdparty/stout/tests/CMakeFiles/stout-tests.dir/linkedhashmap_tests.cpp.o
cd /mesos/build/3rdparty/stout/tests && /usr/bin/g++   -DBUILD_FLAGS=\"\" -DBUILD_JAVA_JVM_LIBRARY=\"\" -DHAS_AUTHENTICATION=1 -DLIBDIR=\"/usr/local/libmesos\" -DPICOJSON_USE_INT64 -DPKGDATADIR=\"/usr/local/share/mesos\" -DPKGLIBEXECDIR=\"/usr/local/libexec/mesos\" -DUSE_CMAKE_BUILD_CONFIG -DUSE_SSL_SOCKET=1 -DUSE_STATIC_LIB -DVERSION=\"1.4.0\" -D__STDC_FORMAT_MACROS -O2 -std=c++11 -g -fPIE -isystem /usr/include/apr-1.0 -isystem /mesos/build/3rdparty/boost-1.53.0/src/boost-1.53.0 -isystem /mesos/build/3rdparty/elfio-3.2/src/elfio-3.2 -isystem /mesos/build/3rdparty/glog-0.3.3/src/glog-0.3.3-lib/lib/include -isystem /mesos/build/3rdparty/nvml-352.79/src/nvml-352.79 -isystem /mesos/build/3rdparty/picojson-1.3.0/src/picojson-1.3.0 -isystem /mesos/build/3rdparty/protobuf-2.6.1/src/protobuf-2.6.1-lib/lib/include -isystem /usr/include/subversion-1 -isystem /mesos/build/3rdparty/gmock-1.7.0/src/gmock-1.7.0/include -isystem /mesos/build/3rdparty/gmock-1.7.0/src/gmock-1.7.0/gtest/include -I/mesos/3rdparty/stout/include    -o CMakeFiles/stout-tests.dir/linkedhashmap_tests.cpp.o -c /mesos/3rdparty/stout/tests/linkedhashmap_tests.cpp
/usr/bin/cmake -E cmake_progress_report /mesos/build/CMakeFiles 
[ 29%] Building CXX object 3rdparty/libprocess/src/CMakeFiles/process-0.0.1.dir/process.cpp.o
cd /mesos/build/3rdparty/libprocess/src && /usr/bin/g++   -DBUILD_FLAGS=\"\" -DBUILD_JAVA_JVM_LIBRARY=\"\" -DHAS_AUTHENTICATION=1 -DLIBDIR=\"/usr/local/libmesos\" -DPICOJSON_USE_INT64 -DPKGDATADIR=\"/usr/local/share/mesos\" -DPKGLIBEXECDIR=\"/usr/local/libexec/mesos\" -DUSE_CMAKE_BUILD_CONFIG -DUSE_SSL_SOCKET=1 -DUSE_STATIC_LIB -DVERSION=\"1.4.0\" -D__STDC_FORMAT_MACROS -Dprocess_0_0_1_EXPORTS -O2 -std=c++11 -g -fPIC -isystem /usr/include/apr-1.0 -isystem /mesos/build/3rdparty/boost-1.53.0/src/boost-1.53.0 -isystem /mesos/build/3rdparty/elfio-3.2/src/elfio-3.2 -isystem /mesos/build/3rdparty/glog-0.3.3/src/glog-0.3.3-lib/lib/include -isystem /mesos/build/3rdparty/nvml-352.79/src/nvml-352.79 -isystem /mesos/build/3rdparty/picojson-1.3.0/src/picojson-1.3.0 -isystem /mesos/build/3rdparty/protobuf-2.6.1/src/protobuf-2.6.1-lib/lib/include -isystem /usr/include/subversion-1 -isystem /mesos/3rdparty/stout/include -isystem /mesos/build/3rdparty/http_parser-2.6.2/src/http_parser-2.6.2 -isystem /mesos/build/3rdparty/libevent-2.1.5-beta/src/libevent-2.1.5-beta-lib/lib/include -I/mesos/3rdparty/libprocess/include    -o CMakeFiles/process-0.0.1.dir/process.cpp.o -c /mesos/3rdparty/libprocess/src/process.cpp
/usr/bin/cmake -E cmake_progress_report /mesos/build/CMakeFiles 
[ 29%] Building CXX object 3rdparty/libprocess/src/CMakeFiles/process-0.0.1.dir/reap.cpp.o
cd /mesos/build/3rdparty/libprocess/src && /usr/bin/g++   -DBUILD_FLAGS=\"\" -DBUILD_JAVA_JVM_LIBRARY=\"\" -DHAS_AUTHENTICATION=1 -DLIBDIR=\"/usr/local/libmesos\" -DPICOJSON_USE_INT64 -DPKGDATADIR=\"/usr/local/share/mesos\" -DPKGLIBEXECDIR=\"/usr/local/libexec/mesos\" -DUSE_CMAKE_BUILD_CONFIG -DUSE_SSL_SOCKET=1 -DUSE_STATIC_LIB -DVERSION=\"1.4.0\" -D__STDC_FORMAT_MACROS -Dprocess_0_0_1_EXPORTS -O2 -std=c++11 -g -fPIC -isystem /usr/include/apr-1.0 -isystem /mesos/build/3rdparty/boost-1.53.0/src/boost-1.53.0 -isystem /mesos/build/3rdparty/elfio-3.2/src/elfio-3.2 -isystem /mesos/build/3rdparty/glog-0.3.3/src/glog-0.3.3-lib/lib/include -isystem /mesos/build/3rdparty/nvml-352.79/src/nvml-352.79 -isystem /mesos/build/3rdparty/picojson-1.3.0/src/picojson-1.3.0 -isystem /mesos/build/3rdparty/protobuf-2.6.1/src/protobuf-2.6.1-lib/lib/include -isystem /usr/include/subversion-1 -isystem /mesos/3rdparty/stout/include -isystem /mesos/build/3rdparty/http_parser-2.6.2/src/http_parser-2.6.2 -isystem /mesos/build/3rdparty/libevent-2.1.5-beta/src/libevent-2.1.5-beta-lib/lib/include -I/mesos/3rdparty/libprocess/include    -o CMakeFiles/process-0.0.1.dir/reap.cpp.o -c /mesos/3rdparty/libprocess/src/reap.cpp
/usr/bin/cmake -E cmake_progress_report /mesos/build/CMakeFiles 
[ 29%] Building CXX object 3rdparty/libprocess/src/CMakeFiles/process-0.0.1.dir/socket.cpp.o
cd /mesos/build/3rdparty/libprocess/src && /usr/bin/g++   -DBUILD_FLAGS=\"\" -DBUILD_JAVA_JVM_LIBRARY=\"\" -DHAS_AUTHENTICATION=1 -DLIBDIR=\"/usr/local/libmesos\" -DPICOJSON_USE_INT64 -DPKGDATADIR=\"/usr/local/share/mesos\" -DPKGLIBEXECDIR=\"/usr/local/libexec/mesos\" -DUSE_CMAKE_BUILD_CONFIG -DUSE_SSL_SOCKET=1 -DUSE_STATIC_LIB -DVERSION=\"1.4.0\" -D__STDC_FORMAT_MACROS -Dprocess_0_0_1_EXPORTS -O2 -std=c++11 -g -fPIC -isystem /usr/include/apr-1.0 -isystem /mesos/build/3rdparty/boost-1.53.0/src/boost-1.53.0 -isystem /mesos/build/3rdparty/elfio-3.2/src/elfio-3.2 -isystem /mesos/build/3rdparty/glog-0.3.3/src/glog-0.3.3-lib/lib/include -isystem /mesos/build/3rdparty/nvml-352.79/src/nvml-352.79 -isystem /mesos/build/3rdparty/picojson-1.3.0/src/picojson-1.3.0 -isystem /mesos/build/3rdparty/protobuf-2.6.1/src/protobuf-2.6.1-lib/lib/include -isystem /usr/include/subversion-1 -isystem /mesos/3rdparty/stout/include -isystem /mesos/build/3rdparty/http_parser-2.6.2/src/http_parser-2.6.2 -isystem /mesos/build/3rdparty/libevent-2.1.5-beta/src/libevent-2.1.5-beta-lib/lib/include -I/mesos/3rdparty/libprocess/include    -o CMakeFiles/process-0.0.1.dir/socket.cpp.o -c /mesos/3rdparty/libprocess/src/socket.cpp
/usr/bin/cmake -E cmake_progress_report /mesos/build/CMakeFiles 56
[ 30%] Building CXX object src/CMakeFiles/mesos-protobufs.dir/__/include/mesos/v1/maintenance/maintenance.pb.cc.o
cd /mesos/build/src && /usr/bin/g++   -DBUILD_FLAGS=\"\" -DBUILD_JAVA_JVM_LIBRARY=\"\" -DHAS_AUTHENTICATION=1 -DLIBDIR=\"/usr/local/libmesos\" -DPICOJSON_USE_INT64 -DPKGDATADIR=\"/usr/local/share/mesos\" -DPKGLIBEXECDIR=\"/usr/local/libexec/mesos\" -DUSE_CMAKE_BUILD_CONFIG -DUSE_SSL_SOCKET=1 -DUSE_STATIC_LIB -DVERSION=\"1.4.0\" -D__STDC_FORMAT_MACROS -Dmesos_protobufs_EXPORTS -O2 -std=c++11 -g -fPIC -I/mesos/build/include -I/mesos/build/include/mesos -I/mesos/build/src -I/mesos/src -isystem /mesos/build/3rdparty/protobuf-2.6.1/src/protobuf-2.6.1-lib/lib/include -isystem /mesos/3rdparty/libprocess/include -isystem /usr/include/apr-1.0 -isystem /mesos/build/3rdparty/boost-1.53.0/src/boost-1.53.0 -isystem /mesos/build/3rdparty/elfio-3.2/src/elfio-3.2 -isystem /mesos/build/3rdparty/glog-0.3.3/src/glog-0.3.3-lib/lib/include -isystem /mesos/build/3rdparty/nvml-352.79/src/nvml-352.79 -isystem /mesos/build/3rdparty/picojson-1.3.0/src/picojson-1.3.0 -isystem /usr/include/subversion-1 -isystem /mesos/3rdparty/stout/include -isystem /mesos/build/3rdparty/http_parser-2.6.2/src/http_parser-2.6.2 -isystem /mesos/build/3rdparty/libevent-2.1.5-beta/src/libevent-2.1.5-beta-lib/lib/include -isystem /mesos/build/3rdparty/zookeeper-3.4.8/src/zookeeper-3.4.8/src/c/include -isystem /mesos/build/3rdparty/zookeeper-3.4.8/src/zookeeper-3.4.8/src/c/generated -isystem /mesos/build/3rdparty/leveldb-1.19/src/leveldb-1.19/include -I/mesos/include    -o CMakeFiles/mesos-protobufs.dir/__/include/mesos/v1/maintenance/maintenance.pb.cc.o -c /mesos/build/include/mesos/v1/maintenance/maintenance.pb.cc
/usr/bin/cmake -E cmake_progress_report /mesos/build/CMakeFiles 
[ 30%] Building CXX object 3rdparty/stout/tests/CMakeFiles/stout-tests.dir/mac_tests.cpp.o
cd /mesos/build/3rdparty/stout/tests && /usr/bin/g++   -DBUILD_FLAGS=\"\" -DBUILD_JAVA_JVM_LIBRARY=\"\" -DHAS_AUTHENTICATION=1 -DLIBDIR=\"/usr/local/libmesos\" -DPICOJSON_USE_INT64 -DPKGDATADIR=\"/usr/local/share/mesos\" -DPKGLIBEXECDIR=\"/usr/local/libexec/mesos\" -DUSE_CMAKE_BUILD_CONFIG -DUSE_SSL_SOCKET=1 -DUSE_STATIC_LIB -DVERSION=\"1.4.0\" -D__STDC_FORMAT_MACROS -O2 -std=c++11 -g -fPIE -isystem /usr/include/apr-1.0 -isystem /mesos/build/3rdparty/boost-1.53.0/src/boost-1.53.0 -isystem /mesos/build/3rdparty/elfio-3.2/src/elfio-3.2 -isystem /mesos/build/3rdparty/glog-0.3.3/src/glog-0.3.3-lib/lib/include -isystem /mesos/build/3rdparty/nvml-352.79/src/nvml-352.79 -isystem /mesos/build/3rdparty/picojson-1.3.0/src/picojson-1.3.0 -isystem /mesos/build/3rdparty/protobuf-2.6.1/src/protobuf-2.6.1-lib/lib/include -isystem /usr/include/subversion-1 -isystem /mesos/build/3rdparty/gmock-1.7.0/src/gmock-1.7.0/include -isystem /mesos/build/3rdparty/gmock-1.7.0/src/gmock-1.7.0/gtest/include -I/mesos/3rdparty/stout/include    -o CMakeFiles/stout-tests.dir/mac_tests.cpp.o -c /mesos/3rdparty/stout/tests/mac_tests.cpp
/usr/bin/cmake -E cmake_progress_report /mesos/build/CMakeFiles 
[ 30%] Building CXX object src/CMakeFiles/mesos-protobufs.dir/__/include/mesos/v1/master/master.pb.cc.o
cd /mesos/build/src && /usr/bin/g++   -DBUILD_FLAGS=\"\" -DBUILD_JAVA_JVM_LIBRARY=\"\" -DHAS_AUTHENTICATION=1 -DLIBDIR=\"/usr/local/libmesos\" -DPICOJSON_USE_INT64 -DPKGDATADIR=\"/usr/local/share/mesos\" -DPKGLIBEXECDIR=\"/usr/local/libexec/mesos\" -DUSE_CMAKE_BUILD_CONFIG -DUSE_SSL_SOCKET=1 -DUSE_STATIC_LIB -DVERSION=\"1.4.0\" -D__STDC_FORMAT_MACROS -Dmesos_protobufs_EXPORTS -O2 -std=c++11 -g -fPIC -I/mesos/build/include -I/mesos/build/include/mesos -I/mesos/build/src -I/mesos/src -isystem /mesos/build/3rdparty/protobuf-2.6.1/src/protobuf-2.6.1-lib/lib/include -isystem /mesos/3rdparty/libprocess/include -isystem /usr/include/apr-1.0 -isystem /mesos/build/3rdparty/boost-1.53.0/src/boost-1.53.0 -isystem /mesos/build/3rdparty/elfio-3.2/src/elfio-3.2 -isystem /mesos/build/3rdparty/glog-0.3.3/src/glog-0.3.3-lib/lib/include -isystem /mesos/build/3rdparty/nvml-352.79/src/nvml-352.79 -isystem /mesos/build/3rdparty/picojson-1.3.0/src/picojson-1.3.0 -isystem /usr/include/subversion-1 -isystem /mesos/3rdparty/stout/include -isystem /mesos/build/3rdparty/http_parser-2.6.2/src/http_parser-2.6.2 -isystem /mesos/build/3rdparty/libevent-2.1.5-beta/src/libevent-2.1.5-beta-lib/lib/include -isystem /mesos/build/3rdparty/zookeeper-3.4.8/src/zookeeper-3.4.8/src/c/include -isystem /mesos/build/3rdparty/zookeeper-3.4.8/src/zookeeper-3.4.8/src/c/generated -isystem /mesos/build/3rdparty/leveldb-1.19/src/leveldb-1.19/include -I/mesos/include    -o CMakeFiles/mesos-protobufs.dir/__/include/mesos/v1/master/master.pb.cc.o -c /mesos/build/include/mesos/v1/master/master.pb.cc
/usr/bin/cmake -E cmake_progress_report /mesos/build/CMakeFiles 
[ 30%] Building CXX object src/CMakeFiles/mesos-protobufs.dir/__/include/mesos/v1/mesos.pb.cc.o
cd /mesos/build/src && /usr/bin/g++   -DBUILD_FLAGS=\"\" -DBUILD_JAVA_JVM_LIBRARY=\"\" -DHAS_AUTHENTICATION=1 -DLIBDIR=\"/usr/local/libmesos\" -DPICOJSON_USE_INT64 -DPKGDATADIR=\"/usr/local/share/mesos\" -DPKGLIBEXECDIR=\"/usr/local/libexec/mesos\" -DUSE_CMAKE_BUILD_CONFIG -DUSE_SSL_SOCKET=1 -DUSE_STATIC_LIB -DVERSION=\"1.4.0\" -D__STDC_FORMAT_MACROS -Dmesos_protobufs_EXPORTS -O2 -std=c++11 -g -fPIC -I/mesos/build/include -I/mesos/build/include/mesos -I/mesos/build/src -I/mesos/src -isystem /mesos/build/3rdparty/protobuf-2.6.1/src/protobuf-2.6.1-lib/lib/include -isystem /mesos/3rdparty/libprocess/include -isystem /usr/include/apr-1.0 -isystem /mesos/build/3rdparty/boost-1.53.0/src/boost-1.53.0 -isystem /mesos/build/3rdparty/elfio-3.2/src/elfio-3.2 -isystem /mesos/build/3rdparty/glog-0.3.3/src/glog-0.3.3-lib/lib/include -isystem /mesos/build/3rdparty/nvml-352.79/src/nvml-352.79 -isystem /mesos/build/3rdparty/picojson-1.3.0/src/picojson-1.3.0 -isystem /usr/include/subversion-1 -isystem /mesos/3rdparty/stout/include -isystem /mesos/build/3rdparty/http_parser-2.6.2/src/http_parser-2.6.2 -isystem /mesos/build/3rdparty/libevent-2.1.5-beta/src/libevent-2.1.5-beta-lib/lib/include -isystem /mesos/build/3rdparty/zookeeper-3.4.8/src/zookeeper-3.4.8/src/c/include -isystem /mesos/build/3rdparty/zookeeper-3.4.8/src/zookeeper-3.4.8/src/c/generated -isystem /mesos/build/3rdparty/leveldb-1.19/src/leveldb-1.19/include -I/mesos/include    -o CMakeFiles/mesos-protobufs.dir/__/include/mesos/v1/mesos.pb.cc.o -c /mesos/build/include/mesos/v1/mesos.pb.cc
/usr/bin/cmake -E cmake_progress_report /mesos/build/CMakeFiles 
[ 30%] Building CXX object src/CMakeFiles/mesos-protobufs.dir/__/include/mesos/v1/quota/quota.pb.cc.o
cd /mesos/build/src && /usr/bin/g++   -DBUILD_FLAGS=\"\" -DBUILD_JAVA_JVM_LIBRARY=\"\" -DHAS_AUTHENTICATION=1 -DLIBDIR=\"/usr/local/libmesos\" -DPICOJSON_USE_INT64 -DPKGDATADIR=\"/usr/local/share/mesos\" -DPKGLIBEXECDIR=\"/usr/local/libexec/mesos\" -DUSE_CMAKE_BUILD_CONFIG -DUSE_SSL_SOCKET=1 -DUSE_STATIC_LIB -DVERSION=\"1.4.0\" -D__STDC_FORMAT_MACROS -Dmesos_protobufs_EXPORTS -O2 -std=c++11 -g -fPIC -I/mesos/build/include -I/mesos/build/include/mesos -I/mesos/build/src -I/mesos/src -isystem /mesos/build/3rdparty/protobuf-2.6.1/src/protobuf-2.6.1-lib/lib/include -isystem /mesos/3rdparty/libprocess/include -isystem /usr/include/apr-1.0 -isystem /mesos/build/3rdparty/boost-1.53.0/src/boost-1.53.0 -isystem /mesos/build/3rdparty/elfio-3.2/src/elfio-3.2 -isystem /mesos/build/3rdparty/glog-0.3.3/src/glog-0.3.3-lib/lib/include -isystem /mesos/build/3rdparty/nvml-352.79/src/nvml-352.79 -isystem /mesos/build/3rdparty/picojson-1.3.0/src/picojson-1.3.0 -isystem /usr/include/subversion-1 -isystem /mesos/3rdparty/stout/include -isystem /mesos/build/3rdparty/http_parser-2.6.2/src/http_parser-2.6.2 -isystem /mesos/build/3rdparty/libevent-2.1.5-beta/src/libevent-2.1.5-beta-lib/lib/include -isystem /mesos/build/3rdparty/zookeeper-3.4.8/src/zookeeper-3.4.8/src/c/include -isystem /mesos/build/3rdparty/zookeeper-3.4.8/src/zookeeper-3.4.8/src/c/generated -isystem /mesos/build/3rdparty/leveldb-1.19/src/leveldb-1.19/include -I/mesos/include    -o CMakeFiles/mesos-protobufs.dir/__/include/mesos/v1/quota/quota.pb.cc.o -c /mesos/build/include/mesos/v1/quota/quota.pb.cc
/usr/bin/cmake -E cmake_progress_report /mesos/build/CMakeFiles 
[ 30%] Building CXX object 3rdparty/stout/tests/CMakeFiles/stout-tests.dir/main.cpp.o
cd /mesos/build/3rdparty/stout/tests && /usr/bin/g++   -DBUILD_FLAGS=\"\" -DBUILD_JAVA_JVM_LIBRARY=\"\" -DHAS_AUTHENTICATION=1 -DLIBDIR=\"/usr/local/libmesos\" -DPICOJSON_USE_INT64 -DPKGDATADIR=\"/usr/local/share/mesos\" -DPKGLIBEXECDIR=\"/usr/local/libexec/mesos\" -DUSE_CMAKE_BUILD_CONFIG -DUSE_SSL_SOCKET=1 -DUSE_STATIC_LIB -DVERSION=\"1.4.0\" -D__STDC_FORMAT_MACROS -O2 -std=c++11 -g -fPIE -isystem /usr/include/apr-1.0 -isystem /mesos/build/3rdparty/boost-1.53.0/src/boost-1.53.0 -isystem /mesos/build/3rdparty/elfio-3.2/src/elfio-3.2 -isystem /mesos/build/3rdparty/glog-0.3.3/src/glog-0.3.3-lib/lib/include -isystem /mesos/build/3rdparty/nvml-352.79/src/nvml-352.79 -isystem /mesos/build/3rdparty/picojson-1.3.0/src/picojson-1.3.0 -isystem /mesos/build/3rdparty/protobuf-2.6.1/src/protobuf-2.6.1-lib/lib/include -isystem /usr/include/subversion-1 -isystem /mesos/build/3rdparty/gmock-1.7.0/src/gmock-1.7.0/include -isystem /mesos/build/3rdparty/gmock-1.7.0/src/gmock-1.7.0/gtest/include -I/mesos/3rdparty/stout/include    -o CMakeFiles/stout-tests.dir/main.cpp.o -c /mesos/3rdparty/stout/tests/main.cpp
/usr/bin/cmake -E cmake_progress_report /mesos/build/CMakeFiles 
[ 30%] Building CXX object 3rdparty/stout/tests/CMakeFiles/stout-tests.dir/multimap_tests.cpp.o
cd /mesos/build/3rdparty/stout/tests && /usr/bin/g++   -DBUILD_FLAGS=\"\" -DBUILD_JAVA_JVM_LIBRARY=\"\" -DHAS_AUTHENTICATION=1 -DLIBDIR=\"/usr/local/libmesos\" -DPICOJSON_USE_INT64 -DPKGDATADIR=\"/usr/local/share/mesos\" -DPKGLIBEXECDIR=\"/usr/local/libexec/mesos\" -DUSE_CMAKE_BUILD_CONFIG -DUSE_SSL_SOCKET=1 -DUSE_STATIC_LIB -DVERSION=\"1.4.0\" -D__STDC_FORMAT_MACROS -O2 -std=c++11 -g -fPIE -isystem /usr/include/apr-1.0 -isystem /mesos/build/3rdparty/boost-1.53.0/src/boost-1.53.0 -isystem /mesos/build/3rdparty/elfio-3.2/src/elfio-3.2 -isystem /mesos/build/3rdparty/glog-0.3.3/src/glog-0.3.3-lib/lib/include -isystem /mesos/build/3rdparty/nvml-352.79/src/nvml-352.79 -isystem /mesos/build/3rdparty/picojson-1.3.0/src/picojson-1.3.0 -isystem /mesos/build/3rdparty/protobuf-2.6.1/src/protobuf-2.6.1-lib/lib/include -isystem /usr/include/subversion-1 -isystem /mesos/build/3rdparty/gmock-1.7.0/src/gmock-1.7.0/include -isystem /mesos/build/3rdparty/gmock-1.7.0/src/gmock-1.7.0/gtest/include -I/mesos/3rdparty/stout/include    -o CMakeFiles/stout-tests.dir/multimap_tests.cpp.o -c /mesos/3rdparty/stout/tests/multimap_tests.cpp
/usr/bin/cmake -E cmake_progress_report /mesos/build/CMakeFiles 
[ 30%] Building CXX object 3rdparty/libprocess/src/CMakeFiles/process-0.0.1.dir/subprocess.cpp.o
cd /mesos/build/3rdparty/libprocess/src && /usr/bin/g++   -DBUILD_FLAGS=\"\" -DBUILD_JAVA_JVM_LIBRARY=\"\" -DHAS_AUTHENTICATION=1 -DLIBDIR=\"/usr/local/libmesos\" -DPICOJSON_USE_INT64 -DPKGDATADIR=\"/usr/local/share/mesos\" -DPKGLIBEXECDIR=\"/usr/local/libexec/mesos\" -DUSE_CMAKE_BUILD_CONFIG -DUSE_SSL_SOCKET=1 -DUSE_STATIC_LIB -DVERSION=\"1.4.0\" -D__STDC_FORMAT_MACROS -Dprocess_0_0_1_EXPORTS -O2 -std=c++11 -g -fPIC -isystem /usr/include/apr-1.0 -isystem /mesos/build/3rdparty/boost-1.53.0/src/boost-1.53.0 -isystem /mesos/build/3rdparty/elfio-3.2/src/elfio-3.2 -isystem /mesos/build/3rdparty/glog-0.3.3/src/glog-0.3.3-lib/lib/include -isystem /mesos/build/3rdparty/nvml-352.79/src/nvml-352.79 -isystem /mesos/build/3rdparty/picojson-1.3.0/src/picojson-1.3.0 -isystem /mesos/build/3rdparty/protobuf-2.6.1/src/protobuf-2.6.1-lib/lib/include -isystem /usr/include/subversion-1 -isystem /mesos/3rdparty/stout/include -isystem /mesos/build/3rdparty/http_parser-2.6.2/src/http_parser-2.6.2 -isystem /mesos/build/3rdparty/libevent-2.1.5-beta/src/libevent-2.1.5-beta-lib/lib/include -I/mesos/3rdparty/libprocess/include    -o CMakeFiles/process-0.0.1.dir/subprocess.cpp.o -c /mesos/3rdparty/libprocess/src/subprocess.cpp
/usr/bin/cmake -E cmake_progress_report /mesos/build/CMakeFiles 
[ 30%] Building CXX object 3rdparty/stout/tests/CMakeFiles/stout-tests.dir/none_tests.cpp.o
cd /mesos/build/3rdparty/stout/tests && /usr/bin/g++   -DBUILD_FLAGS=\"\" -DBUILD_JAVA_JVM_LIBRARY=\"\" -DHAS_AUTHENTICATION=1 -DLIBDIR=\"/usr/local/libmesos\" -DPICOJSON_USE_INT64 -DPKGDATADIR=\"/usr/local/share/mesos\" -DPKGLIBEXECDIR=\"/usr/local/libexec/mesos\" -DUSE_CMAKE_BUILD_CONFIG -DUSE_SSL_SOCKET=1 -DUSE_STATIC_LIB -DVERSION=\"1.4.0\" -D__STDC_FORMAT_MACROS -O2 -std=c++11 -g -fPIE -isystem /usr/include/apr-1.0 -isystem /mesos/build/3rdparty/boost-1.53.0/src/boost-1.53.0 -isystem /mesos/build/3rdparty/elfio-3.2/src/elfio-3.2 -isystem /mesos/build/3rdparty/glog-0.3.3/src/glog-0.3.3-lib/lib/include -isystem /mesos/build/3rdparty/nvml-352.79/src/nvml-352.79 -isystem /mesos/build/3rdparty/picojson-1.3.0/src/picojson-1.3.0 -isystem /mesos/build/3rdparty/protobuf-2.6.1/src/protobuf-2.6.1-lib/lib/include -isystem /usr/include/subversion-1 -isystem /mesos/build/3rdparty/gmock-1.7.0/src/gmock-1.7.0/include -isystem /mesos/build/3rdparty/gmock-1.7.0/src/gmock-1.7.0/gtest/include -I/mesos/3rdparty/stout/include    -o CMakeFiles/stout-tests.dir/none_tests.cpp.o -c /mesos/3rdparty/stout/tests/none_tests.cpp
/usr/bin/cmake -E cmake_progress_report /mesos/build/CMakeFiles 
[ 30%] Building CXX object src/CMakeFiles/mesos-protobufs.dir/__/include/mesos/v1/scheduler/scheduler.pb.cc.o
cd /mesos/build/src && /usr/bin/g++   -DBUILD_FLAGS=\"\" -DBUILD_JAVA_JVM_LIBRARY=\"\" -DHAS_AUTHENTICATION=1 -DLIBDIR=\"/usr/local/libmesos\" -DPICOJSON_USE_INT64 -DPKGDATADIR=\"/usr/local/share/mesos\" -DPKGLIBEXECDIR=\"/usr/local/libexec/mesos\" -DUSE_CMAKE_BUILD_CONFIG -DUSE_SSL_SOCKET=1 -DUSE_STATIC_LIB -DVERSION=\"1.4.0\" -D__STDC_FORMAT_MACROS -Dmesos_protobufs_EXPORTS -O2 -std=c++11 -g -fPIC -I/mesos/build/include -I/mesos/build/include/mesos -I/mesos/build/src -I/mesos/src -isystem /mesos/build/3rdparty/protobuf-2.6.1/src/protobuf-2.6.1-lib/lib/include -isystem /mesos/3rdparty/libprocess/include -isystem /usr/include/apr-1.0 -isystem /mesos/build/3rdparty/boost-1.53.0/src/boost-1.53.0 -isystem /mesos/build/3rdparty/elfio-3.2/src/elfio-3.2 -isystem /mesos/build/3rdparty/glog-0.3.3/src/glog-0.3.3-lib/lib/include -isystem /mesos/build/3rdparty/nvml-352.79/src/nvml-352.79 -isystem /mesos/build/3rdparty/picojson-1.3.0/src/picojson-1.3.0 -isystem /usr/include/subversion-1 -isystem /mesos/3rdparty/stout/include -isystem /mesos/build/3rdparty/http_parser-2.6.2/src/http_parser-2.6.2 -isystem /mesos/build/3rdparty/libevent-2.1.5-beta/src/libevent-2.1.5-beta-lib/lib/include -isystem /mesos/build/3rdparty/zookeeper-3.4.8/src/zookeeper-3.4.8/src/c/include -isystem /mesos/build/3rdparty/zookeeper-3.4.8/src/zookeeper-3.4.8/src/c/generated -isystem /mesos/build/3rdparty/leveldb-1.19/src/leveldb-1.19/include -I/mesos/include    -o CMakeFiles/mesos-protobufs.dir/__/include/mesos/v1/scheduler/scheduler.pb.cc.o -c /mesos/build/include/mesos/v1/scheduler/scheduler.pb.cc
/usr/bin/cmake -E cmake_progress_report /mesos/build/CMakeFiles 
[ 30%] Building CXX object 3rdparty/stout/tests/CMakeFiles/stout-tests.dir/numify_tests.cpp.o
cd /mesos/build/3rdparty/stout/tests && /usr/bin/g++   -DBUILD_FLAGS=\"\" -DBUILD_JAVA_JVM_LIBRARY=\"\" -DHAS_AUTHENTICATION=1 -DLIBDIR=\"/usr/local/libmesos\" -DPICOJSON_USE_INT64 -DPKGDATADIR=\"/usr/local/share/mesos\" -DPKGLIBEXECDIR=\"/usr/local/libexec/mesos\" -DUSE_CMAKE_BUILD_CONFIG -DUSE_SSL_SOCKET=1 -DUSE_STATIC_LIB -DVERSION=\"1.4.0\" -D__STDC_FORMAT_MACROS -O2 -std=c++11 -g -fPIE -isystem /usr/include/apr-1.0 -isystem /mesos/build/3rdparty/boost-1.53.0/src/boost-1.53.0 -isystem /mesos/build/3rdparty/elfio-3.2/src/elfio-3.2 -isystem /mesos/build/3rdparty/glog-0.3.3/src/glog-0.3.3-lib/lib/include -isystem /mesos/build/3rdparty/nvml-352.79/src/nvml-352.79 -isystem /mesos/build/3rdparty/picojson-1.3.0/src/picojson-1.3.0 -isystem /mesos/build/3rdparty/protobuf-2.6.1/src/protobuf-2.6.1-lib/lib/include -isystem /usr/include/subversion-1 -isystem /mesos/build/3rdparty/gmock-1.7.0/src/gmock-1.7.0/include -isystem /mesos/build/3rdparty/gmock-1.7.0/src/gmock-1.7.0/gtest/include -I/mesos/3rdparty/stout/include    -o CMakeFiles/stout-tests.dir/numify_tests.cpp.o -c /mesos/3rdparty/stout/tests/numify_tests.cpp
/usr/bin/cmake -E cmake_progress_report /mesos/build/CMakeFiles 
[ 30%] Building CXX object 3rdparty/libprocess/src/CMakeFiles/process-0.0.1.dir/time.cpp.o
cd /mesos/build/3rdparty/libprocess/src && /usr/bin/g++   -DBUILD_FLAGS=\"\" -DBUILD_JAVA_JVM_LIBRARY=\"\" -DHAS_AUTHENTICATION=1 -DLIBDIR=\"/usr/local/libmesos\" -DPICOJSON_USE_INT64 -DPKGDATADIR=\"/usr/local/share/mesos\" -DPKGLIBEXECDIR=\"/usr/local/libexec/mesos\" -DUSE_CMAKE_BUILD_CONFIG -DUSE_SSL_SOCKET=1 -DUSE_STATIC_LIB -DVERSION=\"1.4.0\" -D__STDC_FORMAT_MACROS -Dprocess_0_0_1_EXPORTS -O2 -std=c++11 -g -fPIC -isystem /usr/include/apr-1.0 -isystem /mesos/build/3rdparty/boost-1.53.0/src/boost-1.53.0 -isystem /mesos/build/3rdparty/elfio-3.2/src/elfio-3.2 -isystem /mesos/build/3rdparty/glog-0.3.3/src/glog-0.3.3-lib/lib/include -isystem /mesos/build/3rdparty/nvml-352.79/src/nvml-352.79 -isystem /mesos/build/3rdparty/picojson-1.3.0/src/picojson-1.3.0 -isystem /mesos/build/3rdparty/protobuf-2.6.1/src/protobuf-2.6.1-lib/lib/include -isystem /usr/include/subversion-1 -isystem /mesos/3rdparty/stout/include -isystem /mesos/build/3rdparty/http_parser-2.6.2/src/http_parser-2.6.2 -isystem /mesos/build/3rdparty/libevent-2.1.5-beta/src/libevent-2.1.5-beta-lib/lib/include -I/mesos/3rdparty/libprocess/include    -o CMakeFiles/process-0.0.1.dir/time.cpp.o -c /mesos/3rdparty/libprocess/src/time.cpp
/usr/bin/cmake -E cmake_progress_report /mesos/build/CMakeFiles 
[ 30%] Building CXX object 3rdparty/stout/tests/CMakeFiles/stout-tests.dir/option_tests.cpp.o
cd /mesos/build/3rdparty/stout/tests && /usr/bin/g++   -DBUILD_FLAGS=\"\" -DBUILD_JAVA_JVM_LIBRARY=\"\" -DHAS_AUTHENTICATION=1 -DLIBDIR=\"/usr/local/libmesos\" -DPICOJSON_USE_INT64 -DPKGDATADIR=\"/usr/local/share/mesos\" -DPKGLIBEXECDIR=\"/usr/local/libexec/mesos\" -DUSE_CMAKE_BUILD_CONFIG -DUSE_SSL_SOCKET=1 -DUSE_STATIC_LIB -DVERSION=\"1.4.0\" -D__STDC_FORMAT_MACROS -O2 -std=c++11 -g -fPIE -isystem /usr/include/apr-1.0 -isystem /mesos/build/3rdparty/boost-1.53.0/src/boost-1.53.0 -isystem /mesos/build/3rdparty/elfio-3.2/src/elfio-3.2 -isystem /mesos/build/3rdparty/glog-0.3.3/src/glog-0.3.3-lib/lib/include -isystem /mesos/build/3rdparty/nvml-352.79/src/nvml-352.79 -isystem /mesos/build/3rdparty/picojson-1.3.0/src/picojson-1.3.0 -isystem /mesos/build/3rdparty/protobuf-2.6.1/src/protobuf-2.6.1-lib/lib/include -isystem /usr/include/subversion-1 -isystem /mesos/build/3rdparty/gmock-1.7.0/src/gmock-1.7.0/include -isystem /mesos/build/3rdparty/gmock-1.7.0/src/gmock-1.7.0/gtest/include -I/mesos/3rdparty/stout/include    -o CMakeFiles/stout-tests.dir/option_tests.cpp.o -c /mesos/3rdparty/stout/tests/option_tests.cpp
/usr/bin/cmake -E cmake_progress_report /mesos/build/CMakeFiles 
[ 30%] Building CXX object src/CMakeFiles/mesos-protobufs.dir/messages/flags.pb.cc.o
cd /mesos/build/src && /usr/bin/g++   -DBUILD_FLAGS=\"\" -DBUILD_JAVA_JVM_LIBRARY=\"\" -DHAS_AUTHENTICATION=1 -DLIBDIR=\"/usr/local/libmesos\" -DPICOJSON_USE_INT64 -DPKGDATADIR=\"/usr/local/share/mesos\" -DPKGLIBEXECDIR=\"/usr/local/libexec/mesos\" -DUSE_CMAKE_BUILD_CONFIG -DUSE_SSL_SOCKET=1 -DUSE_STATIC_LIB -DVERSION=\"1.4.0\" -D__STDC_FORMAT_MACROS -Dmesos_protobufs_EXPORTS -O2 -std=c++11 -g -fPIC -I/mesos/build/include -I/mesos/build/include/mesos -I/mesos/build/src -I/mesos/src -isystem /mesos/build/3rdparty/protobuf-2.6.1/src/protobuf-2.6.1-lib/lib/include -isystem /mesos/3rdparty/libprocess/include -isystem /usr/include/apr-1.0 -isystem /mesos/build/3rdparty/boost-1.53.0/src/boost-1.53.0 -isystem /mesos/build/3rdparty/elfio-3.2/src/elfio-3.2 -isystem /mesos/build/3rdparty/glog-0.3.3/src/glog-0.3.3-lib/lib/include -isystem /mesos/build/3rdparty/nvml-352.79/src/nvml-352.79 -isystem /mesos/build/3rdparty/picojson-1.3.0/src/picojson-1.3.0 -isystem /usr/include/subversion-1 -isystem /mesos/3rdparty/stout/include -isystem /mesos/build/3rdparty/http_parser-2.6.2/src/http_parser-2.6.2 -isystem /mesos/build/3rdparty/libevent-2.1.5-beta/src/libevent-2.1.5-beta-lib/lib/include -isystem /mesos/build/3rdparty/zookeeper-3.4.8/src/zookeeper-3.4.8/src/c/include -isystem /mesos/build/3rdparty/zookeeper-3.4.8/src/zookeeper-3.4.8/src/c/generated -isystem /mesos/build/3rdparty/leveldb-1.19/src/leveldb-1.19/include -I/mesos/include    -o CMakeFiles/mesos-protobufs.dir/messages/flags.pb.cc.o -c /mesos/build/src/messages/flags.pb.cc
/usr/bin/cmake -E cmake_progress_report /mesos/build/CMakeFiles 57
[ 31%] Building CXX object src/CMakeFiles/mesos-protobufs.dir/messages/log.pb.cc.o
cd /mesos/build/src && /usr/bin/g++   -DBUILD_FLAGS=\"\" -DBUILD_JAVA_JVM_LIBRARY=\"\" -DHAS_AUTHENTICATION=1 -DLIBDIR=\"/usr/local/libmesos\" -DPICOJSON_USE_INT64 -DPKGDATADIR=\"/usr/local/share/mesos\" -DPKGLIBEXECDIR=\"/usr/local/libexec/mesos\" -DUSE_CMAKE_BUILD_CONFIG -DUSE_SSL_SOCKET=1 -DUSE_STATIC_LIB -DVERSION=\"1.4.0\" -D__STDC_FORMAT_MACROS -Dmesos_protobufs_EXPORTS -O2 -std=c++11 -g -fPIC -I/mesos/build/include -I/mesos/build/include/mesos -I/mesos/build/src -I/mesos/src -isystem /mesos/build/3rdparty/protobuf-2.6.1/src/protobuf-2.6.1-lib/lib/include -isystem /mesos/3rdparty/libprocess/include -isystem /usr/include/apr-1.0 -isystem /mesos/build/3rdparty/boost-1.53.0/src/boost-1.53.0 -isystem /mesos/build/3rdparty/elfio-3.2/src/elfio-3.2 -isystem /mesos/build/3rdparty/glog-0.3.3/src/glog-0.3.3-lib/lib/include -isystem /mesos/build/3rdparty/nvml-352.79/src/nvml-352.79 -isystem /mesos/build/3rdparty/picojson-1.3.0/src/picojson-1.3.0 -isystem /usr/include/subversion-1 -isystem /mesos/3rdparty/stout/include -isystem /mesos/build/3rdparty/http_parser-2.6.2/src/http_parser-2.6.2 -isystem /mesos/build/3rdparty/libevent-2.1.5-beta/src/libevent-2.1.5-beta-lib/lib/include -isystem /mesos/build/3rdparty/zookeeper-3.4.8/src/zookeeper-3.4.8/src/c/include -isystem /mesos/build/3rdparty/zookeeper-3.4.8/src/zookeeper-3.4.8/src/c/generated -isystem /mesos/build/3rdparty/leveldb-1.19/src/leveldb-1.19/include -I/mesos/include    -o CMakeFiles/mesos-protobufs.dir/messages/log.pb.cc.o -c /mesos/build/src/messages/log.pb.cc
/usr/bin/cmake -E cmake_progress_report /mesos/build/CMakeFiles 
[ 31%] Building CXX object src/CMakeFiles/mesos-protobufs.dir/messages/messages.pb.cc.o
cd /mesos/build/src && /usr/bin/g++   -DBUILD_FLAGS=\"\" -DBUILD_JAVA_JVM_LIBRARY=\"\" -DHAS_AUTHENTICATION=1 -DLIBDIR=\"/usr/local/libmesos\" -DPICOJSON_USE_INT64 -DPKGDATADIR=\"/usr/local/share/mesos\" -DPKGLIBEXECDIR=\"/usr/local/libexec/mesos\" -DUSE_CMAKE_BUILD_CONFIG -DUSE_SSL_SOCKET=1 -DUSE_STATIC_LIB -DVERSION=\"1.4.0\" -D__STDC_FORMAT_MACROS -Dmesos_protobufs_EXPORTS -O2 -std=c++11 -g -fPIC -I/mesos/build/include -I/mesos/build/include/mesos -I/mesos/build/src -I/mesos/src -isystem /mesos/build/3rdparty/protobuf-2.6.1/src/protobuf-2.6.1-lib/lib/include -isystem /mesos/3rdparty/libprocess/include -isystem /usr/include/apr-1.0 -isystem /mesos/build/3rdparty/boost-1.53.0/src/boost-1.53.0 -isystem /mesos/build/3rdparty/elfio-3.2/src/elfio-3.2 -isystem /mesos/build/3rdparty/glog-0.3.3/src/glog-0.3.3-lib/lib/include -isystem /mesos/build/3rdparty/nvml-352.79/src/nvml-352.79 -isystem /mesos/build/3rdparty/picojson-1.3.0/src/picojson-1.3.0 -isystem /usr/include/subversion-1 -isystem /mesos/3rdparty/stout/include -isystem /mesos/build/3rdparty/http_parser-2.6.2/src/http_parser-2.6.2 -isystem /mesos/build/3rdparty/libevent-2.1.5-beta/src/libevent-2.1.5-beta-lib/lib/include -isystem /mesos/build/3rdparty/zookeeper-3.4.8/src/zookeeper-3.4.8/src/c/include -isystem /mesos/build/3rdparty/zookeeper-3.4.8/src/zookeeper-3.4.8/src/c/generated -isystem /mesos/build/3rdparty/leveldb-1.19/src/leveldb-1.19/include -I/mesos/include    -o CMakeFiles/mesos-protobufs.dir/messages/messages.pb.cc.o -c /mesos/build/src/messages/messages.pb.cc
In file included from /mesos/build/src/messages/messages.pb.cc:5:0:
/mesos/build/src/messages/messages.pb.h:29:58: fatal error: mesos/resource_provider/resource_provider.pb.h: No such file or directory
 #include "mesos/resource_provider/resource_provider.pb.h"
                                                          ^
compilation terminated.
make[3]: *** [src/CMakeFiles/mesos-protobufs.dir/messages/messages.pb.cc.o] Error 1
make[3]: *** Waiting for unfinished jobs....
/usr/bin/cmake -E cmake_progress_report /mesos/build/CMakeFiles 85
[ 32%] Building CXX object 3rdparty/libprocess/src/CMakeFiles/process-0.0.1.dir/timeseries.cpp.o
cd /mesos/build/3rdparty/libprocess/src && /usr/bin/g++   -DBUILD_FLAGS=\"\" -DBUILD_JAVA_JVM_LIBRARY=\"\" -DHAS_AUTHENTICATION=1 -DLIBDIR=\"/usr/local/libmesos\" -DPICOJSON_USE_INT64 -DPKGDATADIR=\"/usr/local/share/mesos\" -DPKGLIBEXECDIR=\"/usr/local/libexec/mesos\" -DUSE_CMAKE_BUILD_CONFIG -DUSE_SSL_SOCKET=1 -DUSE_STATIC_LIB -DVERSION=\"1.4.0\" -D__STDC_FORMAT_MACROS -Dprocess_0_0_1_EXPORTS -O2 -std=c++11 -g -fPIC -isystem /usr/include/apr-1.0 -isystem /mesos/build/3rdparty/boost-1.53.0/src/boost-1.53.0 -isystem /mesos/build/3rdparty/elfio-3.2/src/elfio-3.2 -isystem /mesos/build/3rdparty/glog-0.3.3/src/glog-0.3.3-lib/lib/include -isystem /mesos/build/3rdparty/nvml-352.79/src/nvml-352.79 -isystem /mesos/build/3rdparty/picojson-1.3.0/src/picojson-1.3.0 -isystem /mesos/build/3rdparty/protobuf-2.6.1/src/protobuf-2.6.1-lib/lib/include -isystem /usr/include/subversion-1 -isystem /mesos/3rdparty/stout/include -isystem /mesos/build/3rdparty/http_parser-2.6.2/src/http_parser-2.6.2 -isystem /mesos/build/3rdparty/libevent-2.1.5-beta/src/libevent-2.1.5-beta-lib/lib/include -I/mesos/3rdparty/libprocess/include    -o CMakeFiles/process-0.0.1.dir/timeseries.cpp.o -c /mesos/3rdparty/libprocess/src/timeseries.cpp
/usr/bin/cmake -E cmake_progress_report /mesos/build/CMakeFiles 
[ 32%] Building CXX object 3rdparty/libprocess/src/CMakeFiles/process-0.0.1.dir/libevent.cpp.o
cd /mesos/build/3rdparty/libprocess/src && /usr/bin/g++   -DBUILD_FLAGS=\"\" -DBUILD_JAVA_JVM_LIBRARY=\"\" -DHAS_AUTHENTICATION=1 -DLIBDIR=\"/usr/local/libmesos\" -DPICOJSON_USE_INT64 -DPKGDATADIR=\"/usr/local/share/mesos\" -DPKGLIBEXECDIR=\"/usr/local/libexec/mesos\" -DUSE_CMAKE_BUILD_CONFIG -DUSE_SSL_SOCKET=1 -DUSE_STATIC_LIB -DVERSION=\"1.4.0\" -D__STDC_FORMAT_MACROS -Dprocess_0_0_1_EXPORTS -O2 -std=c++11 -g -fPIC -isystem /usr/include/apr-1.0 -isystem /mesos/build/3rdparty/boost-1.53.0/src/boost-1.53.0 -isystem /mesos/build/3rdparty/elfio-3.2/src/elfio-3.2 -isystem /mesos/build/3rdparty/glog-0.3.3/src/glog-0.3.3-lib/lib/include -isystem /mesos/build/3rdparty/nvml-352.79/src/nvml-352.79 -isystem /mesos/build/3rdparty/picojson-1.3.0/src/picojson-1.3.0 -isystem /mesos/build/3rdparty/protobuf-2.6.1/src/protobuf-2.6.1-lib/lib/include -isystem /usr/include/subversion-1 -isystem /mesos/3rdparty/stout/include -isystem /mesos/build/3rdparty/http_parser-2.6.2/src/http_parser-2.6.2 -isystem /mesos/build/3rdparty/libevent-2.1.5-beta/src/libevent-2.1.5-beta-lib/lib/include -I/mesos/3rdparty/libprocess/include    -o CMakeFiles/process-0.0.1.dir/libevent.cpp.o -c /mesos/3rdparty/libprocess/src/libevent.cpp
/usr/bin/cmake -E cmake_progress_report /mesos/build/CMakeFiles 91
[ 33%] Building CXX object 3rdparty/stout/tests/CMakeFiles/stout-tests.dir/os_tests.cpp.o
cd /mesos/build/3rdparty/stout/tests && /usr/bin/g++   -DBUILD_FLAGS=\"\" -DBUILD_JAVA_JVM_LIBRARY=\"\" -DHAS_AUTHENTICATION=1 -DLIBDIR=\"/usr/local/libmesos\" -DPICOJSON_USE_INT64 -DPKGDATADIR=\"/usr/local/share/mesos\" -DPKGLIBEXECDIR=\"/usr/local/libexec/mesos\" -DUSE_CMAKE_BUILD_CONFIG -DUSE_SSL_SOCKET=1 -DUSE_STATIC_LIB -DVERSION=\"1.4.0\" -D__STDC_FORMAT_MACROS -O2 -std=c++11 -g -fPIE -isystem /usr/include/apr-1.0 -isystem /mesos/build/3rdparty/boost-1.53.0/src/boost-1.53.0 -isystem /mesos/build/3rdparty/elfio-3.2/src/elfio-3.2 -isystem /mesos/build/3rdparty/glog-0.3.3/src/glog-0.3.3-lib/lib/include -isystem /mesos/build/3rdparty/nvml-352.79/src/nvml-352.79 -isystem /mesos/build/3rdparty/picojson-1.3.0/src/picojson-1.3.0 -isystem /mesos/build/3rdparty/protobuf-2.6.1/src/protobuf-2.6.1-lib/lib/include -isystem /usr/include/subversion-1 -isystem /mesos/build/3rdparty/gmock-1.7.0/src/gmock-1.7.0/include -isystem /mesos/build/3rdparty/gmock-1.7.0/src/gmock-1.7.0/gtest/include -I/mesos/3rdparty/stout/include    -o CMakeFiles/stout-tests.dir/os_tests.cpp.o -c /mesos/3rdparty/stout/tests/os_tests.cpp
/usr/bin/cmake -E cmake_progress_report /mesos/build/CMakeFiles 
[ 33%] Building CXX object 3rdparty/stout/tests/CMakeFiles/stout-tests.dir/recordio_tests.cpp.o
cd /mesos/build/3rdparty/stout/tests && /usr/bin/g++   -DBUILD_FLAGS=\"\" -DBUILD_JAVA_JVM_LIBRARY=\"\" -DHAS_AUTHENTICATION=1 -DLIBDIR=\"/usr/local/libmesos\" -DPICOJSON_USE_INT64 -DPKGDATADIR=\"/usr/local/share/mesos\" -DPKGLIBEXECDIR=\"/usr/local/libexec/mesos\" -DUSE_CMAKE_BUILD_CONFIG -DUSE_SSL_SOCKET=1 -DUSE_STATIC_LIB -DVERSION=\"1.4.0\" -D__STDC_FORMAT_MACROS -O2 -std=c++11 -g -fPIE -isystem /usr/include/apr-1.0 -isystem /mesos/build/3rdparty/boost-1.53.0/src/boost-1.53.0 -isystem /mesos/build/3rdparty/elfio-3.2/src/elfio-3.2 -isystem /mesos/build/3rdparty/glog-0.3.3/src/glog-0.3.3-lib/lib/include -isystem /mesos/build/3rdparty/nvml-352.79/src/nvml-352.79 -isystem /mesos/build/3rdparty/picojson-1.3.0/src/picojson-1.3.0 -isystem /mesos/build/3rdparty/protobuf-2.6.1/src/protobuf-2.6.1-lib/lib/include -isystem /usr/include/subversion-1 -isystem /mesos/build/3rdparty/gmock-1.7.0/src/gmock-1.7.0/include -isystem /mesos/build/3rdparty/gmock-1.7.0/src/gmock-1.7.0/gtest/include -I/mesos/3rdparty/stout/include    -o CMakeFiles/stout-tests.dir/recordio_tests.cpp.o -c /mesos/3rdparty/stout/tests/recordio_tests.cpp
/usr/bin/cmake -E cmake_progress_report /mesos/build/CMakeFiles 
[ 33%] Building CXX object 3rdparty/stout/tests/CMakeFiles/stout-tests.dir/result_tests.cpp.o
cd /mesos/build/3rdparty/stout/tests && /usr/bin/g++   -DBUILD_FLAGS=\"\" -DBUILD_JAVA_JVM_LIBRARY=\"\" -DHAS_AUTHENTICATION=1 -DLIBDIR=\"/usr/local/libmesos\" -DPICOJSON_USE_INT64 -DPKGDATADIR=\"/usr/local/share/mesos\" -DPKGLIBEXECDIR=\"/usr/local/libexec/mesos\" -DUSE_CMAKE_BUILD_CONFIG -DUSE_SSL_SOCKET=1 -DUSE_STATIC_LIB -DVERSION=\"1.4.0\" -D__STDC_FORMAT_MACROS -O2 -std=c++11 -g -fPIE -isystem /usr/include/apr-1.0 -isystem /mesos/build/3rdparty/boost-1.53.0/src/boost-1.53.0 -isystem /mesos/build/3rdparty/elfio-3.2/src/elfio-3.2 -isystem /mesos/build/3rdparty/glog-0.3.3/src/glog-0.3.3-lib/lib/include -isystem /mesos/build/3rdparty/nvml-352.79/src/nvml-352.79 -isystem /mesos/build/3rdparty/picojson-1.3.0/src/picojson-1.3.0 -isystem /mesos/build/3rdparty/protobuf-2.6.1/src/protobuf-2.6.1-lib/lib/include -isystem /usr/include/subversion-1 -isystem /mesos/build/3rdparty/gmock-1.7.0/src/gmock-1.7.0/include -isystem /mesos/build/3rdparty/gmock-1.7.0/src/gmock-1.7.0/gtest/include -I/mesos/3rdparty/stout/include    -o CMakeFiles/stout-tests.dir/result_tests.cpp.o -c /mesos/3rdparty/stout/tests/result_tests.cpp
/usr/bin/cmake -E cmake_progress_report /mesos/build/CMakeFiles 
[ 33%] Building CXX object 3rdparty/libprocess/src/CMakeFiles/process-0.0.1.dir/libevent_poll.cpp.o
cd /mesos/build/3rdparty/libprocess/src && /usr/bin/g++   -DBUILD_FLAGS=\"\" -DBUILD_JAVA_JVM_LIBRARY=\"\" -DHAS_AUTHENTICATION=1 -DLIBDIR=\"/usr/local/libmesos\" -DPICOJSON_USE_INT64 -DPKGDATADIR=\"/usr/local/share/mesos\" -DPKGLIBEXECDIR=\"/usr/local/libexec/mesos\" -DUSE_CMAKE_BUILD_CONFIG -DUSE_SSL_SOCKET=1 -DUSE_STATIC_LIB -DVERSION=\"1.4.0\" -D__STDC_FORMAT_MACROS -Dprocess_0_0_1_EXPORTS -O2 -std=c++11 -g -fPIC -isystem /usr/include/apr-1.0 -isystem /mesos/build/3rdparty/boost-1.53.0/src/boost-1.53.0 -isystem /mesos/build/3rdparty/elfio-3.2/src/elfio-3.2 -isystem /mesos/build/3rdparty/glog-0.3.3/src/glog-0.3.3-lib/lib/include -isystem /mesos/build/3rdparty/nvml-352.79/src/nvml-352.79 -isystem /mesos/build/3rdparty/picojson-1.3.0/src/picojson-1.3.0 -isystem /mesos/build/3rdparty/protobuf-2.6.1/src/protobuf-2.6.1-lib/lib/include -isystem /usr/include/subversion-1 -isystem /mesos/3rdparty/stout/include -isystem /mesos/build/3rdparty/http_parser-2.6.2/src/http_parser-2.6.2 -isystem /mesos/build/3rdparty/libevent-2.1.5-beta/src/libevent-2.1.5-beta-lib/lib/include -I/mesos/3rdparty/libprocess/include    -o CMakeFiles/process-0.0.1.dir/libevent_poll.cpp.o -c /mesos/3rdparty/libprocess/src/libevent_poll.cpp
/usr/bin/cmake -E cmake_progress_report /mesos/build/CMakeFiles 
[ 33%] Building CXX object 3rdparty/stout/tests/CMakeFiles/stout-tests.dir/some_tests.cpp.o
cd /mesos/build/3rdparty/stout/tests && /usr/bin/g++   -DBUILD_FLAGS=\"\" -DBUILD_JAVA_JVM_LIBRARY=\"\" -DHAS_AUTHENTICATION=1 -DLIBDIR=\"/usr/local/libmesos\" -DPICOJSON_USE_INT64 -DPKGDATADIR=\"/usr/local/share/mesos\" -DPKGLIBEXECDIR=\"/usr/local/libexec/mesos\" -DUSE_CMAKE_BUILD_CONFIG -DUSE_SSL_SOCKET=1 -DUSE_STATIC_LIB -DVERSION=\"1.4.0\" -D__STDC_FORMAT_MACROS -O2 -std=c++11 -g -fPIE -isystem /usr/include/apr-1.0 -isystem /mesos/build/3rdparty/boost-1.53.0/src/boost-1.53.0 -isystem /mesos/build/3rdparty/elfio-3.2/src/elfio-3.2 -isystem /mesos/build/3rdparty/glog-0.3.3/src/glog-0.3.3-lib/lib/include -isystem /mesos/build/3rdparty/nvml-352.79/src/nvml-352.79 -isystem /mesos/build/3rdparty/picojson-1.3.0/src/picojson-1.3.0 -isystem /mesos/build/3rdparty/protobuf-2.6.1/src/protobuf-2.6.1-lib/lib/include -isystem /usr/include/subversion-1 -isystem /mesos/build/3rdparty/gmock-1.7.0/src/gmock-1.7.0/include -isystem /mesos/build/3rdparty/gmock-1.7.0/src/gmock-1.7.0/gtest/include -I/mesos/3rdparty/stout/include    -o CMakeFiles/stout-tests.dir/some_tests.cpp.o -c /mesos/3rdparty/stout/tests/some_tests.cpp
/usr/bin/cmake -E cmake_progress_report /mesos/build/CMakeFiles 
[ 33%] Building CXX object 3rdparty/libprocess/src/CMakeFiles/process-0.0.1.dir/jwt.cpp.o
cd /mesos/build/3rdparty/libprocess/src && /usr/bin/g++   -DBUILD_FLAGS=\"\" -DBUILD_JAVA_JVM_LIBRARY=\"\" -DHAS_AUTHENTICATION=1 -DLIBDIR=\"/usr/local/libmesos\" -DPICOJSON_USE_INT64 -DPKGDATADIR=\"/usr/local/share/mesos\" -DPKGLIBEXECDIR=\"/usr/local/libexec/mesos\" -DUSE_CMAKE_BUILD_CONFIG -DUSE_SSL_SOCKET=1 -DUSE_STATIC_LIB -DVERSION=\"1.4.0\" -D__STDC_FORMAT_MACROS -Dprocess_0_0_1_EXPORTS -O2 -std=c++11 -g -fPIC -isystem /usr/include/apr-1.0 -isystem /mesos/build/3rdparty/boost-1.53.0/src/boost-1.53.0 -isystem /mesos/build/3rdparty/elfio-3.2/src/elfio-3.2 -isystem /mesos/build/3rdparty/glog-0.3.3/src/glog-0.3.3-lib/lib/include -isystem /mesos/build/3rdparty/nvml-352.79/src/nvml-352.79 -isystem /mesos/build/3rdparty/picojson-1.3.0/src/picojson-1.3.0 -isystem /mesos/build/3rdparty/protobuf-2.6.1/src/protobuf-2.6.1-lib/lib/include -isystem /usr/include/subversion-1 -isystem /mesos/3rdparty/stout/include -isystem /mesos/build/3rdparty/http_parser-2.6.2/src/http_parser-2.6.2 -isystem /mesos/build/3rdparty/libevent-2.1.5-beta/src/libevent-2.1.5-beta-lib/lib/include -I/mesos/3rdparty/libprocess/include    -o CMakeFiles/process-0.0.1.dir/jwt.cpp.o -c /mesos/3rdparty/libprocess/src/jwt.cpp
/usr/bin/cmake -E cmake_progress_report /mesos/build/CMakeFiles 
[ 33%] Building CXX object 3rdparty/stout/tests/CMakeFiles/stout-tests.dir/strings_tests.cpp.o
cd /mesos/build/3rdparty/stout/tests && /usr/bin/g++   -DBUILD_FLAGS=\"\" -DBUILD_JAVA_JVM_LIBRARY=\"\" -DHAS_AUTHENTICATION=1 -DLIBDIR=\"/usr/local/libmesos\" -DPICOJSON_USE_INT64 -DPKGDATADIR=\"/usr/local/share/mesos\" -DPKGLIBEXECDIR=\"/usr/local/libexec/mesos\" -DUSE_CMAKE_BUILD_CONFIG -DUSE_SSL_SOCKET=1 -DUSE_STATIC_LIB -DVERSION=\"1.4.0\" -D__STDC_FORMAT_MACROS -O2 -std=c++11 -g -fPIE -isystem /usr/include/apr-1.0 -isystem /mesos/build/3rdparty/boost-1.53.0/src/boost-1.53.0 -isystem /mesos/build/3rdparty/elfio-3.2/src/elfio-3.2 -isystem /mesos/build/3rdparty/glog-0.3.3/src/glog-0.3.3-lib/lib/include -isystem /mesos/build/3rdparty/nvml-352.79/src/nvml-352.79 -isystem /mesos/build/3rdparty/picojson-1.3.0/src/picojson-1.3.0 -isystem /mesos/build/3rdparty/protobuf-2.6.1/src/protobuf-2.6.1-lib/lib/include -isystem /usr/include/subversion-1 -isystem /mesos/build/3rdparty/gmock-1.7.0/src/gmock-1.7.0/include -isystem /mesos/build/3rdparty/gmock-1.7.0/src/gmock-1.7.0/gtest/include -I/mesos/3rdparty/stout/include    -o CMakeFiles/stout-tests.dir/strings_tests.cpp.o -c /mesos/3rdparty/stout/tests/strings_tests.cpp
/usr/bin/cmake -E cmake_progress_report /mesos/build/CMakeFiles 
[ 33%] Building CXX object 3rdparty/stout/tests/CMakeFiles/stout-tests.dir/subcommand_tests.cpp.o
cd /mesos/build/3rdparty/stout/tests && /usr/bin/g++   -DBUILD_FLAGS=\"\" -DBUILD_JAVA_JVM_LIBRARY=\"\" -DHAS_AUTHENTICATION=1 -DLIBDIR=\"/usr/local/libmesos\" -DPICOJSON_USE_INT64 -DPKGDATADIR=\"/usr/local/share/mesos\" -DPKGLIBEXECDIR=\"/usr/local/libexec/mesos\" -DUSE_CMAKE_BUILD_CONFIG -DUSE_SSL_SOCKET=1 -DUSE_STATIC_LIB -DVERSION=\"1.4.0\" -D__STDC_FORMAT_MACROS -O2 -std=c++11 -g -fPIE -isystem /usr/include/apr-1.0 -isystem /mesos/build/3rdparty/boost-1.53.0/src/boost-1.53.0 -isystem /mesos/build/3rdparty/elfio-3.2/src/elfio-3.2 -isystem /mesos/build/3rdparty/glog-0.3.3/src/glog-0.3.3-lib/lib/include -isystem /mesos/build/3rdparty/nvml-352.79/src/nvml-352.79 -isystem /mesos/build/3rdparty/picojson-1.3.0/src/picojson-1.3.0 -isystem /mesos/build/3rdparty/protobuf-2.6.1/src/protobuf-2.6.1-lib/lib/include -isystem /usr/include/subversion-1 -isystem /mesos/build/3rdparty/gmock-1.7.0/src/gmock-1.7.0/include -isystem /mesos/build/3rdparty/gmock-1.7.0/src/gmock-1.7.0/gtest/include -I/mesos/3rdparty/stout/include    -o CMakeFiles/stout-tests.dir/subcommand_tests.cpp.o -c /mesos/3rdparty/stout/tests/subcommand_tests.cpp
/usr/bin/cmake -E cmake_progress_report /mesos/build/CMakeFiles 92
[ 34%] Building CXX object 3rdparty/stout/tests/CMakeFiles/stout-tests.dir/try_tests.cpp.o
cd /mesos/build/3rdparty/stout/tests && /usr/bin/g++   -DBUILD_FLAGS=\"\" -DBUILD_JAVA_JVM_LIBRARY=\"\" -DHAS_AUTHENTICATION=1 -DLIBDIR=\"/usr/local/libmesos\" -DPICOJSON_USE_INT64 -DPKGDATADIR=\"/usr/local/share/mesos\" -DPKGLIBEXECDIR=\"/usr/local/libexec/mesos\" -DUSE_CMAKE_BUILD_CONFIG -DUSE_SSL_SOCKET=1 -DUSE_STATIC_LIB -DVERSION=\"1.4.0\" -D__STDC_FORMAT_MACROS -O2 -std=c++11 -g -fPIE -isystem /usr/include/apr-1.0 -isystem /mesos/build/3rdparty/boost-1.53.0/src/boost-1.53.0 -isystem /mesos/build/3rdparty/elfio-3.2/src/elfio-3.2 -isystem /mesos/build/3rdparty/glog-0.3.3/src/glog-0.3.3-lib/lib/include -isystem /mesos/build/3rdparty/nvml-352.79/src/nvml-352.79 -isystem /mesos/build/3rdparty/picojson-1.3.0/src/picojson-1.3.0 -isystem /mesos/build/3rdparty/protobuf-2.6.1/src/protobuf-2.6.1-lib/lib/include -isystem /usr/include/subversion-1 -isystem /mesos/build/3rdparty/gmock-1.7.0/src/gmock-1.7.0/include -isystem /mesos/build/3rdparty/gmock-1.7.0/src/gmock-1.7.0/gtest/include -I/mesos/3rdparty/stout/include    -o CMakeFiles/stout-tests.dir/try_tests.cpp.o -c /mesos/3rdparty/stout/tests/try_tests.cpp
/usr/bin/cmake -E cmake_progress_report /mesos/build/CMakeFiles 
[ 34%] Building CXX object 3rdparty/libprocess/src/CMakeFiles/process-0.0.1.dir/jwt_authenticator.cpp.o
cd /mesos/build/3rdparty/libprocess/src && /usr/bin/g++   -DBUILD_FLAGS=\"\" -DBUILD_JAVA_JVM_LIBRARY=\"\" -DHAS_AUTHENTICATION=1 -DLIBDIR=\"/usr/local/libmesos\" -DPICOJSON_USE_INT64 -DPKGDATADIR=\"/usr/local/share/mesos\" -DPKGLIBEXECDIR=\"/usr/local/libexec/mesos\" -DUSE_CMAKE_BUILD_CONFIG -DUSE_SSL_SOCKET=1 -DUSE_STATIC_LIB -DVERSION=\"1.4.0\" -D__STDC_FORMAT_MACROS -Dprocess_0_0_1_EXPORTS -O2 -std=c++11 -g -fPIC -isystem /usr/include/apr-1.0 -isystem /mesos/build/3rdparty/boost-1.53.0/src/boost-1.53.0 -isystem /mesos/build/3rdparty/elfio-3.2/src/elfio-3.2 -isystem /mesos/build/3rdparty/glog-0.3.3/src/glog-0.3.3-lib/lib/include -isystem /mesos/build/3rdparty/nvml-352.79/src/nvml-352.79 -isystem /mesos/build/3rdparty/picojson-1.3.0/src/picojson-1.3.0 -isystem /mesos/build/3rdparty/protobuf-2.6.1/src/protobuf-2.6.1-lib/lib/include -isystem /usr/include/subversion-1 -isystem /mesos/3rdparty/stout/include -isystem /mesos/build/3rdparty/http_parser-2.6.2/src/http_parser-2.6.2 -isystem /mesos/build/3rdparty/libevent-2.1.5-beta/src/libevent-2.1.5-beta-lib/lib/include -I/mesos/3rdparty/libprocess/include    -o CMakeFiles/process-0.0.1.dir/jwt_authenticator.cpp.o -c /mesos/3rdparty/libprocess/src/jwt_authenticator.cpp
/usr/bin/cmake -E cmake_progress_report /mesos/build/CMakeFiles 
[ 34%] Building CXX object 3rdparty/stout/tests/CMakeFiles/stout-tests.dir/uuid_tests.cpp.o
cd /mesos/build/3rdparty/stout/tests && /usr/bin/g++   -DBUILD_FLAGS=\"\" -DBUILD_JAVA_JVM_LIBRARY=\"\" -DHAS_AUTHENTICATION=1 -DLIBDIR=\"/usr/local/libmesos\" -DPICOJSON_USE_INT64 -DPKGDATADIR=\"/usr/local/share/mesos\" -DPKGLIBEXECDIR=\"/usr/local/libexec/mesos\" -DUSE_CMAKE_BUILD_CONFIG -DUSE_SSL_SOCKET=1 -DUSE_STATIC_LIB -DVERSION=\"1.4.0\" -D__STDC_FORMAT_MACROS -O2 -std=c++11 -g -fPIE -isystem /usr/include/apr-1.0 -isystem /mesos/build/3rdparty/boost-1.53.0/src/boost-1.53.0 -isystem /mesos/build/3rdparty/elfio-3.2/src/elfio-3.2 -isystem /mesos/build/3rdparty/glog-0.3.3/src/glog-0.3.3-lib/lib/include -isystem /mesos/build/3rdparty/nvml-352.79/src/nvml-352.79 -isystem /mesos/build/3rdparty/picojson-1.3.0/src/picojson-1.3.0 -isystem /mesos/build/3rdparty/protobuf-2.6.1/src/protobuf-2.6.1-lib/lib/include -isystem /usr/include/subversion-1 -isystem /mesos/build/3rdparty/gmock-1.7.0/src/gmock-1.7.0/include -isystem /mesos/build/3rdparty/gmock-1.7.0/src/gmock-1.7.0/gtest/include -I/mesos/3rdparty/stout/include    -o CMakeFiles/stout-tests.dir/uuid_tests.cpp.o -c /mesos/3rdparty/stout/tests/uuid_tests.cpp
/usr/bin/cmake -E cmake_progress_report /mesos/build/CMakeFiles 
[ 34%] Building CXX object 3rdparty/libprocess/src/CMakeFiles/process-0.0.1.dir/openssl.cpp.o
cd /mesos/build/3rdparty/libprocess/src && /usr/bin/g++   -DBUILD_FLAGS=\"\" -DBUILD_JAVA_JVM_LIBRARY=\"\" -DHAS_AUTHENTICATION=1 -DLIBDIR=\"/usr/local/libmesos\" -DPICOJSON_USE_INT64 -DPKGDATADIR=\"/usr/local/share/mesos\" -DPKGLIBEXECDIR=\"/usr/local/libexec/mesos\" -DUSE_CMAKE_BUILD_CONFIG -DUSE_SSL_SOCKET=1 -DUSE_STATIC_LIB -DVERSION=\"1.4.0\" -D__STDC_FORMAT_MACROS -Dprocess_0_0_1_EXPORTS -O2 -std=c++11 -g -fPIC -isystem /usr/include/apr-1.0 -isystem /mesos/build/3rdparty/boost-1.53.0/src/boost-1.53.0 -isystem /mesos/build/3rdparty/elfio-3.2/src/elfio-3.2 -isystem /mesos/build/3rdparty/glog-0.3.3/src/glog-0.3.3-lib/lib/include -isystem /mesos/build/3rdparty/nvml-352.79/src/nvml-352.79 -isystem /mesos/build/3rdparty/picojson-1.3.0/src/picojson-1.3.0 -isystem /mesos/build/3rdparty/protobuf-2.6.1/src/protobuf-2.6.1-lib/lib/include -isystem /usr/include/subversion-1 -isystem /mesos/3rdparty/stout/include -isystem /mesos/build/3rdparty/http_parser-2.6.2/src/http_parser-2.6.2 -isystem /mesos/build/3rdparty/libevent-2.1.5-beta/src/libevent-2.1.5-beta-lib/lib/include -I/mesos/3rdparty/libprocess/include    -o CMakeFiles/process-0.0.1.dir/openssl.cpp.o -c /mesos/3rdparty/libprocess/src/openssl.cpp
make[3]: Leaving directory `/mesos/build'
make[2]: *** [src/CMakeFiles/mesos-protobufs.dir/all] Error 2
/usr/bin/cmake -E cmake_progress_report /mesos/build/CMakeFiles 86
make[2]: *** Waiting for unfinished jobs....
[ 35%] Building CXX object 3rdparty/libprocess/src/CMakeFiles/process-0.0.1.dir/ssl/utilities.cpp.o
cd /mesos/build/3rdparty/libprocess/src && /usr/bin/g++   -DBUILD_FLAGS=\"\" -DBUILD_JAVA_JVM_LIBRARY=\"\" -DHAS_AUTHENTICATION=1 -DLIBDIR=\"/usr/local/libmesos\" -DPICOJSON_USE_INT64 -DPKGDATADIR=\"/usr/local/share/mesos\" -DPKGLIBEXECDIR=\"/usr/local/libexec/mesos\" -DUSE_CMAKE_BUILD_CONFIG -DUSE_SSL_SOCKET=1 -DUSE_STATIC_LIB -DVERSION=\"1.4.0\" -D__STDC_FORMAT_MACROS -Dprocess_0_0_1_EXPORTS -O2 -std=c++11 -g -fPIC -isystem /usr/include/apr-1.0 -isystem /mesos/build/3rdparty/boost-1.53.0/src/boost-1.53.0 -isystem /mesos/build/3rdparty/elfio-3.2/src/elfio-3.2 -isystem /mesos/build/3rdparty/glog-0.3.3/src/glog-0.3.3-lib/lib/include -isystem /mesos/build/3rdparty/nvml-352.79/src/nvml-352.79 -isystem /mesos/build/3rdparty/picojson-1.3.0/src/picojson-1.3.0 -isystem /mesos/build/3rdparty/protobuf-2.6.1/src/protobuf-2.6.1-lib/lib/include -isystem /usr/include/subversion-1 -isystem /mesos/3rdparty/stout/include -isystem /mesos/build/3rdparty/http_parser-2.6.2/src/http_parser-2.6.2 -isystem /mesos/build/3rdparty/libevent-2.1.5-beta/src/libevent-2.1.5-beta-lib/lib/include -I/mesos/3rdparty/libprocess/include    -o CMakeFiles/process-0.0.1.dir/ssl/utilities.cpp.o -c /mesos/3rdparty/libprocess/src/ssl/utilities.cpp
/usr/bin/cmake -E cmake_progress_report /mesos/build/CMakeFiles 
[ 35%] Building CXX object 3rdparty/stout/tests/CMakeFiles/stout-tests.dir/version_tests.cpp.o
cd /mesos/build/3rdparty/stout/tests && /usr/bin/g++   -DBUILD_FLAGS=\"\" -DBUILD_JAVA_JVM_LIBRARY=\"\" -DHAS_AUTHENTICATION=1 -DLIBDIR=\"/usr/local/libmesos\" -DPICOJSON_USE_INT64 -DPKGDATADIR=\"/usr/local/share/mesos\" -DPKGLIBEXECDIR=\"/usr/local/libexec/mesos\" -DUSE_CMAKE_BUILD_CONFIG -DUSE_SSL_SOCKET=1 -DUSE_STATIC_LIB -DVERSION=\"1.4.0\" -D__STDC_FORMAT_MACROS -O2 -std=c++11 -g -fPIE -isystem /usr/include/apr-1.0 -isystem /mesos/build/3rdparty/boost-1.53.0/src/boost-1.53.0 -isystem /mesos/build/3rdparty/elfio-3.2/src/elfio-3.2 -isystem /mesos/build/3rdparty/glog-0.3.3/src/glog-0.3.3-lib/lib/include -isystem /mesos/build/3rdparty/nvml-352.79/src/nvml-352.79 -isystem /mesos/build/3rdparty/picojson-1.3.0/src/picojson-1.3.0 -isystem /mesos/build/3rdparty/protobuf-2.6.1/src/protobuf-2.6.1-lib/lib/include -isystem /usr/include/subversion-1 -isystem /mesos/build/3rdparty/gmock-1.7.0/src/gmock-1.7.0/include -isystem /mesos/build/3rdparty/gmock-1.7.0/src/gmock-1.7.0/gtest/include -I/mesos/3rdparty/stout/include    -o CMakeFiles/stout-tests.dir/version_tests.cpp.o -c /mesos/3rdparty/stout/tests/version_tests.cpp
/usr/bin/cmake -E cmake_progress_report /mesos/build/CMakeFiles 
[ 35%] Building CXX object 3rdparty/stout/tests/CMakeFiles/stout-tests.dir/path_tests.cpp.o
cd /mesos/build/3rdparty/stout/tests && /usr/bin/g++   -DBUILD_FLAGS=\"\" -DBUILD_JAVA_JVM_LIBRARY=\"\" -DHAS_AUTHENTICATION=1 -DLIBDIR=\"/usr/local/libmesos\" -DPICOJSON_USE_INT64 -DPKGDATADIR=\"/usr/local/share/mesos\" -DPKGLIBEXECDIR=\"/usr/local/libexec/mesos\" -DUSE_CMAKE_BUILD_CONFIG -DUSE_SSL_SOCKET=1 -DUSE_STATIC_LIB -DVERSION=\"1.4.0\" -D__STDC_FORMAT_MACROS -O2 -std=c++11 -g -fPIE -isystem /usr/include/apr-1.0 -isystem /mesos/build/3rdparty/boost-1.53.0/src/boost-1.53.0 -isystem /mesos/build/3rdparty/elfio-3.2/src/elfio-3.2 -isystem /mesos/build/3rdparty/glog-0.3.3/src/glog-0.3.3-lib/lib/include -isystem /mesos/build/3rdparty/nvml-352.79/src/nvml-352.79 -isystem /mesos/build/3rdparty/picojson-1.3.0/src/picojson-1.3.0 -isystem /mesos/build/3rdparty/protobuf-2.6.1/src/protobuf-2.6.1-lib/lib/include -isystem /usr/include/subversion-1 -isystem /mesos/build/3rdparty/gmock-1.7.0/src/gmock-1.7.0/include -isystem /mesos/build/3rdparty/gmock-1.7.0/src/gmock-1.7.0/gtest/include -I/mesos/3rdparty/stout/include    -o CMakeFiles/stout-tests.dir/path_tests.cpp.o -c /mesos/3rdparty/stout/tests/path_tests.cpp
/usr/bin/cmake -E cmake_progress_report /mesos/build/CMakeFiles 
[ 35%] Building CXX object 3rdparty/stout/tests/CMakeFiles/stout-tests.dir/protobuf_tests.cpp.o
cd /mesos/build/3rdparty/stout/tests && /usr/bin/g++   -DBUILD_FLAGS=\"\" -DBUILD_JAVA_JVM_LIBRARY=\"\" -DHAS_AUTHENTICATION=1 -DLIBDIR=\"/usr/local/libmesos\" -DPICOJSON_USE_INT64 -DPKGDATADIR=\"/usr/local/share/mesos\" -DPKGLIBEXECDIR=\"/usr/local/libexec/mesos\" -DUSE_CMAKE_BUILD_CONFIG -DUSE_SSL_SOCKET=1 -DUSE_STATIC_LIB -DVERSION=\"1.4.0\" -D__STDC_FORMAT_MACROS -O2 -std=c++11 -g -fPIE -isystem /usr/include/apr-1.0 -isystem /mesos/build/3rdparty/boost-1.53.0/src/boost-1.53.0 -isystem /mesos/build/3rdparty/elfio-3.2/src/elfio-3.2 -isystem /mesos/build/3rdparty/glog-0.3.3/src/glog-0.3.3-lib/lib/include -isystem /mesos/build/3rdparty/nvml-352.79/src/nvml-352.79 -isystem /mesos/build/3rdparty/picojson-1.3.0/src/picojson-1.3.0 -isystem /mesos/build/3rdparty/protobuf-2.6.1/src/protobuf-2.6.1-lib/lib/include -isystem /usr/include/subversion-1 -isystem /mesos/build/3rdparty/gmock-1.7.0/src/gmock-1.7.0/include -isystem /mesos/build/3rdparty/gmock-1.7.0/src/gmock-1.7.0/gtest/include -I/mesos/3rdparty/stout/include    -o CMakeFiles/stout-tests.dir/protobuf_tests.cpp.o -c /mesos/3rdparty/stout/tests/protobuf_tests.cpp
/usr/bin/cmake -E cmake_progress_report /mesos/build/CMakeFiles 
[ 35%] Building CXX object 3rdparty/libprocess/src/CMakeFiles/process-0.0.1.dir/libevent_ssl_socket.cpp.o
cd /mesos/build/3rdparty/libprocess/src && /usr/bin/g++   -DBUILD_FLAGS=\"\" -DBUILD_JAVA_JVM_LIBRARY=\"\" -DHAS_AUTHENTICATION=1 -DLIBDIR=\"/usr/local/libmesos\" -DPICOJSON_USE_INT64 -DPKGDATADIR=\"/usr/local/share/mesos\" -DPKGLIBEXECDIR=\"/usr/local/libexec/mesos\" -DUSE_CMAKE_BUILD_CONFIG -DUSE_SSL_SOCKET=1 -DUSE_STATIC_LIB -DVERSION=\"1.4.0\" -D__STDC_FORMAT_MACROS -Dprocess_0_0_1_EXPORTS -O2 -std=c++11 -g -fPIC -isystem /usr/include/apr-1.0 -isystem /mesos/build/3rdparty/boost-1.53.0/src/boost-1.53.0 -isystem /mesos/build/3rdparty/elfio-3.2/src/elfio-3.2 -isystem /mesos/build/3rdparty/glog-0.3.3/src/glog-0.3.3-lib/lib/include -isystem /mesos/build/3rdparty/nvml-352.79/src/nvml-352.79 -isystem /mesos/build/3rdparty/picojson-1.3.0/src/picojson-1.3.0 -isystem /mesos/build/3rdparty/protobuf-2.6.1/src/protobuf-2.6.1-lib/lib/include -isystem /usr/include/subversion-1 -isystem /mesos/3rdparty/stout/include -isystem /mesos/build/3rdparty/http_parser-2.6.2/src/http_parser-2.6.2 -isystem /mesos/build/3rdparty/libevent-2.1.5-beta/src/libevent-2.1.5-beta-lib/lib/include -I/mesos/3rdparty/libprocess/include    -o CMakeFiles/process-0.0.1.dir/libevent_ssl_socket.cpp.o -c /mesos/3rdparty/libprocess/src/libevent_ssl_socket.cpp
/usr/bin/cmake -E cmake_progress_report /mesos/build/CMakeFiles 
[ 35%] Building CXX object 3rdparty/stout/tests/CMakeFiles/stout-tests.dir/protobuf_tests.pb.cc.o
cd /mesos/build/3rdparty/stout/tests && /usr/bin/g++   -DBUILD_FLAGS=\"\" -DBUILD_JAVA_JVM_LIBRARY=\"\" -DHAS_AUTHENTICATION=1 -DLIBDIR=\"/usr/local/libmesos\" -DPICOJSON_USE_INT64 -DPKGDATADIR=\"/usr/local/share/mesos\" -DPKGLIBEXECDIR=\"/usr/local/libexec/mesos\" -DUSE_CMAKE_BUILD_CONFIG -DUSE_SSL_SOCKET=1 -DUSE_STATIC_LIB -DVERSION=\"1.4.0\" -D__STDC_FORMAT_MACROS -O2 -std=c++11 -g -fPIE -isystem /usr/include/apr-1.0 -isystem /mesos/build/3rdparty/boost-1.53.0/src/boost-1.53.0 -isystem /mesos/build/3rdparty/elfio-3.2/src/elfio-3.2 -isystem /mesos/build/3rdparty/glog-0.3.3/src/glog-0.3.3-lib/lib/include -isystem /mesos/build/3rdparty/nvml-352.79/src/nvml-352.79 -isystem /mesos/build/3rdparty/picojson-1.3.0/src/picojson-1.3.0 -isystem /mesos/build/3rdparty/protobuf-2.6.1/src/protobuf-2.6.1-lib/lib/include -isystem /usr/include/subversion-1 -isystem /mesos/build/3rdparty/gmock-1.7.0/src/gmock-1.7.0/include -isystem /mesos/build/3rdparty/gmock-1.7.0/src/gmock-1.7.0/gtest/include -I/mesos/3rdparty/stout/include    -o CMakeFiles/stout-tests.dir/protobuf_tests.pb.cc.o -c /mesos/3rdparty/stout/tests/protobuf_tests.pb.cc
/usr/bin/cmake -E cmake_progress_report /mesos/build/CMakeFiles 93
[ 36%] Building CXX object 3rdparty/stout/tests/CMakeFiles/stout-tests.dir/svn_tests.cpp.o
cd /mesos/build/3rdparty/stout/tests && /usr/bin/g++   -DBUILD_FLAGS=\"\" -DBUILD_JAVA_JVM_LIBRARY=\"\" -DHAS_AUTHENTICATION=1 -DLIBDIR=\"/usr/local/libmesos\" -DPICOJSON_USE_INT64 -DPKGDATADIR=\"/usr/local/share/mesos\" -DPKGLIBEXECDIR=\"/usr/local/libexec/mesos\" -DUSE_CMAKE_BUILD_CONFIG -DUSE_SSL_SOCKET=1 -DUSE_STATIC_LIB -DVERSION=\"1.4.0\" -D__STDC_FORMAT_MACROS -O2 -std=c++11 -g -fPIE -isystem /usr/include/apr-1.0 -isystem /mesos/build/3rdparty/boost-1.53.0/src/boost-1.53.0 -isystem /mesos/build/3rdparty/elfio-3.2/src/elfio-3.2 -isystem /mesos/build/3rdparty/glog-0.3.3/src/glog-0.3.3-lib/lib/include -isystem /mesos/build/3rdparty/nvml-352.79/src/nvml-352.79 -isystem /mesos/build/3rdparty/picojson-1.3.0/src/picojson-1.3.0 -isystem /mesos/build/3rdparty/protobuf-2.6.1/src/protobuf-2.6.1-lib/lib/include -isystem /usr/include/subversion-1 -isystem /mesos/build/3rdparty/gmock-1.7.0/src/gmock-1.7.0/include -isystem /mesos/build/3rdparty/gmock-1.7.0/src/gmock-1.7.0/gtest/include -I/mesos/3rdparty/stout/include    -o CMakeFiles/stout-tests.dir/svn_tests.cpp.o -c /mesos/3rdparty/stout/tests/svn_tests.cpp
/usr/bin/cmake -E cmake_progress_report /mesos/build/CMakeFiles 
[ 36%] Building CXX object 3rdparty/stout/tests/CMakeFiles/stout-tests.dir/proc_tests.cpp.o
cd /mesos/build/3rdparty/stout/tests && /usr/bin/g++   -DBUILD_FLAGS=\"\" -DBUILD_JAVA_JVM_LIBRARY=\"\" -DHAS_AUTHENTICATION=1 -DLIBDIR=\"/usr/local/libmesos\" -DPICOJSON_USE_INT64 -DPKGDATADIR=\"/usr/local/share/mesos\" -DPKGLIBEXECDIR=\"/usr/local/libexec/mesos\" -DUSE_CMAKE_BUILD_CONFIG -DUSE_SSL_SOCKET=1 -DUSE_STATIC_LIB -DVERSION=\"1.4.0\" -D__STDC_FORMAT_MACROS -O2 -std=c++11 -g -fPIE -isystem /usr/include/apr-1.0 -isystem /mesos/build/3rdparty/boost-1.53.0/src/boost-1.53.0 -isystem /mesos/build/3rdparty/elfio-3.2/src/elfio-3.2 -isystem /mesos/build/3rdparty/glog-0.3.3/src/glog-0.3.3-lib/lib/include -isystem /mesos/build/3rdparty/nvml-352.79/src/nvml-352.79 -isystem /mesos/build/3rdparty/picojson-1.3.0/src/picojson-1.3.0 -isystem /mesos/build/3rdparty/protobuf-2.6.1/src/protobuf-2.6.1-lib/lib/include -isystem /usr/include/subversion-1 -isystem /mesos/build/3rdparty/gmock-1.7.0/src/gmock-1.7.0/include -isystem /mesos/build/3rdparty/gmock-1.7.0/src/gmock-1.7.0/gtest/include -I/mesos/3rdparty/stout/include    -o CMakeFiles/stout-tests.dir/proc_tests.cpp.o -c /mesos/3rdparty/stout/tests/proc_tests.cpp
/usr/bin/cmake -E cmake_progress_report /mesos/build/CMakeFiles 
[ 36%] Building CXX object 3rdparty/stout/tests/CMakeFiles/stout-tests.dir/os/env_tests.cpp.o
cd /mesos/build/3rdparty/stout/tests && /usr/bin/g++   -DBUILD_FLAGS=\"\" -DBUILD_JAVA_JVM_LIBRARY=\"\" -DHAS_AUTHENTICATION=1 -DLIBDIR=\"/usr/local/libmesos\" -DPICOJSON_USE_INT64 -DPKGDATADIR=\"/usr/local/share/mesos\" -DPKGLIBEXECDIR=\"/usr/local/libexec/mesos\" -DUSE_CMAKE_BUILD_CONFIG -DUSE_SSL_SOCKET=1 -DUSE_STATIC_LIB -DVERSION=\"1.4.0\" -D__STDC_FORMAT_MACROS -O2 -std=c++11 -g -fPIE -isystem /usr/include/apr-1.0 -isystem /mesos/build/3rdparty/boost-1.53.0/src/boost-1.53.0 -isystem /mesos/build/3rdparty/elfio-3.2/src/elfio-3.2 -isystem /mesos/build/3rdparty/glog-0.3.3/src/glog-0.3.3-lib/lib/include -isystem /mesos/build/3rdparty/nvml-352.79/src/nvml-352.79 -isystem /mesos/build/3rdparty/picojson-1.3.0/src/picojson-1.3.0 -isystem /mesos/build/3rdparty/protobuf-2.6.1/src/protobuf-2.6.1-lib/lib/include -isystem /usr/include/subversion-1 -isystem /mesos/build/3rdparty/gmock-1.7.0/src/gmock-1.7.0/include -isystem /mesos/build/3rdparty/gmock-1.7.0/src/gmock-1.7.0/gtest/include -I/mesos/3rdparty/stout/include    -o CMakeFiles/stout-tests.dir/os/env_tests.cpp.o -c /mesos/3rdparty/stout/tests/os/env_tests.cpp
/usr/bin/cmake -E cmake_progress_report /mesos/build/CMakeFiles 
[ 36%] Building CXX object 3rdparty/stout/tests/CMakeFiles/stout-tests.dir/os/filesystem_tests.cpp.o
cd /mesos/build/3rdparty/stout/tests && /usr/bin/g++   -DBUILD_FLAGS=\"\" -DBUILD_JAVA_JVM_LIBRARY=\"\" -DHAS_AUTHENTICATION=1 -DLIBDIR=\"/usr/local/libmesos\" -DPICOJSON_USE_INT64 -DPKGDATADIR=\"/usr/local/share/mesos\" -DPKGLIBEXECDIR=\"/usr/local/libexec/mesos\" -DUSE_CMAKE_BUILD_CONFIG -DUSE_SSL_SOCKET=1 -DUSE_STATIC_LIB -DVERSION=\"1.4.0\" -D__STDC_FORMAT_MACROS -O2 -std=c++11 -g -fPIE -isystem /usr/include/apr-1.0 -isystem /mesos/build/3rdparty/boost-1.53.0/src/boost-1.53.0 -isystem /mesos/build/3rdparty/elfio-3.2/src/elfio-3.2 -isystem /mesos/build/3rdparty/glog-0.3.3/src/glog-0.3.3-lib/lib/include -isystem /mesos/build/3rdparty/nvml-352.79/src/nvml-352.79 -isystem /mesos/build/3rdparty/picojson-1.3.0/src/picojson-1.3.0 -isystem /mesos/build/3rdparty/protobuf-2.6.1/src/protobuf-2.6.1-lib/lib/include -isystem /usr/include/subversion-1 -isystem /mesos/build/3rdparty/gmock-1.7.0/src/gmock-1.7.0/include -isystem /mesos/build/3rdparty/gmock-1.7.0/src/gmock-1.7.0/gtest/include -I/mesos/3rdparty/stout/include    -o CMakeFiles/stout-tests.dir/os/filesystem_tests.cpp.o -c /mesos/3rdparty/stout/tests/os/filesystem_tests.cpp
/usr/bin/cmake -E cmake_progress_report /mesos/build/CMakeFiles 
[ 36%] Building CXX object 3rdparty/stout/tests/CMakeFiles/stout-tests.dir/os/process_tests.cpp.o
cd /mesos/build/3rdparty/stout/tests && /usr/bin/g++   -DBUILD_FLAGS=\"\" -DBUILD_JAVA_JVM_LIBRARY=\"\" -DHAS_AUTHENTICATION=1 -DLIBDIR=\"/usr/local/libmesos\" -DPICOJSON_USE_INT64 -DPKGDATADIR=\"/usr/local/share/mesos\" -DPKGLIBEXECDIR=\"/usr/local/libexec/mesos\" -DUSE_CMAKE_BUILD_CONFIG -DUSE_SSL_SOCKET=1 -DUSE_STATIC_LIB -DVERSION=\"1.4.0\" -D__STDC_FORMAT_MACROS -O2 -std=c++11 -g -fPIE -isystem /usr/include/apr-1.0 -isystem /mesos/build/3rdparty/boost-1.53.0/src/boost-1.53.0 -isystem /mesos/build/3rdparty/elfio-3.2/src/elfio-3.2 -isystem /mesos/build/3rdparty/glog-0.3.3/src/glog-0.3.3-lib/lib/include -isystem /mesos/build/3rdparty/nvml-352.79/src/nvml-352.79 -isystem /mesos/build/3rdparty/picojson-1.3.0/src/picojson-1.3.0 -isystem /mesos/build/3rdparty/protobuf-2.6.1/src/protobuf-2.6.1-lib/lib/include -isystem /usr/include/subversion-1 -isystem /mesos/build/3rdparty/gmock-1.7.0/src/gmock-1.7.0/include -isystem /mesos/build/3rdparty/gmock-1.7.0/src/gmock-1.7.0/gtest/include -I/mesos/3rdparty/stout/include    -o CMakeFiles/stout-tests.dir/os/process_tests.cpp.o -c /mesos/3rdparty/stout/tests/os/process_tests.cpp
/usr/bin/cmake -E cmake_progress_report /mesos/build/CMakeFiles 
[ 36%] Building CXX object 3rdparty/stout/tests/CMakeFiles/stout-tests.dir/os/rmdir_tests.cpp.o
cd /mesos/build/3rdparty/stout/tests && /usr/bin/g++   -DBUILD_FLAGS=\"\" -DBUILD_JAVA_JVM_LIBRARY=\"\" -DHAS_AUTHENTICATION=1 -DLIBDIR=\"/usr/local/libmesos\" -DPICOJSON_USE_INT64 -DPKGDATADIR=\"/usr/local/share/mesos\" -DPKGLIBEXECDIR=\"/usr/local/libexec/mesos\" -DUSE_CMAKE_BUILD_CONFIG -DUSE_SSL_SOCKET=1 -DUSE_STATIC_LIB -DVERSION=\"1.4.0\" -D__STDC_FORMAT_MACROS -O2 -std=c++11 -g -fPIE -isystem /usr/include/apr-1.0 -isystem /mesos/build/3rdparty/boost-1.53.0/src/boost-1.53.0 -isystem /mesos/build/3rdparty/elfio-3.2/src/elfio-3.2 -isystem /mesos/build/3rdparty/glog-0.3.3/src/glog-0.3.3-lib/lib/include -isystem /mesos/build/3rdparty/nvml-352.79/src/nvml-352.79 -isystem /mesos/build/3rdparty/picojson-1.3.0/src/picojson-1.3.0 -isystem /mesos/build/3rdparty/protobuf-2.6.1/src/protobuf-2.6.1-lib/lib/include -isystem /usr/include/subversion-1 -isystem /mesos/build/3rdparty/gmock-1.7.0/src/gmock-1.7.0/include -isystem /mesos/build/3rdparty/gmock-1.7.0/src/gmock-1.7.0/gtest/include -I/mesos/3rdparty/stout/include    -o CMakeFiles/stout-tests.dir/os/rmdir_tests.cpp.o -c /mesos/3rdparty/stout/tests/os/rmdir_tests.cpp
/usr/bin/cmake -E cmake_progress_report /mesos/build/CMakeFiles 
[ 36%] Building CXX object 3rdparty/stout/tests/CMakeFiles/stout-tests.dir/os/socket_tests.cpp.o
cd /mesos/build/3rdparty/stout/tests && /usr/bin/g++   -DBUILD_FLAGS=\"\" -DBUILD_JAVA_JVM_LIBRARY=\"\" -DHAS_AUTHENTICATION=1 -DLIBDIR=\"/usr/local/libmesos\" -DPICOJSON_USE_INT64 -DPKGDATADIR=\"/usr/local/share/mesos\" -DPKGLIBEXECDIR=\"/usr/local/libexec/mesos\" -DUSE_CMAKE_BUILD_CONFIG -DUSE_SSL_SOCKET=1 -DUSE_STATIC_LIB -DVERSION=\"1.4.0\" -D__STDC_FORMAT_MACROS -O2 -std=c++11 -g -fPIE -isystem /usr/include/apr-1.0 -isystem /mesos/build/3rdparty/boost-1.53.0/src/boost-1.53.0 -isystem /mesos/build/3rdparty/elfio-3.2/src/elfio-3.2 -isystem /mesos/build/3rdparty/glog-0.3.3/src/glog-0.3.3-lib/lib/include -isystem /mesos/build/3rdparty/nvml-352.79/src/nvml-352.79 -isystem /mesos/build/3rdparty/picojson-1.3.0/src/picojson-1.3.0 -isystem /mesos/build/3rdparty/protobuf-2.6.1/src/protobuf-2.6.1-lib/lib/include -isystem /usr/include/subversion-1 -isystem /mesos/build/3rdparty/gmock-1.7.0/src/gmock-1.7.0/include -isystem /mesos/build/3rdparty/gmock-1.7.0/src/gmock-1.7.0/gtest/include -I/mesos/3rdparty/stout/include    -o CMakeFiles/stout-tests.dir/os/socket_tests.cpp.o -c /mesos/3rdparty/stout/tests/os/socket_tests.cpp
/usr/bin/cmake -E cmake_progress_report /mesos/build/CMakeFiles 94
[ 37%] Building CXX object 3rdparty/stout/tests/CMakeFiles/stout-tests.dir/os/strerror_tests.cpp.o
cd /mesos/build/3rdparty/stout/tests && /usr/bin/g++   -DBUILD_FLAGS=\"\" -DBUILD_JAVA_JVM_LIBRARY=\"\" -DHAS_AUTHENTICATION=1 -DLIBDIR=\"/usr/local/libmesos\" -DPICOJSON_USE_INT64 -DPKGDATADIR=\"/usr/local/share/mesos\" -DPKGLIBEXECDIR=\"/usr/local/libexec/mesos\" -DUSE_CMAKE_BUILD_CONFIG -DUSE_SSL_SOCKET=1 -DUSE_STATIC_LIB -DVERSION=\"1.4.0\" -D__STDC_FORMAT_MACROS -O2 -std=c++11 -g -fPIE -isystem /usr/include/apr-1.0 -isystem /mesos/build/3rdparty/boost-1.53.0/src/boost-1.53.0 -isystem /mesos/build/3rdparty/elfio-3.2/src/elfio-3.2 -isystem /mesos/build/3rdparty/glog-0.3.3/src/glog-0.3.3-lib/lib/include -isystem /mesos/build/3rdparty/nvml-352.79/src/nvml-352.79 -isystem /mesos/build/3rdparty/picojson-1.3.0/src/picojson-1.3.0 -isystem /mesos/build/3rdparty/protobuf-2.6.1/src/protobuf-2.6.1-lib/lib/include -isystem /usr/include/subversion-1 -isystem /mesos/build/3rdparty/gmock-1.7.0/src/gmock-1.7.0/include -isystem /mesos/build/3rdparty/gmock-1.7.0/src/gmock-1.7.0/gtest/include -I/mesos/3rdparty/stout/include    -o CMakeFiles/stout-tests.dir/os/strerror_tests.cpp.o -c /mesos/3rdparty/stout/tests/os/strerror_tests.cpp
/usr/bin/cmake -E cmake_progress_report /mesos/build/CMakeFiles 
[ 37%] Building CXX object 3rdparty/stout/tests/CMakeFiles/stout-tests.dir/os/systems_tests.cpp.o
cd /mesos/build/3rdparty/stout/tests && /usr/bin/g++   -DBUILD_FLAGS=\"\" -DBUILD_JAVA_JVM_LIBRARY=\"\" -DHAS_AUTHENTICATION=1 -DLIBDIR=\"/usr/local/libmesos\" -DPICOJSON_USE_INT64 -DPKGDATADIR=\"/usr/local/share/mesos\" -DPKGLIBEXECDIR=\"/usr/local/libexec/mesos\" -DUSE_CMAKE_BUILD_CONFIG -DUSE_SSL_SOCKET=1 -DUSE_STATIC_LIB -DVERSION=\"1.4.0\" -D__STDC_FORMAT_MACROS -O2 -std=c++11 -g -fPIE -isystem /usr/include/apr-1.0 -isystem /mesos/build/3rdparty/boost-1.53.0/src/boost-1.53.0 -isystem /mesos/build/3rdparty/elfio-3.2/src/elfio-3.2 -isystem /mesos/build/3rdparty/glog-0.3.3/src/glog-0.3.3-lib/lib/include -isystem /mesos/build/3rdparty/nvml-352.79/src/nvml-352.79 -isystem /mesos/build/3rdparty/picojson-1.3.0/src/picojson-1.3.0 -isystem /mesos/build/3rdparty/protobuf-2.6.1/src/protobuf-2.6.1-lib/lib/include -isystem /usr/include/subversion-1 -isystem /mesos/build/3rdparty/gmock-1.7.0/src/gmock-1.7.0/include -isystem /mesos/build/3rdparty/gmock-1.7.0/src/gmock-1.7.0/gtest/include -I/mesos/3rdparty/stout/include    -o CMakeFiles/stout-tests.dir/os/systems_tests.cpp.o -c /mesos/3rdparty/stout/tests/os/systems_tests.cpp
Linking CXX shared library libprocess-0.0.1.so
cd /mesos/build/3rdparty/libprocess/src && /usr/bin/cmake -E cmake_link_script CMakeFiles/process-0.0.1.dir/link.txt --verbose=1
/usr/bin/g++  -fPIC  -O2 -std=c++11 -g   -shared -Wl,-soname,libprocess-0.0.1.so.0 -o libprocess-0.0.1.so.0.0.1 CMakeFiles/process-0.0.1.dir/subprocess_posix.cpp.o CMakeFiles/process-0.0.1.dir/authenticator_manager.cpp.o CMakeFiles/process-0.0.1.dir/authenticator.cpp.o CMakeFiles/process-0.0.1.dir/clock.cpp.o CMakeFiles/process-0.0.1.dir/firewall.cpp.o CMakeFiles/process-0.0.1.dir/help.cpp.o CMakeFiles/process-0.0.1.dir/http.cpp.o CMakeFiles/process-0.0.1.dir/io.cpp.o CMakeFiles/process-0.0.1.dir/latch.cpp.o CMakeFiles/process-0.0.1.dir/logging.cpp.o CMakeFiles/process-0.0.1.dir/metrics/metrics.cpp.o CMakeFiles/process-0.0.1.dir/mime.cpp.o CMakeFiles/process-0.0.1.dir/pid.cpp.o CMakeFiles/process-0.0.1.dir/poll_socket.cpp.o CMakeFiles/process-0.0.1.dir/profiler.cpp.o CMakeFiles/process-0.0.1.dir/process.cpp.o CMakeFiles/process-0.0.1.dir/reap.cpp.o CMakeFiles/process-0.0.1.dir/socket.cpp.o CMakeFiles/process-0.0.1.dir/subprocess.cpp.o CMakeFiles/process-0.0.1.dir/time.cpp.o CMakeFiles/process-0.0.1.dir/timeseries.cpp.o CMakeFiles/process-0.0.1.dir/libevent.cpp.o CMakeFiles/process-0.0.1.dir/libevent_poll.cpp.o CMakeFiles/process-0.0.1.dir/jwt.cpp.o CMakeFiles/process-0.0.1.dir/jwt_authenticator.cpp.o CMakeFiles/process-0.0.1.dir/openssl.cpp.o CMakeFiles/process-0.0.1.dir/ssl/utilities.cpp.o CMakeFiles/process-0.0.1.dir/libevent_ssl_socket.cpp.o  -L/mesos/build/3rdparty/glog-0.3.3/src/glog-0.3.3-lib/lib/lib  -L/mesos/build/3rdparty/protobuf-2.6.1/src/protobuf-2.6.1-lib/lib/lib  -L/mesos/build/3rdparty/http_parser-2.6.2/src/http_parser-2.6.2-build  -L/mesos/build/3rdparty/libevent-2.1.5-beta/src/libevent-2.1.5-beta-lib/lib/lib -lapr-1 -lcurl -lglog -lsvn_delta-1 -lsvn_diff-1 -lsvn_subr-1 -lprotobuf -ldl -lapr-1 -lrt -lhttp_parser -levent -lssl -lcrypto -lrt -lz -lpthread -lhttp_parser -levent -lssl -lcrypto -lz -lpthread -Wl,-rpath,/mesos/build/3rdparty/glog-0.3.3/src/glog-0.3.3-lib/lib/lib:/mesos/build/3rdparty/protobuf-2.6.1/src/protobuf-2.6.1-lib/lib/lib:/mesos/build/3rdparty/http_parser-2.6.2/src/http_parser-2.6.2-build:/mesos/build/3rdparty/libevent-2.1.5-beta/src/libevent-2.1.5-beta-lib/lib/lib 
cd /mesos/build/3rdparty/libprocess/src && /usr/bin/cmake -E cmake_symlink_library libprocess-0.0.1.so.0.0.1 libprocess-0.0.1.so.0 libprocess-0.0.1.so
make[3]: Leaving directory `/mesos/build'
/usr/bin/cmake -E cmake_progress_report /mesos/build/CMakeFiles  82 83 84 85 86
[ 37%] Built target process-0.0.1
/usr/bin/cmake -E cmake_progress_report /mesos/build/CMakeFiles 
[ 37%] Building CXX object 3rdparty/stout/tests/CMakeFiles/stout-tests.dir/os/sendfile_tests.cpp.o
cd /mesos/build/3rdparty/stout/tests && /usr/bin/g++   -DBUILD_FLAGS=\"\" -DBUILD_JAVA_JVM_LIBRARY=\"\" -DHAS_AUTHENTICATION=1 -DLIBDIR=\"/usr/local/libmesos\" -DPICOJSON_USE_INT64 -DPKGDATADIR=\"/usr/local/share/mesos\" -DPKGLIBEXECDIR=\"/usr/local/libexec/mesos\" -DUSE_CMAKE_BUILD_CONFIG -DUSE_SSL_SOCKET=1 -DUSE_STATIC_LIB -DVERSION=\"1.4.0\" -D__STDC_FORMAT_MACROS -O2 -std=c++11 -g -fPIE -isystem /usr/include/apr-1.0 -isystem /mesos/build/3rdparty/boost-1.53.0/src/boost-1.53.0 -isystem /mesos/build/3rdparty/elfio-3.2/src/elfio-3.2 -isystem /mesos/build/3rdparty/glog-0.3.3/src/glog-0.3.3-lib/lib/include -isystem /mesos/build/3rdparty/nvml-352.79/src/nvml-352.79 -isystem /mesos/build/3rdparty/picojson-1.3.0/src/picojson-1.3.0 -isystem /mesos/build/3rdparty/protobuf-2.6.1/src/protobuf-2.6.1-lib/lib/include -isystem /usr/include/subversion-1 -isystem /mesos/build/3rdparty/gmock-1.7.0/src/gmock-1.7.0/include -isystem /mesos/build/3rdparty/gmock-1.7.0/src/gmock-1.7.0/gtest/include -I/mesos/3rdparty/stout/include    -o CMakeFiles/stout-tests.dir/os/sendfile_tests.cpp.o -c /mesos/3rdparty/stout/tests/os/sendfile_tests.cpp
/usr/bin/cmake -E cmake_progress_report /mesos/build/CMakeFiles 
[ 37%] Building CXX object 3rdparty/stout/tests/CMakeFiles/stout-tests.dir/os/signals_tests.cpp.o
cd /mesos/build/3rdparty/stout/tests && /usr/bin/g++   -DBUILD_FLAGS=\"\" -DBUILD_JAVA_JVM_LIBRARY=\"\" -DHAS_AUTHENTICATION=1 -DLIBDIR=\"/usr/local/libmesos\" -DPICOJSON_USE_INT64 -DPKGDATADIR=\"/usr/local/share/mesos\" -DPKGLIBEXECDIR=\"/usr/local/libexec/mesos\" -DUSE_CMAKE_BUILD_CONFIG -DUSE_SSL_SOCKET=1 -DUSE_STATIC_LIB -DVERSION=\"1.4.0\" -D__STDC_FORMAT_MACROS -O2 -std=c++11 -g -fPIE -isystem /usr/include/apr-1.0 -isystem /mesos/build/3rdparty/boost-1.53.0/src/boost-1.53.0 -isystem /mesos/build/3rdparty/elfio-3.2/src/elfio-3.2 -isystem /mesos/build/3rdparty/glog-0.3.3/src/glog-0.3.3-lib/lib/include -isystem /mesos/build/3rdparty/nvml-352.79/src/nvml-352.79 -isystem /mesos/build/3rdparty/picojson-1.3.0/src/picojson-1.3.0 -isystem /mesos/build/3rdparty/protobuf-2.6.1/src/protobuf-2.6.1-lib/lib/include -isystem /usr/include/subversion-1 -isystem /mesos/build/3rdparty/gmock-1.7.0/src/gmock-1.7.0/include -isystem /mesos/build/3rdparty/gmock-1.7.0/src/gmock-1.7.0/gtest/include -I/mesos/3rdparty/stout/include    -o CMakeFiles/stout-tests.dir/os/signals_tests.cpp.o -c /mesos/3rdparty/stout/tests/os/signals_tests.cpp
Linking CXX executable stout-tests
cd /mesos/build/3rdparty/stout/tests && /usr/bin/cmake -E cmake_link_script CMakeFiles/stout-tests.dir/link.txt --verbose=1
/usr/bin/g++    -O2 -std=c++11 -g    CMakeFiles/stout-tests.dir/base64_tests.cpp.o CMakeFiles/stout-tests.dir/bits_tests.cpp.o CMakeFiles/stout-tests.dir/bytes_tests.cpp.o CMakeFiles/stout-tests.dir/cache_tests.cpp.o CMakeFiles/stout-tests.dir/duration_tests.cpp.o CMakeFiles/stout-tests.dir/dynamiclibrary_tests.cpp.o CMakeFiles/stout-tests.dir/error_tests.cpp.o CMakeFiles/stout-tests.dir/flags_tests.cpp.o CMakeFiles/stout-tests.dir/gzip_tests.cpp.o CMakeFiles/stout-tests.dir/hashmap_tests.cpp.o CMakeFiles/stout-tests.dir/hashset_tests.cpp.o CMakeFiles/stout-tests.dir/interval_tests.cpp.o CMakeFiles/stout-tests.dir/ip_tests.cpp.o CMakeFiles/stout-tests.dir/json_tests.cpp.o CMakeFiles/stout-tests.dir/jsonify_tests.cpp.o CMakeFiles/stout-tests.dir/linkedhashmap_tests.cpp.o CMakeFiles/stout-tests.dir/mac_tests.cpp.o CMakeFiles/stout-tests.dir/main.cpp.o CMakeFiles/stout-tests.dir/multimap_tests.cpp.o CMakeFiles/stout-tests.dir/none_tests.cpp.o CMakeFiles/stout-tests.dir/numify_tests.cpp.o CMakeFiles/stout-tests.dir/option_tests.cpp.o CMakeFiles/stout-tests.dir/os_tests.cpp.o CMakeFiles/stout-tests.dir/recordio_tests.cpp.o CMakeFiles/stout-tests.dir/result_tests.cpp.o CMakeFiles/stout-tests.dir/some_tests.cpp.o CMakeFiles/stout-tests.dir/strings_tests.cpp.o CMakeFiles/stout-tests.dir/subcommand_tests.cpp.o CMakeFiles/stout-tests.dir/try_tests.cpp.o CMakeFiles/stout-tests.dir/uuid_tests.cpp.o CMakeFiles/stout-tests.dir/version_tests.cpp.o CMakeFiles/stout-tests.dir/path_tests.cpp.o CMakeFiles/stout-tests.dir/protobuf_tests.cpp.o CMakeFiles/stout-tests.dir/protobuf_tests.pb.cc.o CMakeFiles/stout-tests.dir/svn_tests.cpp.o CMakeFiles/stout-tests.dir/proc_tests.cpp.o CMakeFiles/stout-tests.dir/os/env_tests.cpp.o CMakeFiles/stout-tests.dir/os/filesystem_tests.cpp.o CMakeFiles/stout-tests.dir/os/process_tests.cpp.o CMakeFiles/stout-tests.dir/os/rmdir_tests.cpp.o CMakeFiles/stout-tests.dir/os/socket_tests.cpp.o CMakeFiles/stout-tests.dir/os/strerror_tests.cpp.o CMakeFiles/stout-tests.dir/os/systems_tests.cpp.o CMakeFiles/stout-tests.dir/os/sendfile_tests.cpp.o CMakeFiles/stout-tests.dir/os/signals_tests.cpp.o  -o stout-tests  -L/mesos/build/3rdparty/glog-0.3.3/src/glog-0.3.3-lib/lib/lib  -L/mesos/build/3rdparty/protobuf-2.6.1/src/protobuf-2.6.1-lib/lib/lib  -L/mesos/build/3rdparty/gmock-1.7.0/src/gmock-1.7.0-lib/lib  -L/mesos/build/3rdparty/gmock-1.7.0/src/gmock-1.7.0-build/gtest/lib/.libs -rdynamic -lapr-1 -lcurl -lglog -lsvn_delta-1 -lsvn_diff-1 -lsvn_subr-1 -lprotobuf -ldl -lapr-1 -lrt -lpthread -lapr-1 -lcurl -lglog -lsvn_delta-1 -lsvn_diff-1 -lsvn_subr-1 -lprotobuf -ldl -lapr-1 -lrt -lpthread -lapr-1 -lcurl -lglog -lsvn_delta-1 -lsvn_diff-1 -lsvn_subr-1 -lprotobuf -ldl -lapr-1 -lrt -lpthread -lapr-1 -lcurl -lglog -lsvn_delta-1 -lsvn_diff-1 -lsvn_subr-1 -lprotobuf -ldl -lapr-1 -lrt -lgmock -lgtest -lpthread -lgmock -lgtest -Wl,-rpath,/mesos/build/3rdparty/glog-0.3.3/src/glog-0.3.3-lib/lib/lib:/mesos/build/3rdparty/protobuf-2.6.1/src/protobuf-2.6.1-lib/lib/lib:/mesos/build/3rdparty/gmock-1.7.0/src/gmock-1.7.0-lib/lib:/mesos/build/3rdparty/gmock-1.7.0/src/gmock-1.7.0-build/gtest/lib/.libs 
make[3]: Leaving directory `/mesos/build'
/usr/bin/cmake -E cmake_progress_report /mesos/build/CMakeFiles  88 89 90 91 92 93 94
[ 37%] Built target stout-tests
make[2]: Leaving directory `/mesos/build'
make[1]: *** [CMakeFiles/check.dir/rule] Error 2
make[1]: Leaving directory `/mesos/build'
make: *** [check] Error 2
+ docker rmi mesos-1494253770-26674
Untagged: mesos-1494253770-26674:latest
Deleted: sha256:dfd7e491d311d24cd1977e186f58d3214321c8b03e653b49d36835b5238e3938
Deleted: sha256:caa5929e1124c75ffea2aacf8827a0004c63b4285741c658118563ffac12f64e
Deleted: sha256:a3ea37ca980102bf4555aeb1ff60f4a182dbb9b7e316f5ddbdecafea3e8d6679
Deleted: sha256:f524bb424956152ee44d0cda2956ac0ff3349e25e0de0f851ca969c1cd02d53d
Deleted: sha256:eb3d30940997977cdbce3acb9fe087b1363ec8241c09a0028bb3f9a6ce2474d6
Deleted: sha256:29d1547473d36416aa6898b0cb779909b82f29abab1bc28417740b404fb73712
Deleted: sha256:6d9a84411fe80333842da0c1105a584d336ab9ca098c01d39e280c355759fb20
Deleted: sha256:e3b90ea85fb8469b3a9cdc292b6c7f7ec9d0357458159d8c147fa173f8cc25b6
Deleted: sha256:a0b1bf382ec658964978d9658cc8814f0dcad383b31d18305ca361cb3cfd66a3
Deleted: sha256:ccda64d53dd95dd216b05b958af4f5ac1fe4e4e3d6bc8bf49fbcdb2bf8c8b79a
Deleted: sha256:a320d6bfefc886ad0e61f89efa671b931d0c3e28817a066f05d3a7d7c1812226
Deleted: sha256:34a56bafc76cefea6d7673e99c38556a738594624327685a1cf94b24aa73c95f
Deleted: sha256:d11d5a56f8f1601dc67aab2135959a083989b70d8071c1c9b32094ccd5305bc4
Deleted: sha256:5b7f88831ca84a152f2132360cddf47e19664284c49d012791140fbc93ab3363
Deleted: sha256:9bf92dfcbac7fc7b864db769eea8ab828fae802042b721ee757cd6e207f1a240
Deleted: sha256:d2a4b6867741d8e6ff18ede2ecaa979cfdb6c2a60f0bf9bcf4fc943dcb6eefc3
Deleted: sha256:6f4a6ac13910cbb5b3ac3277d4dc58bc6f15daa74884efd148ad571d22f5413d
Deleted: sha256:2bd84db29f1a1b7dca351a81871a0d0a0d9f8e833f3c9d48947d19b7dee471ad
Deleted: sha256:8cb21cb2b9a787b4919c9dc916ef6b077c74f666333171cdceb86bec5ce22827
Deleted: sha256:21fe8b4d3ef421f75d7781c3f15f4a72a9d73299caa30af081c4da02b0ca6189
Deleted: sha256:9c83d0b852ff480f053a9056882d950b4b16619e7873e58b4bd2f31c9b4c1505
Deleted: sha256:825761af0917050350730577dac873be05ba5084d1070c90dcd11952b7923be1
Deleted: sha256:d253c2b8fe016dbff9dee3b6b96eb1255138f503464e6fd1595a4d8bc43a5180
Deleted: sha256:9e774541b5941272bf15b1f3ad78da3fd3353a3e023336639e80ff0a220cd54f
Build step 'Execute shell' marked build as failure
Not sending mail to unregistered user yujie.jay@gmail.com

Mime
View raw message