mesos-builds mailing list archives

Site index · List index
Message view « Date » · « Thread »
Top « Date » · « Thread »
From Apache Jenkins Server <jenk...@builds.apache.org>
Subject Build failed in Jenkins: Mesos-Buildbot » cmake,gcc,--verbose --enable-libevent --enable-ssl,GLOG_v=1 MESOS_VERBOSE=1,centos:7,(docker||Hadoop)&&(!ubuntu-us1)&&(!ubuntu-eu2) #3648
Date Wed, 10 May 2017 09:31:52 GMT
See <https://builds.apache.org/job/Mesos-Buildbot/BUILDTOOL=cmake,COMPILER=gcc,CONFIGURATION=--verbose%20--enable-libevent%20--enable-ssl,ENVIRONMENT=GLOG_v=1%20MESOS_VERBOSE=1,OS=centos%3A7,label_exp=(docker%7C%7CHadoop)&&(!ubuntu-us1)&&(!ubuntu-eu2)/3648/display/redirect?page=changes>

Changes:

[neil.conway] Added MESOS-7464, MESOS-7484 to 1.2.1 CHANGELOG.

[neil.conway] Sorted 1.2.1 CHANGELOG entries.

[neil.conway] Added MESOS-{1987,6976,7389,7464,7484} to 1.3.0 CHANGELOG.

------------------------------------------
[...truncated 1.67 MB...]
I0510 09:31:28.998292 25095 openssl.cpp:435] Will only verify peer certificate if presented!
NOTE: Set LIBPROCESS_SSL_REQUIRE_CERT=1 to require peer certificate verification
I0510 09:31:29.007068 25112 libevent_ssl_socket.cpp:1170] Socket error: error:00000000:lib(0):func(0):reason(0)
[       OK ] SSLTest.SilentSocket (349 ms)
[----------] 15 tests from SSLTest (9329 ms total)

[----------] 42 tests from Scheme/HTTPTest
[ RUN      ] Scheme/HTTPTest.Endpoints/0
I0510 09:31:29.794651 25095 openssl.cpp:419] CA file path is unspecified! NOTE: Set CA file
path with LIBPROCESS_SSL_CA_FILE=<filepath>
I0510 09:31:29.794672 25095 openssl.cpp:424] CA directory path unspecified! NOTE: Set CA directory
path with LIBPROCESS_SSL_CA_DIR=<dirpath>
I0510 09:31:29.794677 25095 openssl.cpp:429] Will not verify peer certificate!
NOTE: Set LIBPROCESS_SSL_VERIFY_CERT=1 to enable peer certificate verification
I0510 09:31:29.794680 25095 openssl.cpp:435] Will only verify peer certificate if presented!
NOTE: Set LIBPROCESS_SSL_REQUIRE_CERT=1 to require peer certificate verification
E0510 09:31:29.795032 25112 process.cpp:950] Failed to accept socket: future discarded
I0510 09:31:29.804396 25095 process.cpp:1266] libprocess is initialized on 172.17.0.2:44083
with 16 worker threads
I0510 09:31:29.811331 25856 process.cpp:3730] Handling HTTP event for process '(77)' with
path: '/(77)/body'
I0510 09:31:29.815939 25852 process.cpp:3730] Handling HTTP event for process '(77)' with
path: '/(77)/pipe'
I0510 09:31:29.820660 25850 process.cpp:3730] Handling HTTP event for process '(77)' with
path: '/(77)/body'
I0510 09:31:29.820996 25847 process.cpp:3787] Failed to process request for '/(77)/body':
failure
I0510 09:31:29.821025 25852 process.cpp:1476] Returning '500 Internal Server Error' for '/(77)/body'
(failure)
[       OK ] Scheme/HTTPTest.Endpoints/0 (814 ms)
[ RUN      ] Scheme/HTTPTest.Endpoints/1
I0510 09:31:29.823191 25095 process.cpp:1266] libprocess is initialized on 172.17.0.2:52581
with 16 worker threads
I0510 09:31:29.823767 25866 process.cpp:3730] Handling HTTP event for process '(78)' with
path: '/(78)/body'
I0510 09:31:29.824647 25873 process.cpp:3730] Handling HTTP event for process '(78)' with
path: '/(78)/pipe'
I0510 09:31:29.825726 25873 process.cpp:3730] Handling HTTP event for process '(78)' with
path: '/(78)/body'
I0510 09:31:29.825978 25869 process.cpp:3787] Failed to process request for '/(78)/body':
failure
I0510 09:31:29.826020 25871 process.cpp:1476] Returning '500 Internal Server Error' for '/(78)/body'
(failure)
I0510 09:31:29.826367 25878 process.cpp:837] Decode failure: Connection reset by peer
E0510 09:31:29.826395 25878 process.cpp:2449] Failed to shutdown socket with fd 9, address
172.17.0.2:52581: Transport endpoint is not connected
[       OK ] Scheme/HTTPTest.Endpoints/1 (5 ms)
[ RUN      ] Scheme/HTTPTest.EndpointsHelp/0
I0510 09:31:30.214449 25095 openssl.cpp:419] CA file path is unspecified! NOTE: Set CA file
path with LIBPROCESS_SSL_CA_FILE=<filepath>
I0510 09:31:30.214470 25095 openssl.cpp:424] CA directory path unspecified! NOTE: Set CA directory
path with LIBPROCESS_SSL_CA_DIR=<dirpath>
I0510 09:31:30.214475 25095 openssl.cpp:429] Will not verify peer certificate!
NOTE: Set LIBPROCESS_SSL_VERIFY_CERT=1 to enable peer certificate verification
I0510 09:31:30.214479 25095 openssl.cpp:435] Will only verify peer certificate if presented!
NOTE: Set LIBPROCESS_SSL_REQUIRE_CERT=1 to require peer certificate verification
E0510 09:31:30.214867 25878 process.cpp:950] Failed to accept socket: future discarded
I0510 09:31:30.224056 25095 process.cpp:1266] libprocess is initialized on 172.17.0.2:36329
with 16 worker threads
I0510 09:31:30.229305 25881 process.cpp:3730] Handling HTTP event for process 'help' with
path: '/help'
I0510 09:31:30.234189 25886 process.cpp:3730] Handling HTTP event for process 'help' with
path: '/help'
I0510 09:31:30.239351 25884 process.cpp:3730] Handling HTTP event for process 'help' with
path: '/help/(79)/body'
I0510 09:31:30.244252 25880 process.cpp:3730] Handling HTTP event for process 'help' with
path: '/help/(79)/a/b/c'
[       OK ] Scheme/HTTPTest.EndpointsHelp/0 (419 ms)
[ RUN      ] Scheme/HTTPTest.EndpointsHelp/1
I0510 09:31:30.251730 25095 process.cpp:1266] libprocess is initialized on 172.17.0.2:44317
with 16 worker threads
I0510 09:31:30.252411 25910 process.cpp:3730] Handling HTTP event for process 'help' with
path: '/help'
I0510 09:31:30.253517 25902 process.cpp:3730] Handling HTTP event for process 'help' with
path: '/help'
I0510 09:31:30.254875 25901 process.cpp:3730] Handling HTTP event for process 'help' with
path: '/help/(80)/body'
I0510 09:31:30.258925 25897 process.cpp:3730] Handling HTTP event for process 'help' with
path: '/help/(80)/a/b/c'
[       OK ] Scheme/HTTPTest.EndpointsHelp/1 (14 ms)
[ RUN      ] Scheme/HTTPTest.EndpointsHelpRemoval/0
I0510 09:31:30.558634 25095 openssl.cpp:419] CA file path is unspecified! NOTE: Set CA file
path with LIBPROCESS_SSL_CA_FILE=<filepath>
I0510 09:31:30.558655 25095 openssl.cpp:424] CA directory path unspecified! NOTE: Set CA directory
path with LIBPROCESS_SSL_CA_DIR=<dirpath>
I0510 09:31:30.558660 25095 openssl.cpp:429] Will not verify peer certificate!
NOTE: Set LIBPROCESS_SSL_VERIFY_CERT=1 to enable peer certificate verification
I0510 09:31:30.558663 25095 openssl.cpp:435] Will only verify peer certificate if presented!
NOTE: Set LIBPROCESS_SSL_REQUIRE_CERT=1 to require peer certificate verification
E0510 09:31:30.559021 25912 process.cpp:950] Failed to accept socket: future discarded
I0510 09:31:30.575855 25095 process.cpp:1266] libprocess is initialized on 172.17.0.2:51061
with 16 worker threads
I0510 09:31:30.581238 25921 process.cpp:3730] Handling HTTP event for process 'help' with
path: '/help/(81)/body'
I0510 09:31:30.586247 25916 process.cpp:3730] Handling HTTP event for process 'help' with
path: '/help/(81)/bogus'
[       OK ] Scheme/HTTPTest.EndpointsHelpRemoval/0 (328 ms)
[ RUN      ] Scheme/HTTPTest.EndpointsHelpRemoval/1
I0510 09:31:30.599768 25095 process.cpp:1266] libprocess is initialized on 172.17.0.2:43624
with 16 worker threads
I0510 09:31:30.600666 25945 process.cpp:3730] Handling HTTP event for process 'help' with
path: '/help/(82)/body'
I0510 09:31:30.601831 25936 process.cpp:3730] Handling HTTP event for process 'help' with
path: '/help/(82)/bogus'
[       OK ] Scheme/HTTPTest.EndpointsHelpRemoval/1 (15 ms)
[ RUN      ] Scheme/HTTPTest.PipeEOF/0
I0510 09:31:31.071061 25095 openssl.cpp:419] CA file path is unspecified! NOTE: Set CA file
path with LIBPROCESS_SSL_CA_FILE=<filepath>
I0510 09:31:31.071082 25095 openssl.cpp:424] CA directory path unspecified! NOTE: Set CA directory
path with LIBPROCESS_SSL_CA_DIR=<dirpath>
I0510 09:31:31.071089 25095 openssl.cpp:429] Will not verify peer certificate!
NOTE: Set LIBPROCESS_SSL_VERIFY_CERT=1 to enable peer certificate verification
I0510 09:31:31.071092 25095 openssl.cpp:435] Will only verify peer certificate if presented!
NOTE: Set LIBPROCESS_SSL_REQUIRE_CERT=1 to require peer certificate verification
E0510 09:31:31.071535 25946 process.cpp:950] Failed to accept socket: future discarded
I0510 09:31:31.073323 25095 process.cpp:1266] libprocess is initialized on 172.17.0.2:59658
with 16 worker threads
[       OK ] Scheme/HTTPTest.PipeEOF/0 (480 ms)
[ RUN      ] Scheme/HTTPTest.PipeEOF/1
I0510 09:31:31.095769 25095 process.cpp:1266] libprocess is initialized on 172.17.0.2:41456
with 16 worker threads
[       OK ] Scheme/HTTPTest.PipeEOF/1 (16 ms)
[ RUN      ] Scheme/HTTPTest.PipeFailure/0
I0510 09:31:31.609565 25095 openssl.cpp:419] CA file path is unspecified! NOTE: Set CA file
path with LIBPROCESS_SSL_CA_FILE=<filepath>
I0510 09:31:31.609587 25095 openssl.cpp:424] CA directory path unspecified! NOTE: Set CA directory
path with LIBPROCESS_SSL_CA_DIR=<dirpath>
I0510 09:31:31.609592 25095 openssl.cpp:429] Will not verify peer certificate!
NOTE: Set LIBPROCESS_SSL_VERIFY_CERT=1 to enable peer certificate verification
I0510 09:31:31.609596 25095 openssl.cpp:435] Will only verify peer certificate if presented!
NOTE: Set LIBPROCESS_SSL_REQUIRE_CERT=1 to require peer certificate verification
E0510 09:31:31.609977 25980 process.cpp:950] Failed to accept socket: future discarded
I0510 09:31:31.618787 25095 process.cpp:1266] libprocess is initialized on 172.17.0.2:39905
with 16 worker threads
[       OK ] Scheme/HTTPTest.PipeFailure/0 (521 ms)
[ RUN      ] Scheme/HTTPTest.PipeFailure/1
I0510 09:31:31.620903 25095 process.cpp:1266] libprocess is initialized on 172.17.0.2:57436
with 16 worker threads
[       OK ] Scheme/HTTPTest.PipeFailure/1 (2 ms)
[ RUN      ] Scheme/HTTPTest.PipeReaderCloses/0
I0510 09:31:32.252130 25095 openssl.cpp:419] CA file path is unspecified! NOTE: Set CA file
path with LIBPROCESS_SSL_CA_FILE=<filepath>
I0510 09:31:32.252149 25095 openssl.cpp:424] CA directory path unspecified! NOTE: Set CA directory
path with LIBPROCESS_SSL_CA_DIR=<dirpath>
I0510 09:31:32.252154 25095 openssl.cpp:429] Will not verify peer certificate!
NOTE: Set LIBPROCESS_SSL_VERIFY_CERT=1 to enable peer certificate verification
I0510 09:31:32.252161 25095 openssl.cpp:435] Will only verify peer certificate if presented!
NOTE: Set LIBPROCESS_SSL_REQUIRE_CERT=1 to require peer certificate verification
E0510 09:31:32.252521 26014 process.cpp:950] Failed to accept socket: future discarded
I0510 09:31:32.255676 25095 process.cpp:1266] libprocess is initialized on 172.17.0.2:44966
with 16 worker threads
[       OK ] Scheme/HTTPTest.PipeReaderCloses/0 (635 ms)
[ RUN      ] Scheme/HTTPTest.PipeReaderCloses/1
I0510 09:31:32.257417 25095 process.cpp:1266] libprocess is initialized on 172.17.0.2:52831
with 16 worker threads
[       OK ] Scheme/HTTPTest.PipeReaderCloses/1 (1 ms)
[ RUN      ] Scheme/HTTPTest.Encode/0
I0510 09:31:32.545794 25095 openssl.cpp:419] CA file path is unspecified! NOTE: Set CA file
path with LIBPROCESS_SSL_CA_FILE=<filepath>
I0510 09:31:32.545817 25095 openssl.cpp:424] CA directory path unspecified! NOTE: Set CA directory
path with LIBPROCESS_SSL_CA_DIR=<dirpath>
I0510 09:31:32.545825 25095 openssl.cpp:429] Will not verify peer certificate!
NOTE: Set LIBPROCESS_SSL_VERIFY_CERT=1 to enable peer certificate verification
I0510 09:31:32.545830 25095 openssl.cpp:435] Will only verify peer certificate if presented!
NOTE: Set LIBPROCESS_SSL_REQUIRE_CERT=1 to require peer certificate verification
E0510 09:31:32.546226 26048 process.cpp:950] Failed to accept socket: future discarded
I0510 09:31:32.548048 25095 process.cpp:1266] libprocess is initialized on 172.17.0.2:37114
with 16 worker threads
[       OK ] Scheme/HTTPTest.Encode/0 (291 ms)
[ RUN      ] Scheme/HTTPTest.Encode/1
I0510 09:31:32.563846 25095 process.cpp:1266] libprocess is initialized on 172.17.0.2:47112
with 16 worker threads
[       OK ] Scheme/HTTPTest.Encode/1 (16 ms)
[ RUN      ] Scheme/HTTPTest.PathParse/0
I0510 09:31:32.957504 25095 openssl.cpp:419] CA file path is unspecified! NOTE: Set CA file
path with LIBPROCESS_SSL_CA_FILE=<filepath>
I0510 09:31:32.957525 25095 openssl.cpp:424] CA directory path unspecified! NOTE: Set CA directory
path with LIBPROCESS_SSL_CA_DIR=<dirpath>
I0510 09:31:32.957528 25095 openssl.cpp:429] Will not verify peer certificate!
NOTE: Set LIBPROCESS_SSL_VERIFY_CERT=1 to enable peer certificate verification
I0510 09:31:32.957535 25095 openssl.cpp:435] Will only verify peer certificate if presented!
NOTE: Set LIBPROCESS_SSL_REQUIRE_CERT=1 to require peer certificate verification
E0510 09:31:32.958072 26082 process.cpp:950] Failed to accept socket: future discarded
I0510 09:31:32.971529 25095 process.cpp:1266] libprocess is initialized on 172.17.0.2:45709
with 16 worker threads
[       OK ] Scheme/HTTPTest.PathParse/0 (407 ms)
[ RUN      ] Scheme/HTTPTest.PathParse/1
I0510 09:31:32.987645 25095 process.cpp:1266] libprocess is initialized on 172.17.0.2:52280
with 16 worker threads
[       OK ] Scheme/HTTPTest.PathParse/1 (16 ms)
[ RUN      ] Scheme/HTTPTest.Get/0
I0510 09:31:33.381292 25095 openssl.cpp:419] CA file path is unspecified! NOTE: Set CA file
path with LIBPROCESS_SSL_CA_FILE=<filepath>
I0510 09:31:33.381314 25095 openssl.cpp:424] CA directory path unspecified! NOTE: Set CA directory
path with LIBPROCESS_SSL_CA_DIR=<dirpath>
I0510 09:31:33.381317 25095 openssl.cpp:429] Will not verify peer certificate!
NOTE: Set LIBPROCESS_SSL_VERIFY_CERT=1 to enable peer certificate verification
I0510 09:31:33.381321 25095 openssl.cpp:435] Will only verify peer certificate if presented!
NOTE: Set LIBPROCESS_SSL_REQUIRE_CERT=1 to require peer certificate verification
E0510 09:31:33.381934 26116 process.cpp:950] Failed to accept socket: future discarded
I0510 09:31:33.392138 25095 process.cpp:1266] libprocess is initialized on 172.17.0.2:37111
with 16 worker threads
I0510 09:31:33.398183 26126 process.cpp:3730] Handling HTTP event for process '(83)' with
path: '/(83)/get'
I0510 09:31:33.402899 26117 process.cpp:3730] Handling HTTP event for process '(83)' with
path: '/(83)/get'
[       OK ] Scheme/HTTPTest.Get/0 (417 ms)
[ RUN      ] Scheme/HTTPTest.Get/1
I0510 09:31:33.408048 25095 process.cpp:1266] libprocess is initialized on 172.17.0.2:45839
with 16 worker threads
I0510 09:31:33.408779 26149 process.cpp:3730] Handling HTTP event for process '(84)' with
path: '/(84)/get'
I0510 09:31:33.409910 26138 process.cpp:3730] Handling HTTP event for process '(84)' with
path: '/(84)/get'
[       OK ] Scheme/HTTPTest.Get/1 (6 ms)
[ RUN      ] Scheme/HTTPTest.NestedGet/0
I0510 09:31:33.823254 25095 openssl.cpp:419] CA file path is unspecified! NOTE: Set CA file
path with LIBPROCESS_SSL_CA_FILE=<filepath>
I0510 09:31:33.823276 25095 openssl.cpp:424] CA directory path unspecified! NOTE: Set CA directory
path with LIBPROCESS_SSL_CA_DIR=<dirpath>
I0510 09:31:33.823281 25095 openssl.cpp:429] Will not verify peer certificate!
NOTE: Set LIBPROCESS_SSL_VERIFY_CERT=1 to enable peer certificate verification
I0510 09:31:33.823283 25095 openssl.cpp:435] Will only verify peer certificate if presented!
NOTE: Set LIBPROCESS_SSL_REQUIRE_CERT=1 to require peer certificate verification
E0510 09:31:33.823642 26150 process.cpp:950] Failed to accept socket: future discarded
I0510 09:31:33.824738 25095 process.cpp:1266] libprocess is initialized on 172.17.0.2:39739
with 16 worker threads
I0510 09:31:33.829756 26164 process.cpp:3730] Handling HTTP event for process '(85)' with
path: '/(85)//a/b/c'
I0510 09:31:33.834033 26151 process.cpp:3730] Handling HTTP event for process '(85)' with
path: '/(85)//a/b'
[       OK ] Scheme/HTTPTest.NestedGet/0 (425 ms)
[ RUN      ] Scheme/HTTPTest.NestedGet/1
I0510 09:31:33.843570 25095 process.cpp:1266] libprocess is initialized on 172.17.0.2:36191
with 16 worker threads
I0510 09:31:33.844095 26176 process.cpp:3730] Handling HTTP event for process '(86)' with
path: '/(86)//a/b/c'
I0510 09:31:33.844949 26170 process.cpp:3730] Handling HTTP event for process '(86)' with
path: '/(86)//a/b'
[       OK ] Scheme/HTTPTest.NestedGet/1 (10 ms)
[ RUN      ] Scheme/HTTPTest.StreamingGetComplete/0
I0510 09:31:34.038362 25095 openssl.cpp:419] CA file path is unspecified! NOTE: Set CA file
path with LIBPROCESS_SSL_CA_FILE=<filepath>
I0510 09:31:34.038389 25095 openssl.cpp:424] CA directory path unspecified! NOTE: Set CA directory
path with LIBPROCESS_SSL_CA_DIR=<dirpath>
I0510 09:31:34.038396 25095 openssl.cpp:429] Will not verify peer certificate!
NOTE: Set LIBPROCESS_SSL_VERIFY_CERT=1 to enable peer certificate verification
I0510 09:31:34.038401 25095 openssl.cpp:435] Will only verify peer certificate if presented!
NOTE: Set LIBPROCESS_SSL_REQUIRE_CERT=1 to require peer certificate verification
E0510 09:31:34.046602 26184 process.cpp:950] Failed to accept socket: future discarded
I0510 09:31:34.059017 25095 process.cpp:1266] libprocess is initialized on 172.17.0.2:37385
with 16 worker threads
I0510 09:31:34.064162 26196 process.cpp:3730] Handling HTTP event for process '(87)' with
path: '/(87)/pipe'
[       OK ] Scheme/HTTPTest.StreamingGetComplete/0 (259 ms)
[ RUN      ] Scheme/HTTPTest.StreamingGetComplete/1
I0510 09:31:34.115315 25095 process.cpp:1266] libprocess is initialized on 172.17.0.2:57584
with 16 worker threads
I0510 09:31:34.115927 26207 process.cpp:3730] Handling HTTP event for process '(88)' with
path: '/(88)/pipe'
[       OK ] Scheme/HTTPTest.StreamingGetComplete/1 (18 ms)
[ RUN      ] Scheme/HTTPTest.StreamingGetFailure/0
I0510 09:31:34.571920 25095 openssl.cpp:419] CA file path is unspecified! NOTE: Set CA file
path with LIBPROCESS_SSL_CA_FILE=<filepath>
I0510 09:31:34.571943 25095 openssl.cpp:424] CA directory path unspecified! NOTE: Set CA directory
path with LIBPROCESS_SSL_CA_DIR=<dirpath>
I0510 09:31:34.571948 25095 openssl.cpp:429] Will not verify peer certificate!
NOTE: Set LIBPROCESS_SSL_VERIFY_CERT=1 to enable peer certificate verification
I0510 09:31:34.571950 25095 openssl.cpp:435] Will only verify peer certificate if presented!
NOTE: Set LIBPROCESS_SSL_REQUIRE_CERT=1 to require peer certificate verification
E0510 09:31:34.572300 26218 process.cpp:950] Failed to accept socket: future discarded
*** Aborted at 1494408694 (unix time) try "date -d @1494408694" if you are using GNU date
***
I0510 09:31:34.573855 25095 process.cpp:1266] libprocess is initialized on 172.17.0.2:35458
with 16 worker threads
PC: @     0x7ff82e2ddc56 __memcpy_ssse3_back
I0510 09:31:34.579080 26234 process.cpp:3730] Handling HTTP event for process '(89)' with
path: '/(89)/pipe'
*** SIGSEGV (@0x3c79258) received by PID 25095 (TID 0x7ff829762700) from PID 63410776; stack
trace: ***
    @     0x7ff82ed84370 (unknown)
    @     0x7ff82e2ddc56 __memcpy_ssse3_back
    @     0x7ff82eb2a8e0 (unknown)
    @     0x7ff82eb2af8c (unknown)
I0510 09:31:34.619133 26231 process.cpp:1624] Failed to read from stream: oops
[       OK ] Scheme/HTTPTest.StreamingGetFailure/0 (501 ms)
[ RUN      ] Scheme/HTTPTest.StreamingGetFailure/1
    @     0x7ff830e74fe2 process::internal::dispatch()
    @     0x7ff830ebade6 process::dispatch<>()
    @     0x7ff830e79118 process::ProcessBase::route()
    @     0x7ff830dac7b4 process::Help::initialize()
    @     0x7ff830e76041 process::ProcessManager::resume()
    @     0x7ff830e7f0a7 _ZNSt6thread5_ImplISt12_Bind_simpleIFZN7process14ProcessManager12init_threadsEvEUt_vEEE6_M_runEv
    @     0x7ff82eb21230 (unknown)
    @     0x7ff82ed7cdc5 start_thread
    @     0x7ff82e28a73d __clone
make[3]: Leaving directory `/mesos/build'
make[3]: *** [CMakeFiles/check] Segmentation fault
make[2]: *** [CMakeFiles/check.dir/all] Error 2
make[2]: Leaving directory `/mesos/build'
make[1]: *** [CMakeFiles/check.dir/rule] Error 2
make[1]: Leaving directory `/mesos/build'
make: *** [check] Error 2
+ docker rmi mesos-1494405680-2014
Untagged: mesos-1494405680-2014:latest
Deleted: sha256:fa989f4e3357c123388d5662a6db5bc634a7641b4a315dbafa1541919515a4b0
Deleted: sha256:7865877b62f96c54ef5d2e6927d53ecd7d37513c23a9cecd43308d2220148b70
Deleted: sha256:390656f18bb5412fc618bab3206f9467bc0c1e23293c5b2ba41c5f454f9250de
Deleted: sha256:d3245a2d9f27fb6225079885c5998f172334c86002e1504f6b1d6a6c87edc782
Deleted: sha256:5592953b357037b0a68b776cc4a0e5400db97a0fc8ff91c12fda66b40b679465
Deleted: sha256:6e86f36e2cde2e045728e7cc6a1351325edfccbb9c5cdfa99d710c790f60a783
Deleted: sha256:16f5c70c6a4172351175e23ab309bab08305184a0a9cd5a3a0ef253e2518338a
Deleted: sha256:497b3f31a1590b45569c2670f359b7a2ab86541b3be7e37821b89477ce31ced7
Deleted: sha256:bcf6455ef0f39697fe1fcdaa101dff9b50717d64dc4a811e275e0276516100bb
Deleted: sha256:e19dd5fa754bd9de5e0e7c9bfd3884cd72401b0b7131728d4875e9e3656a2737
Deleted: sha256:5c3f43dc5beca941b53ab1fcc545e1216164ea5f90c7901ff2d77a82bdae0c55
Deleted: sha256:defc18e4dac0ccf0012d0466f446bd2c92387f8e0317d2a33dbeca819766f304
Deleted: sha256:763dac149a7c97b34c233ae5103ae2e6d497d62b8127bb67d12817cac517007d
Deleted: sha256:632256dd112363176ad65a64db163377c6d84de2c7853e93ac37ebec5cfc51e0
Deleted: sha256:cf15c02014208097275dc4e87b108e9d1c171a04ca89079c63120684e1e3f655
Deleted: sha256:d6e6b690730f59e7756044bb6955f3663517cf92fee05303c1abe68a9a7ba34e
Deleted: sha256:c89f3a85eee95d3a91bdc6460f933002f274692877a2c45ec1b6e90e8f793ec9
Deleted: sha256:a1b0ebf127121292c2ce694452a89f81ff45581c8be209dba4a2c2f7fac8fe92
Deleted: sha256:79725e957c3bfa3e90aa4b6063f31b7514ce79dd3fc08697b68a0b0e71c173db
Deleted: sha256:09eecaabe6d562a6128a50bb5e30c6ec2e5c6c822c1d0ee3675a33e5a754bacf
Deleted: sha256:030f1d336aef73eb66a9b2b512d9e7d1759c4f1db225f89ced246b98ce85f34b
Deleted: sha256:5a047e06afed61c3e7b7ce6a88aa83a1e565ffd08a4a529fc6263a0bec99edfe
Deleted: sha256:4fea1bdbd7be57c9023ad3d3c442b4c166600dfb01d5fb95dcf0b6cfe09135ab
Deleted: sha256:801119ac3393e5dd379cf030c027426d95f4f5205ed19e1c93314cd4b597df47
Deleted: sha256:b688d3aa328d82343ee41c16eb3695fc5314d03d7bdb99674a39924a390e603c
Build step 'Execute shell' marked build as failure
Not sending mail to unregistered user neil.conway@gmail.com

Mime
View raw message