mesos-builds mailing list archives

Site index · List index
Message view « Date » · « Thread »
Top « Date » · « Thread »
From Apache Jenkins Server <jenk...@builds.apache.org>
Subject Build failed in Jenkins: Mesos-Buildbot » autotools,gcc,--verbose,GLOG_v=1 MESOS_VERBOSE=1,ubuntu:14.04,(docker||Hadoop)&&(!ubuntu-us1)&&(!ubuntu-eu2) #3740
Date Mon, 29 May 2017 13:41:22 GMT
See <https://builds.apache.org/job/Mesos-Buildbot/BUILDTOOL=autotools,COMPILER=gcc,CONFIGURATION=--verbose,ENVIRONMENT=GLOG_v=1%20MESOS_VERBOSE=1,OS=ubuntu%3A14.04,label_exp=(docker%7C%7CHadoop)&&(!ubuntu-us1)&&(!ubuntu-eu2)/3740/display/redirect?page=changes>

Changes:

[klueska] Moved 'current_word' calculation for autocomplete in the new Mesos CLI.

[klueska] Added Config class to manage the config file in the new Mesos CLI.

------------------------------------------
[...truncated 27.51 MB...]
[       OK ] Endpoint/SlaveEndpointTest.AuthorizedRequest/1 (33 ms)
[ RUN      ] Endpoint/SlaveEndpointTest.AuthorizedRequest/2
I0529 13:41:10.454718  4657 containerizer.cpp:230] Using isolation: posix/cpu,posix/mem,filesystem/posix,network/cni,environment_secret
W0529 13:41:10.455394  4657 backend.cpp:76] Failed to create 'aufs' backend: AufsBackend requires
root privileges
W0529 13:41:10.455523  4657 backend.cpp:76] Failed to create 'bind' backend: BindBackend requires
root privileges
I0529 13:41:10.455566  4657 provisioner.cpp:255] Using default backend 'copy'
I0529 13:41:10.459889  4689 slave.cpp:232] Mesos agent started on (751)@172.17.0.3:52797
I0529 13:41:10.459961  4689 slave.cpp:233] Flags at startup: --acls="" --appc_simple_discovery_uri_prefix="http://"
--appc_store_dir="/tmp/mesos/store/appc" --authenticate_http_readonly="true" --authenticate_http_readwrite="true"
--authenticatee="crammd5" --authentication_backoff_factor="1secs" --authorizer="local" --cgroups_cpu_enable_pids_and_tids_count="false"
--cgroups_enable_cfs="false" --cgroups_hierarchy="/sys/fs/cgroup" --cgroups_limit_swap="false"
--cgroups_root="mesos" --container_disk_watch_interval="15secs" --containerizers="mesos" --credential="/tmp/Endpoint_SlaveEndpointTest_AuthorizedRequest_2_iQLTuK/credential"
--default_role="*" --disk_watch_interval="1mins" --docker="docker" --docker_kill_orphans="true"
--docker_registry="https://registry-1.docker.io" --docker_remove_delay="6hrs" --docker_socket="/var/run/docker.sock"
--docker_stop_timeout="0ns" --docker_store_dir="/tmp/mesos/store/docker" --docker_volume_checkpoint_dir="/var/run/mesos/isolators/docker/volume"
--enforce_container_disk_quota="false" --executor_registration_timeout="1mins" --executor_reregistration_timeout="2secs"
--executor_shutdown_grace_period="5secs" --fetcher_cache_dir="/tmp/Endpoint_SlaveEndpointTest_AuthorizedRequest_2_iQLTuK/fetch"
--fetcher_cache_size="2GB" --frameworks_home="" --gc_delay="1weeks" --gc_disk_headroom="0.1"
--hadoop_home="" --help="false" --hostname_lookup="true" --http_command_executor="false" --http_credentials="/tmp/Endpoint_SlaveEndpointTest_AuthorizedRequest_2_iQLTuK/http_credentials"
--http_heartbeat_interval="30secs" --initialize_driver_logging="true" --isolation="posix/cpu,posix/mem"
--launcher="posix" --launcher_dir="/mesos/mesos-1.4.0/_build/src" --logbufsecs="0" --logging_level="INFO"
--max_completed_executors_per_framework="150" --oversubscribed_resources_interval="15secs"
--perf_duration="10secs" --perf_interval="1mins" --port="5051" --qos_correction_interval_min="0ns"
--quiet="false" --recover="reconnect" --recovery_timeout="15mins" --registration_backoff_factor="10ms"
--resources="cpus:2;gpus:0;mem:1024;disk:1024;ports:[31000-32000]" --revocable_cpu_low_priority="true"
--runtime_dir="/tmp/Endpoint_SlaveEndpointTest_AuthorizedRequest_2_iQLTuK" --sandbox_directory="/mnt/mesos/sandbox"
--strict="true" --switch_user="true" --systemd_enable_support="true" --systemd_runtime_directory="/run/systemd/system"
--version="false" --work_dir="/tmp/Endpoint_SlaveEndpointTest_AuthorizedRequest_2_rbkJHo"
I0529 13:41:10.460499  4689 credentials.hpp:86] Loading credential for authentication from
'/tmp/Endpoint_SlaveEndpointTest_AuthorizedRequest_2_iQLTuK/credential'
I0529 13:41:10.460685  4689 slave.cpp:265] Agent using credential for: test-principal
I0529 13:41:10.460713  4689 credentials.hpp:37] Loading credentials for authentication from
'/tmp/Endpoint_SlaveEndpointTest_AuthorizedRequest_2_iQLTuK/http_credentials'
I0529 13:41:10.461048  4689 http.cpp:975] Creating default 'basic' HTTP authenticator for
realm 'mesos-agent-readonly'
I0529 13:41:10.461248  4689 http.cpp:975] Creating default 'basic' HTTP authenticator for
realm 'mesos-agent-readwrite'
I0529 13:41:10.462963  4689 slave.cpp:536] Agent resources: cpus(*):2; mem(*):1024; disk(*):1024;
ports(*):[31000-32000]
I0529 13:41:10.463062  4689 slave.cpp:544] Agent attributes: [  ]
I0529 13:41:10.463078  4689 slave.cpp:549] Agent hostname: 82d5d3ca8ae5
I0529 13:41:10.463245  4690 status_update_manager.cpp:177] Pausing sending status updates
I0529 13:41:10.464927  4684 state.cpp:62] Recovering state from '/tmp/Endpoint_SlaveEndpointTest_AuthorizedRequest_2_rbkJHo/meta'
I0529 13:41:10.465297  4687 status_update_manager.cpp:203] Recovering status update manager
I0529 13:41:10.465571  4679 containerizer.cpp:582] Recovering containerizer
I0529 13:41:10.467489  4677 provisioner.cpp:416] Provisioner recovery complete
I0529 13:41:10.468062  4676 slave.cpp:6083] Finished recovery
I0529 13:41:10.468600  4676 slave.cpp:6265] Querying resource estimator for oversubscribable
resources
I0529 13:41:10.468936  4679 slave.cpp:6279] Received oversubscribable resources {} from the
resource estimator
I0529 13:41:10.471913  4676 process.cpp:3730] Handling HTTP event for process 'slave(751)'
with path: '/slave(751)/containers'
I0529 13:41:10.473609  4688 http.cpp:1115] HTTP GET for /slave(751)/containers from 172.17.0.3:42831
I0529 13:41:10.473702  4688 http.cpp:936] Authorizing principal 'test-principal' to GET the
'/containers' endpoint
I0529 13:41:10.477767  4686 slave.cpp:801] Agent terminating
[       OK ] Endpoint/SlaveEndpointTest.AuthorizedRequest/2 (34 ms)
[ RUN      ] Endpoint/SlaveEndpointTest.UnauthorizedRequest/0
I0529 13:41:10.491000  4657 containerizer.cpp:230] Using isolation: posix/cpu,posix/mem,filesystem/posix,network/cni,environment_secret
W0529 13:41:10.491631  4657 backend.cpp:76] Failed to create 'aufs' backend: AufsBackend requires
root privileges
W0529 13:41:10.491746  4657 backend.cpp:76] Failed to create 'bind' backend: BindBackend requires
root privileges
I0529 13:41:10.491787  4657 provisioner.cpp:255] Using default backend 'copy'
I0529 13:41:10.495888  4680 slave.cpp:232] Mesos agent started on (752)@172.17.0.3:52797
I0529 13:41:10.495921  4680 slave.cpp:233] Flags at startup: --acls="" --appc_simple_discovery_uri_prefix="http://"
--appc_store_dir="/tmp/mesos/store/appc" --authenticate_http_readonly="true" --authenticate_http_readwrite="true"
--authenticatee="crammd5" --authentication_backoff_factor="1secs" --authorizer="local" --cgroups_cpu_enable_pids_and_tids_count="false"
--cgroups_enable_cfs="false" --cgroups_hierarchy="/sys/fs/cgroup" --cgroups_limit_swap="false"
--cgroups_root="mesos" --container_disk_watch_interval="15secs" --containerizers="mesos" --credential="/tmp/Endpoint_SlaveEndpointTest_UnauthorizedRequest_0_iOi8Y9/credential"
--default_role="*" --disk_watch_interval="1mins" --docker="docker" --docker_kill_orphans="true"
--docker_registry="https://registry-1.docker.io" --docker_remove_delay="6hrs" --docker_socket="/var/run/docker.sock"
--docker_stop_timeout="0ns" --docker_store_dir="/tmp/mesos/store/docker" --docker_volume_checkpoint_dir="/var/run/mesos/isolators/docker/volume"
--enforce_container_disk_quota="false" --executor_registration_timeout="1mins" --executor_reregistration_timeout="2secs"
--executor_shutdown_grace_period="5secs" --fetcher_cache_dir="/tmp/Endpoint_SlaveEndpointTest_UnauthorizedRequest_0_iOi8Y9/fetch"
--fetcher_cache_size="2GB" --frameworks_home="" --gc_delay="1weeks" --gc_disk_headroom="0.1"
--hadoop_home="" --help="false" --hostname_lookup="true" --http_command_executor="false" --http_credentials="/tmp/Endpoint_SlaveEndpointTest_UnauthorizedRequest_0_iOi8Y9/http_credentials"
--http_heartbeat_interval="30secs" --initialize_driver_logging="true" --isolation="posix/cpu,posix/mem"
--launcher="posix" --launcher_dir="/mesos/mesos-1.4.0/_build/src" --logbufsecs="0" --logging_level="INFO"
--max_completed_executors_per_framework="150" --oversubscribed_resources_interval="15secs"
--perf_duration="10secs" --perf_interval="1mins" --port="5051" --qos_correction_interval_min="0ns"
--quiet="false" --recover="reconnect" --recovery_timeout="15mins" --registration_backoff_factor="10ms"
--resources="cpus:2;gpus:0;mem:1024;disk:1024;ports:[31000-32000]" --revocable_cpu_low_priority="true"
--runtime_dir="/tmp/Endpoint_SlaveEndpointTest_UnauthorizedRequest_0_iOi8Y9" --sandbox_directory="/mnt/mesos/sandbox"
--strict="true" --switch_user="true" --systemd_enable_support="true" --systemd_runtime_directory="/run/systemd/system"
--version="false" --work_dir="/tmp/Endpoint_SlaveEndpointTest_UnauthorizedRequest_0_v8nb6N"
I0529 13:41:10.496500  4680 credentials.hpp:86] Loading credential for authentication from
'/tmp/Endpoint_SlaveEndpointTest_UnauthorizedRequest_0_iOi8Y9/credential'
I0529 13:41:10.496685  4680 slave.cpp:265] Agent using credential for: test-principal
I0529 13:41:10.496712  4680 credentials.hpp:37] Loading credentials for authentication from
'/tmp/Endpoint_SlaveEndpointTest_UnauthorizedRequest_0_iOi8Y9/http_credentials'
I0529 13:41:10.497032  4680 http.cpp:975] Creating default 'basic' HTTP authenticator for
realm 'mesos-agent-readonly'
I0529 13:41:10.497220  4680 http.cpp:975] Creating default 'basic' HTTP authenticator for
realm 'mesos-agent-readwrite'
I0529 13:41:10.498910  4680 slave.cpp:536] Agent resources: cpus(*):2; mem(*):1024; disk(*):1024;
ports(*):[31000-32000]
I0529 13:41:10.499006  4680 slave.cpp:544] Agent attributes: [  ]
I0529 13:41:10.499022  4680 slave.cpp:549] Agent hostname: 82d5d3ca8ae5
I0529 13:41:10.499179  4679 status_update_manager.cpp:177] Pausing sending status updates
I0529 13:41:10.500653  4681 state.cpp:62] Recovering state from '/tmp/Endpoint_SlaveEndpointTest_UnauthorizedRequest_0_v8nb6N/meta'
I0529 13:41:10.501184  4680 status_update_manager.cpp:203] Recovering status update manager
I0529 13:41:10.501487  4682 containerizer.cpp:582] Recovering containerizer
I0529 13:41:10.503443  4681 provisioner.cpp:416] Provisioner recovery complete
I0529 13:41:10.503911  4680 slave.cpp:6083] Finished recovery
I0529 13:41:10.504417  4680 slave.cpp:6265] Querying resource estimator for oversubscribable
resources
I0529 13:41:10.504652  4687 slave.cpp:6279] Received oversubscribable resources {} from the
resource estimator
I0529 13:41:10.507094  4683 process.cpp:3730] Handling HTTP event for process 'slave(752)'
with path: '/slave(752)/monitor/statistics'
I0529 13:41:10.508478  4687 http.cpp:1115] HTTP GET for /slave(752)/monitor/statistics from
172.17.0.3:42832
I0529 13:41:10.508577  4687 http.cpp:936] Authorizing principal 'test-principal' to GET the
'/monitor/statistics' endpoint
I0529 13:41:10.512019  4680 slave.cpp:801] Agent terminating
[       OK ] Endpoint/SlaveEndpointTest.UnauthorizedRequest/0 (32 ms)
[ RUN      ] Endpoint/SlaveEndpointTest.UnauthorizedRequest/1
I0529 13:41:10.524247  4657 containerizer.cpp:230] Using isolation: posix/cpu,posix/mem,filesystem/posix,network/cni,environment_secret
W0529 13:41:10.524868  4657 backend.cpp:76] Failed to create 'aufs' backend: AufsBackend requires
root privileges
W0529 13:41:10.524986  4657 backend.cpp:76] Failed to create 'bind' backend: BindBackend requires
root privileges
I0529 13:41:10.525027  4657 provisioner.cpp:255] Using default backend 'copy'
I0529 13:41:10.529036  4686 slave.cpp:232] Mesos agent started on (753)@172.17.0.3:52797
I0529 13:41:10.529068  4686 slave.cpp:233] Flags at startup: --acls="" --appc_simple_discovery_uri_prefix="http://"
--appc_store_dir="/tmp/mesos/store/appc" --authenticate_http_readonly="true" --authenticate_http_readwrite="true"
--authenticatee="crammd5" --authentication_backoff_factor="1secs" --authorizer="local" --cgroups_cpu_enable_pids_and_tids_count="false"
--cgroups_enable_cfs="false" --cgroups_hierarchy="/sys/fs/cgroup" --cgroups_limit_swap="false"
--cgroups_root="mesos" --container_disk_watch_interval="15secs" --containerizers="mesos" --credential="/tmp/Endpoint_SlaveEndpointTest_UnauthorizedRequest_1_YBjmPz/credential"
--default_role="*" --disk_watch_interval="1mins" --docker="docker" --docker_kill_orphans="true"
--docker_registry="https://registry-1.docker.io" --docker_remove_delay="6hrs" --docker_socket="/var/run/docker.sock"
--docker_stop_timeout="0ns" --docker_store_dir="/tmp/mesos/store/docker" --docker_volume_checkpoint_dir="/var/run/mesos/isolators/docker/volume"
--enforce_container_disk_quota="false" --executor_registration_timeout="1mins" --executor_reregistration_timeout="2secs"
--executor_shutdown_grace_period="5secs" --fetcher_cache_dir="/tmp/Endpoint_SlaveEndpointTest_UnauthorizedRequest_1_YBjmPz/fetch"
--fetcher_cache_size="2GB" --frameworks_home="" --gc_delay="1weeks" --gc_disk_headroom="0.1"
--hadoop_home="" --help="false" --hostname_lookup="true" --http_command_executor="false" --http_credentials="/tmp/Endpoint_SlaveEndpointTest_UnauthorizedRequest_1_YBjmPz/http_credentials"
--http_heartbeat_interval="30secs" --initialize_driver_logging="true" --isolation="posix/cpu,posix/mem"
--launcher="posix" --launcher_dir="/mesos/mesos-1.4.0/_build/src" --logbufsecs="0" --logging_level="INFO"
--max_completed_executors_per_framework="150" --oversubscribed_resources_interval="15secs"
--perf_duration="10secs" --perf_interval="1mins" --port="5051" --qos_correction_interval_min="0ns"
--quiet="false" --recover="reconnect" --recovery_timeout="15mins" --registration_backoff_factor="10ms"
--resources="cpus:2;gpus:0;mem:1024;disk:1024;ports:[31000-32000]" --revocable_cpu_low_priority="true"
--runtime_dir="/tmp/Endpoint_SlaveEndpointTest_UnauthorizedRequest_1_YBjmPz" --sandbox_directory="/mnt/mesos/sandbox"
--strict="true" --switch_user="true" --systemd_enable_support="true" --systemd_runtime_directory="/run/systemd/system"
--version="false" --work_dir="/tmp/Endpoint_SlaveEndpointTest_UnauthorizedRequest_1_5L80Qd"
I0529 13:41:10.529625  4686 credentials.hpp:86] Loading credential for authentication from
'/tmp/Endpoint_SlaveEndpointTest_UnauthorizedRequest_1_YBjmPz/credential'
I0529 13:41:10.529827  4686 slave.cpp:265] Agent using credential for: test-principal
I0529 13:41:10.529861  4686 credentials.hpp:37] Loading credentials for authentication from
'/tmp/Endpoint_SlaveEndpointTest_UnauthorizedRequest_1_YBjmPz/http_credentials'
I0529 13:41:10.530249  4686 http.cpp:975] Creating default 'basic' HTTP authenticator for
realm 'mesos-agent-readonly'
I0529 13:41:10.530455  4686 http.cpp:975] Creating default 'basic' HTTP authenticator for
realm 'mesos-agent-readwrite'
I0529 13:41:10.532069  4686 slave.cpp:536] Agent resources: cpus(*):2; mem(*):1024; disk(*):1024;
ports(*):[31000-32000]
I0529 13:41:10.532171  4686 slave.cpp:544] Agent attributes: [  ]
I0529 13:41:10.532196  4686 slave.cpp:549] Agent hostname: 82d5d3ca8ae5
I0529 13:41:10.532436  4676 status_update_manager.cpp:177] Pausing sending status updates
I0529 13:41:10.533993  4689 state.cpp:62] Recovering state from '/tmp/Endpoint_SlaveEndpointTest_UnauthorizedRequest_1_5L80Qd/meta'
I0529 13:41:10.534387  4679 status_update_manager.cpp:203] Recovering status update manager
I0529 13:41:10.534680  4676 containerizer.cpp:582] Recovering containerizer
I0529 13:41:10.536511  4684 provisioner.cpp:416] Provisioner recovery complete
I0529 13:41:10.536942  4687 slave.cpp:6083] Finished recovery
I0529 13:41:10.537572  4687 slave.cpp:6265] Querying resource estimator for oversubscribable
resources
I0529 13:41:10.537890  4684 slave.cpp:6279] Received oversubscribable resources {} from the
resource estimator
I0529 13:41:10.540451  4680 process.cpp:3730] Handling HTTP event for process 'slave(753)'
with path: '/slave(753)/monitor/statistics.json'
I0529 13:41:10.541719  4676 http.cpp:1115] HTTP GET for /slave(753)/monitor/statistics.json
from 172.17.0.3:42834
I0529 13:41:10.541800  4676 http.cpp:936] Authorizing principal 'test-principal' to GET the
'/monitor/statistics.json' endpoint
I0529 13:41:10.544394  4690 slave.cpp:801] Agent terminating
[       OK ] Endpoint/SlaveEndpointTest.UnauthorizedRequest/1 (32 ms)
[ RUN      ] Endpoint/SlaveEndpointTest.UnauthorizedRequest/2
I0529 13:41:10.556270  4657 containerizer.cpp:230] Using isolation: posix/cpu,posix/mem,filesystem/posix,network/cni,environment_secret
W0529 13:41:10.556841  4657 backend.cpp:76] Failed to create 'aufs' backend: AufsBackend requires
root privileges
W0529 13:41:10.556946  4657 backend.cpp:76] Failed to create 'bind' backend: BindBackend requires
root privileges
I0529 13:41:10.556988  4657 provisioner.cpp:255] Using default backend 'copy'
I0529 13:41:10.560492  4685 slave.cpp:232] Mesos agent started on (754)@172.17.0.3:52797
I0529 13:41:10.560520  4685 slave.cpp:233] Flags at startup: --acls="" --appc_simple_discovery_uri_prefix="http://"
--appc_store_dir="/tmp/mesos/store/appc" --authenticate_http_readonly="true" --authenticate_http_readwrite="true"
--authenticatee="crammd5" --authentication_backoff_factor="1secs" --authorizer="local" --cgroups_cpu_enable_pids_and_tids_count="false"
--cgroups_enable_cfs="false" --cgroups_hierarchy="/sys/fs/cgroup" --cgroups_limit_swap="false"
--cgroups_root="mesos" --container_disk_watch_interval="15secs" --containerizers="mesos" --credential="/tmp/Endpoint_SlaveEndpointTest_UnauthorizedRequest_2_QFrI0Z/credential"
--default_role="*" --disk_watch_interval="1mins" --docker="docker" --docker_kill_orphans="true"
--docker_registry="https://registry-1.docker.io" --docker_remove_delay="6hrs" --docker_socket="/var/run/docker.sock"
--docker_stop_timeout="0ns" --docker_store_dir="/tmp/mesos/store/docker" --docker_volume_checkpoint_dir="/var/run/mesos/isolators/docker/volume"
--enforce_container_disk_quota="false" --executor_registration_timeout="1mins" --executor_reregistration_timeout="2secs"
--executor_shutdown_grace_period="5secs" --fetcher_cache_dir="/tmp/Endpoint_SlaveEndpointTest_UnauthorizedRequest_2_QFrI0Z/fetch"
--fetcher_cache_size="2GB" --frameworks_home="" --gc_delay="1weeks" --gc_disk_headroom="0.1"
--hadoop_home="" --help="false" --hostname_lookup="true" --http_command_executor="false" --http_credentials="/tmp/Endpoint_SlaveEndpointTest_UnauthorizedRequest_2_QFrI0Z/http_credentials"
--http_heartbeat_interval="30secs" --initialize_driver_logging="true" --isolation="posix/cpu,posix/mem"
--launcher="posix" --launcher_dir="/mesos/mesos-1.4.0/_build/src" --logbufsecs="0" --logging_level="INFO"
--max_completed_executors_per_framework="150" --oversubscribed_resources_interval="15secs"
--perf_duration="10secs" --perf_interval="1mins" --port="5051" --qos_correction_interval_min="0ns"
--quiet="false" --recover="reconnect" --recovery_timeout="15mins" --registration_backoff_factor="10ms"
--resources="cpus:2;gpus:0;mem:1024;disk:1024;ports:[31000-32000]" --revocable_cpu_low_priority="true"
--runtime_dir="/tmp/Endpoint_SlaveEndpointTest_UnauthorizedRequest_2_QFrI0Z" --sandbox_directory="/mnt/mesos/sandbox"
--strict="true" --switch_user="true" --systemd_enable_support="true" --systemd_runtime_directory="/run/systemd/system"
--version="false" --work_dir="/tmp/Endpoint_SlaveEndpointTest_UnauthorizedRequest_2_9XD7WD"
I0529 13:41:10.561153  4685 credentials.hpp:86] Loading credential for authentication from
'/tmp/Endpoint_SlaveEndpointTest_UnauthorizedRequest_2_QFrI0Z/credential'
I0529 13:41:10.561357  4685 slave.cpp:265] Agent using credential for: test-principal
I0529 13:41:10.561388  4685 credentials.hpp:37] Loading credentials for authentication from
'/tmp/Endpoint_SlaveEndpointTest_UnauthorizedRequest_2_QFrI0Z/http_credentials'
I0529 13:41:10.561749  4685 http.cpp:975] Creating default 'basic' HTTP authenticator for
realm 'mesos-agent-readonly'
I0529 13:41:10.561945  4685 http.cpp:975] Creating default 'basic' HTTP authenticator for
realm 'mesos-agent-readwrite'
I0529 13:41:10.563418  4685 slave.cpp:536] Agent resources: cpus(*):2; mem(*):1024; disk(*):1024;
ports(*):[31000-32000]
I0529 13:41:10.563508  4685 slave.cpp:544] Agent attributes: [  ]
I0529 13:41:10.563524  4685 slave.cpp:549] Agent hostname: 82d5d3ca8ae5
I0529 13:41:10.563675  4680 status_update_manager.cpp:177] Pausing sending status updates
I0529 13:41:10.565066  4686 state.cpp:62] Recovering state from '/tmp/Endpoint_SlaveEndpointTest_UnauthorizedRequest_2_9XD7WD/meta'
I0529 13:41:10.565364  4681 status_update_manager.cpp:203] Recovering status update manager
I0529 13:41:10.565623  4676 containerizer.cpp:582] Recovering containerizer
I0529 13:41:10.567497  4690 provisioner.cpp:416] Provisioner recovery complete
I0529 13:41:10.567909  4677 slave.cpp:6083] Finished recovery
I0529 13:41:10.568501  4677 slave.cpp:6265] Querying resource estimator for oversubscribable
resources
I0529 13:41:10.568739  4678 slave.cpp:6279] Received oversubscribable resources {} from the
resource estimator
I0529 13:41:10.571521  4677 process.cpp:3730] Handling HTTP event for process 'slave(754)'
with path: '/slave(754)/containers'
I0529 13:41:10.572835  4679 http.cpp:1115] HTTP GET for /slave(754)/containers from 172.17.0.3:42837
I0529 13:41:10.572924  4679 http.cpp:936] Authorizing principal 'test-principal' to GET the
'/containers' endpoint
I0529 13:41:10.575520  4676 slave.cpp:801] Agent terminating
[       OK ] Endpoint/SlaveEndpointTest.UnauthorizedRequest/2 (31 ms)
[ RUN      ] Endpoint/SlaveEndpointTest.NoAuthorizer/0
I0529 13:41:10.587394  4657 containerizer.cpp:230] Using isolation: posix/cpu,posix/mem,filesystem/posix,network/cni,environment_secret
W0529 13:41:10.588042  4657 backend.cpp:76] Failed to create 'aufs' backend: AufsBackend requires
root privileges
W0529 13:41:10.588165  4657 backend.cpp:76] Failed to create 'bind' backend: BindBackend requires
root privileges
I0529 13:41:10.588219  4657 provisioner.cpp:255] Using default backend 'copy'
I0529 13:41:10.590358  4657 cluster.cpp:448] Creating default 'local' authorizer
I0529 13:41:10.591847  4687 slave.cpp:232] Mesos agent started on (755)@172.17.0.3:52797
I0529 13:41:10.591873  4687 slave.cpp:233] Flags at startup: --acls="" --appc_simple_discovery_uri_prefix="http://"
--appc_store_dir="/tmp/mesos/store/appc" --authenticate_http_readonly="true" --authenticate_http_readwrite="true"
--authenticatee="crammd5" --authentication_backoff_factor="1secs" --authorizer="local" --cgroups_cpu_enable_pids_and_tids_count="false"
--cgroups_enable_cfs="false" --cgroups_hierarchy="/sys/fs/cgroup" --cgroups_limit_swap="false"
--cgroups_root="mesos" --container_disk_watch_interval="15secs" --containerizers="mesos" --credential="/tmp/Endpoint_SlaveEndpointTest_NoAuthorizer_0_gXy5vq/credential"
--default_role="*" --disk_watch_interval="1mins" --docker="docker" --docker_kill_orphans="true"
--docker_registry="https://registry-1.docker.io" --docker_remove_delay="6hrs" --docker_socket="/var/run/docker.sock"
--docker_stop_timeout="0ns" --docker_store_dir="/tmp/mesos/store/docker" --docker_volume_checkpoint_dir="/var/run/mesos/isolators/docker/volume"
--enforce_container_disk_quota="false" --executor_registration_timeout="1mins" --executor_reregistration_timeout="2secs"
--executor_shutdown_grace_period="5secs" --fetcher_cache_dir="/tmp/Endpoint_SlaveEndpointTest_NoAuthorizer_0_gXy5vq/fetch"
--fetcher_cache_size="2GB" --frameworks_home="" --gc_delay="1weeks" --gc_disk_headroom="0.1"
--hadoop_home="" --help="false" --hostname_lookup="true" --http_command_executor="false" --http_credentials="/tmp/Endpoint_SlaveEndpointTest_NoAuthorizer_0_gXy5vq/http_credentials"
--http_heartbeat_interval="30secs" --initialize_driver_logging="true" --isolation="posix/cpu,posix/mem"
--launcher="posix" --launcher_dir="/mesos/mesos-1.4.0/_build/src" --logbufsecs="0" --logging_level="INFO"
--max_completed_executors_per_framework="150" --oversubscribed_resources_interval="15secs"
--perf_duration="10secs" --perf_interval="1mins" --port="5051" --qos_correction_interval_min="0ns"
--quiet="false" --recover="reconnect" --recovery_timeout="15mins" --registration_backoff_factor="10ms"
--resources="cpus:2;gpus:0;mem:1024;disk:1024;ports:[31000-32000]" --revocable_cpu_low_priority="true"
--runtime_dir="/tmp/Endpoint_SlaveEndpointTest_NoAuthorizer_0_gXy5vq" --sandbox_directory="/mnt/mesos/sandbox"
--strict="true" --switch_user="true" --systemd_enable_support="true" --systemd_runtime_directory="/run/systemd/system"
--version="false" --work_dir="/tmp/Endpoint_SlaveEndpointTest_NoAuthorizer_0_lQJvn4"
I0529 13:41:10.592254  4687 credentials.hpp:86] Loading credential for authentication from
'/tmp/Endpoint_SlaveEndpointTest_NoAuthorizer_0_gXy5vq/credential'
I0529 13:41:10.592417  4687 slave.cpp:265] Agent using credential for: test-principal
I0529 13:41:10.592439  4687 credentials.hpp:37] Loading credentials for authentication from
'/tmp/Endpoint_SlaveEndpointTest_NoAuthorizer_0_gXy5vq/http_credentials'
I0529 13:41:10.592670  4687 http.cpp:975] Creating default 'basic' HTTP authenticator for
realm 'mesos-agent-readonly'
I0529 13:41:10.592852  4687 http.cpp:975] Creating default 'basic' HTTP authenticator for
realm 'mesos-agent-readwrite'
I0529 13:41:10.594010  4687 slave.cpp:536] Agent resources: cpus(*):2; mem(*):1024; disk(*):1024;
ports(*):[31000-32000]
I0529 13:41:10.594080  4687 slave.cpp:544] Agent attributes: [  ]
I0529 13:41:10.594092  4687 slave.cpp:549] Agent hostname: 82d5d3ca8ae5
I0529 13:41:10.594264  4688 status_update_manager.cpp:177] Pausing sending status updates
I0529 13:41:10.595418  4691 state.cpp:62] Recovering state from '/tmp/Endpoint_SlaveEndpointTest_NoAuthorizer_0_lQJvn4/meta'
I0529 13:41:10.595790  4684 status_update_manager.cpp:203] Recovering status update manager
I0529 13:41:10.595980  4682 containerizer.cpp:582] Recovering containerizer
I0529 13:41:10.597311  4689 provisioner.cpp:416] Provisioner recovery complete
I0529 13:41:10.597673  4677 slave.cpp:6083] Finished recovery
I0529 13:41:10.598191  4677 slave.cpp:6265] Querying resource estimator for oversubscribable
resources
I0529 13:41:10.598440  4686 slave.cpp:6279] Received oversubscribable resources {} from the
resource estimator
I0529 13:41:10.601099  4683 process.cpp:3730] Handling HTTP event for process 'slave(755)'
with path: '/slave(755)/monitor/statistics'
I0529 13:41:10.602649  4677 http.cpp:1115] HTTP GET for /slave(755)/monitor/statistics from
172.17.0.3:42839
I0529 13:41:10.602728  4677 http.cpp:936] Authorizing principal 'test-principal' to GET the
'/monitor/statistics' endpoint
I0529 13:41:10.606992  4678 slave.cpp:801] Agent terminating
[       OK ] Endpoint/SlaveEndpointTest.NoAuthorizer/0 (32 ms)
[ RUN      ] Endpoint/SlaveEndpointTest.NoAuthorizer/1
I0529 13:41:10.618680  4657 containerizer.cpp:230] Using isolation: posix/cpu,posix/mem,filesystem/posix,network/cni,environment_secret
W0529 13:41:10.619163  4657 backend.cpp:76] Failed to create 'aufs' backend: AufsBackend requires
root privileges
W0529 13:41:10.619268  4657 backend.cpp:76] Failed to create 'bind' backend: BindBackend requires
root privileges
I0529 13:41:10.619303  4657 provisioner.cpp:255] Using default backend 'copy'
I0529 13:41:10.621007  4657 cluster.cpp:448] Creating default 'local' authorizer
I0529 13:41:10.622493  4684 slave.cpp:232] Mesos agent started on (756)@172.17.0.3:52797
I0529 13:41:10.622517  4684 slave.cpp:233] Flags at startup: --acls="" --appc_simple_discovery_uri_prefix="http://"
--appc_store_dir="/tmp/mesos/store/appc" --authenticate_http_readonly="true" --authenticate_http_readwrite="true"
--authenticatee="crammd5" --authentication_backoff_factor="1secs" --authorizer="local" --cgroups_cpu_enable_pids_and_tids_count="false"
--cgroups_enable_cfs="false" --cgroups_hierarchy="/sys/fs/cgroup" --cgroups_limit_swap="false"
--cgroups_root="mesos" --container_disk_watch_interval="15secs" --containerizers="mesos" --credential="/tmp/Endpoint_SlaveEndpointTest_NoAuthorizer_1_SWFTlR/credential"
--default_role="*" --disk_watch_interval="1mins" --docker="docker" --docker_kill_orphans="true"
--docker_registry="https://registry-1.docker.io" --docker_remove_delay="6hrs" --docker_socket="/var/run/docker.sock"
--docker_stop_timeout="0ns" --docker_store_dir="/tmp/mesos/store/docker" --docker_volume_checkpoint_dir="/var/run/mesos/isolators/docker/volume"
--enforce_container_disk_quota="false" --executor_registration_timeout="1mins" --executor_reregistration_timeout="2secs"
--executor_shutdown_grace_period="5secs" --fetcher_cache_dir="/tmp/Endpoint_SlaveEndpointTest_NoAuthorizer_1_SWFTlR/fetch"
--fetcher_cache_size="2GB" --frameworks_home="" --gc_delay="1weeks" --gc_disk_headroom="0.1"
--hadoop_home="" --help="false" --hostname_lookup="true" --http_command_executor="false" --http_credentials="/tmp/Endpoint_SlaveEndpointTest_NoAuthorizer_1_SWFTlR/http_credentials"
--http_heartbeat_interval="30secs" --initialize_driver_logging="true" --isolation="posix/cpu,posix/mem"
--launcher="posix" --launcher_dir="/mesos/mesos-1.4.0/_build/src" --logbufsecs="0" --logging_level="INFO"
--max_completed_executors_per_framework="150" --oversubscribed_resources_interval="15secs"
--perf_duration="10secs" --perf_interval="1mins" --port="5051" --qos_correction_interval_min="0ns"
--quiet="false" --recover="reconnect" --recovery_timeout="15mins" --registration_backoff_factor="10ms"
--resources="cpus:2;gpus:0;mem:1024;disk:1024;ports:[31000-32000]" --revocable_cpu_low_priority="true"
--runtime_dir="/tmp/Endpoint_SlaveEndpointTest_NoAuthorizer_1_SWFTlR" --sandbox_directory="/mnt/mesos/sandbox"
--strict="true" --switch_user="true" --systemd_enable_support="true" --systemd_runtime_directory="/run/systemd/system"
--version="false" --work_dir="/tmp/Endpoint_SlaveEndpointTest_NoAuthorizer_1_P4377u"
I0529 13:41:10.623077  4684 credentials.hpp:86] Loading credential for authentication from
'/tmp/Endpoint_SlaveEndpointTest_NoAuthorizer_1_SWFTlR/credential'
I0529 13:41:10.623272  4684 slave.cpp:265] Agent using credential for: test-principal
I0529 13:41:10.623296  4684 credentials.hpp:37] Loading credentials for authentication from
'/tmp/Endpoint_SlaveEndpointTest_NoAuthorizer_1_SWFTlR/http_credentials'
I0529 13:41:10.623601  4684 http.cpp:975] Creating default 'basic' HTTP authenticator for
realm 'mesos-agent-readonly'
I0529 13:41:10.623777  4684 http.cpp:975] Creating default 'basic' HTTP authenticator for
realm 'mesos-agent-readwrite'
I0529 13:41:10.624939  4684 slave.cpp:536] Agent resources: cpus(*):2; mem(*):1024; disk(*):1024;
ports(*):[31000-32000]
I0529 13:41:10.625006  4684 slave.cpp:544] Agent attributes: [  ]
I0529 13:41:10.625020  4684 slave.cpp:549] Agent hostname: 82d5d3ca8ae5
I0529 13:41:10.625147  4691 status_update_manager.cpp:177] Pausing sending status updates
I0529 13:41:10.626464  4681 state.cpp:62] Recovering state from '/tmp/Endpoint_SlaveEndpointTest_NoAuthorizer_1_P4377u/meta'
I0529 13:41:10.626788  4684 status_update_manager.cpp:203] Recovering status update manager
I0529 13:41:10.627066  4688 containerizer.cpp:582] Recovering containerizer
I0529 13:41:10.628775  4677 provisioner.cpp:416] Provisioner recovery complete
I0529 13:41:10.629216  4682 slave.cpp:6083] Finished recovery
I0529 13:41:10.629854  4682 slave.cpp:6265] Querying resource estimator for oversubscribable
resources
I0529 13:41:10.630178  4688 slave.cpp:6279] Received oversubscribable resources {} from the
resource estimator
I0529 13:41:10.640972  4682 process.cpp:3730] Handling HTTP event for process 'slave(756)'
with path: '/slave(756)/monitor/statistics.json'
I0529 13:41:10.642482  4691 http.cpp:1115] HTTP GET for /slave(756)/monitor/statistics.json
from 172.17.0.3:42841
I0529 13:41:10.642586  4691 http.cpp:936] Authorizing principal 'test-principal' to GET the
'/monitor/statistics.json' endpoint
I0529 13:41:10.646514  4680 slave.cpp:801] Agent terminating
[       OK ] Endpoint/SlaveEndpointTest.NoAuthorizer/1 (39 ms)
[ RUN      ] Endpoint/SlaveEndpointTest.NoAuthorizer/2
I0529 13:41:10.657346  4657 containerizer.cpp:230] Using isolation: posix/cpu,posix/mem,filesystem/posix,network/cni,environment_secret
W0529 13:41:10.657881  4657 backend.cpp:76] Failed to create 'aufs' backend: AufsBackend requires
root privileges
W0529 13:41:10.657991  4657 backend.cpp:76] Failed to create 'bind' backend: BindBackend requires
root privileges
I0529 13:41:10.658032  4657 provisioner.cpp:255] Using default backend 'copy'
I0529 13:41:10.659912  4657 cluster.cpp:448] Creating default 'local' authorizer
I0529 13:41:10.661708  4690 slave.cpp:232] Mesos agent started on (757)@172.17.0.3:52797
I0529 13:41:10.661751  4690 slave.cpp:233] Flags at startup: --acls="" --appc_simple_discovery_uri_prefix="http://"
--appc_store_dir="/tmp/mesos/store/appc" --authenticate_http_readonly="true" --authenticate_http_readwrite="true"
--authenticatee="crammd5" --authentication_backoff_factor="1secs" --authorizer="local" --cgroups_cpu_enable_pids_and_tids_count="false"
--cgroups_enable_cfs="false" --cgroups_hierarchy="/sys/fs/cgroup" --cgroups_limit_swap="false"
--cgroups_root="mesos" --container_disk_watch_interval="15secs" --containerizers="mesos" --credential="/tmp/Endpoint_SlaveEndpointTest_NoAuthorizer_2_wAtFzi/credential"
--default_role="*" --disk_watch_interval="1mins" --docker="docker" --docker_kill_orphans="true"
--docker_registry="https://registry-1.docker.io" --docker_remove_delay="6hrs" --docker_socket="/var/run/docker.sock"
--docker_stop_timeout="0ns" --docker_store_dir="/tmp/mesos/store/docker" --docker_volume_checkpoint_dir="/var/run/mesos/isolators/docker/volume"
--enforce_container_disk_quota="false" --executor_registration_timeout="1mins" --executor_reregistration_timeout="2secs"
--executor_shutdown_grace_period="5secs" --fetcher_cache_dir="/tmp/Endpoint_SlaveEndpointTest_NoAuthorizer_2_wAtFzi/fetch"
--fetcher_cache_size="2GB" --frameworks_home="" --gc_delay="1weeks" --gc_disk_headroom="0.1"
--hadoop_home="" --help="false" --hostname_lookup="true" --http_command_executor="false" --http_credentials="/tmp/Endpoint_SlaveEndpointTest_NoAuthorizer_2_wAtFzi/http_credentials"
--http_heartbeat_interval="30secs" --initialize_driver_logging="true" --isolation="posix/cpu,posix/mem"
--launcher="posix" --launcher_dir="/mesos/mesos-1.4.0/_build/src" --logbufsecs="0" --logging_level="INFO"
--max_completed_executors_per_framework="150" --oversubscribed_resources_interval="15secs"
--perf_duration="10secs" --perf_interval="1mins" --port="5051" --qos_correction_interval_min="0ns"
--quiet="false" --recover="reconnect" --recovery_timeout="15mins" --registration_backoff_factor="10ms"
--resources="cpus:2;gpus:0;mem:1024;disk:1024;ports:[31000-32000]" --revocable_cpu_low_priority="true"
--runtime_dir="/tmp/Endpoint_SlaveEndpointTest_NoAuthorizer_2_wAtFzi" --sandbox_directory="/mnt/mesos/sandbox"
--strict="true" --switch_user="true" --systemd_enable_support="true" --systemd_runtime_directory="/run/systemd/system"
--version="false" --work_dir="/tmp/Endpoint_SlaveEndpointTest_NoAuthorizer_2_3XwCfW"
I0529 13:41:10.662600  4690 credentials.hpp:86] Loading credential for authentication from
'/tmp/Endpoint_SlaveEndpointTest_NoAuthorizer_2_wAtFzi/credential'
I0529 13:41:10.662885  4690 slave.cpp:265] Agent using credential for: test-principal
I0529 13:41:10.662919  4690 credentials.hpp:37] Loading credentials for authentication from
'/tmp/Endpoint_SlaveEndpointTest_NoAuthorizer_2_wAtFzi/http_credentials'
I0529 13:41:10.663355  4690 http.cpp:975] Creating default 'basic' HTTP authenticator for
realm 'mesos-agent-readonly'
I0529 13:41:10.663576  4690 http.cpp:975] Creating default 'basic' HTTP authenticator for
realm 'mesos-agent-readwrite'
I0529 13:41:10.664997  4690 slave.cpp:536] Agent resources: cpus(*):2; mem(*):1024; disk(*):1024;
ports(*):[31000-32000]
I0529 13:41:10.665066  4690 slave.cpp:544] Agent attributes: [  ]
I0529 13:41:10.665077  4690 slave.cpp:549] Agent hostname: 82d5d3ca8ae5
I0529 13:41:10.665230  4677 status_update_manager.cpp:177] Pausing sending status updates
I0529 13:41:10.666787  4676 state.cpp:62] Recovering state from '/tmp/Endpoint_SlaveEndpointTest_NoAuthorizer_2_3XwCfW/meta'
I0529 13:41:10.667276  4676 status_update_manager.cpp:203] Recovering status update manager
I0529 13:41:10.667533  4679 containerizer.cpp:582] Recovering containerizer
I0529 13:41:10.669296  4677 provisioner.cpp:416] Provisioner recovery complete
I0529 13:41:10.669761  4679 slave.cpp:6083] Finished recovery
I0529 13:41:10.670368  4679 slave.cpp:6265] Querying resource estimator for oversubscribable
resources
I0529 13:41:10.670624  4685 slave.cpp:6279] Received oversubscribable resources {} from the
resource estimator
I0529 13:41:10.673395  4683 process.cpp:3730] Handling HTTP event for process 'slave(757)'
with path: '/slave(757)/containers'
I0529 13:41:10.675083  4687 http.cpp:1115] HTTP GET for /slave(757)/containers from 172.17.0.3:42843
I0529 13:41:10.675178  4687 http.cpp:936] Authorizing principal 'test-principal' to GET the
'/containers' endpoint
I0529 13:41:10.679544  4678 slave.cpp:801] Agent terminating
[       OK ] Endpoint/SlaveEndpointTest.NoAuthorizer/2 (33 ms)
[----------] 9 tests from Endpoint/SlaveEndpointTest (304 ms total)

[----------] Global test environment tear-down
[==========] 1583 tests from 176 test cases ran. (453832 ms total)
[  PASSED  ] 1582 tests.
[  FAILED  ] 1 test, listed below:
[  FAILED  ] ExamplesTest.PythonFramework

 1 FAILED TEST
  YOU HAVE 22 DISABLED TESTS

E0529 13:41:10.748679  4692 process.cpp:950] Failed to accept socket: future discarded
make[4]: *** [check-local] Error 1
make[4]: Leaving directory `/mesos/mesos-1.4.0/_build/src'
make[3]: *** [check-am] Error 2
make[3]: Leaving directory `/mesos/mesos-1.4.0/_build/src'
make[2]: *** [check] Error 2
make[2]: Leaving directory `/mesos/mesos-1.4.0/_build/src'
make[1]: *** [check-recursive] Error 1
make[1]: Leaving directory `/mesos/mesos-1.4.0/_build'
make: *** [distcheck] Error 1
+ docker rmi mesos-1496062057-26317
Untagged: mesos-1496062057-26317:latest
Deleted: sha256:904e54e2057df308ea28e34151f7872af2a351a45186289b1235d7b8922fe25f
Deleted: sha256:dc67fc17413e60fe9d08925b2fb7102e9b7a52991f6e5afceae6cb95e8482e7c
Deleted: sha256:6228835dace01e352d3e1b13379d15285713fe358f1944bb200591e1e08d9460
Deleted: sha256:b5031b5add4e269ce48938c902255c985507c88abddbd45085896814d8fe130f
Deleted: sha256:d3743a360b482018e89e5adcd485ef8b93c553a4ffb3e25864bfba8963ac7e53
Deleted: sha256:b281d3b68379b33384c1b9dc5dd20773e2f096504f014c2a6ac40813eb3046c3
Deleted: sha256:f53e4b817ee1e906c5414a2b6543e7bc3cc4d9bfa882c9a0d27ed2435caf75d4
Deleted: sha256:f7859accd9c1ee67ab1c0e3f0763b98d0b507f441b854c3192c067061b18f310
Deleted: sha256:f0d099c94ca562bc7c8cc245cef366caf1608633cb517f88ed2a466d4feed5c2
Deleted: sha256:5a3fc4652df4ea37e627f0b05a810192f259efea54136b4f8ecb607e1085fec8
Deleted: sha256:c25bfed0736954c411d21fe6607dd185d7fae76099e2c05a759bff03a942e76d
Deleted: sha256:c0fe7a37cdfddb60025b6a9369b006c9ccf6f76607e74c9843c63367be112f9a
Deleted: sha256:60b3a473d57183c5ce7256f56786d5018583e8303076c16f3a606e27f3646a9d
Deleted: sha256:2d0b75709a3049d2410d5f1bcd5713f1ceba1db1a2595754e9f5ab6adde0c148
Deleted: sha256:f02142e24f9151cba7da9dab112a954c3cb1c393faa3c7eb8e3498b9e39a5d60
Deleted: sha256:e1eb4b019c4a79b7591b563d98df1cf43f021881fc84c20c24594ccf0fb87691
Deleted: sha256:82e0a69882ea8bb17e43802adc7dd6736feb359f702ea8abf2a7ddf31036febf
Deleted: sha256:35c608a3b63de6bd1f942fee3619336c2e46cd7ad6e202056217be69ed2f10e4
Deleted: sha256:dfe1da74b69a39c75777b8724a8a24e747f33fcbd748ecb65579560235a2e2f6
Deleted: sha256:7b60214f04ce6efb4194ea766809393c7887223ced9153b5c067ee0cce543b6c
Deleted: sha256:f591c77d7cc556bc1dbefb2df95addb281d7da77ad17519e2ae07cdbe52c21ab
Deleted: sha256:9d88eae30279281afe3c380a1ddaa60a818209f2f5b07490df902118316b3af0
Deleted: sha256:46c037cb9d703d06a2140b62529879b8a4734e86fc46723e9ad005c2beb8f5a3
Deleted: sha256:0c2449904e31f0334a5dc3229c50a59e3912748473883db5e135b4c71ee9ecf2
Build step 'Execute shell' marked build as failure
Not sending mail to unregistered user neil.conway@gmail.com

Mime
View raw message