mesos-builds mailing list archives

Site index · List index
Message view « Date » · « Thread »
Top « Date » · « Thread »
From Apache Jenkins Server <jenk...@builds.apache.org>
Subject Build failed in Jenkins: Mesos-Buildbot » cmake,gcc,--verbose,GLOG_v=1 MESOS_VERBOSE=1,ubuntu:14.04,(docker||Hadoop)&&(!ubuntu-us1)&&(!ubuntu-eu2) #3639
Date Tue, 09 May 2017 19:27:53 GMT
See <https://builds.apache.org/job/Mesos-Buildbot/BUILDTOOL=cmake,COMPILER=gcc,CONFIGURATION=--verbose,ENVIRONMENT=GLOG_v=1%20MESOS_VERBOSE=1,OS=ubuntu%3A14.04,label_exp=(docker%7C%7CHadoop)&&(!ubuntu-us1)&&(!ubuntu-eu2)/3639/display/redirect?page=changes>

Changes:

[neil.conway] Fixed flakiness in agent registration validation tests.

------------------------------------------
[...truncated 25.07 MB...]
I0509 19:27:12.264344 25391 http.cpp:936] Authorizing principal 'test-principal' to GET the
'/monitor/statistics.json' endpoint
I0509 19:27:12.265774 25395 slave.cpp:790] Agent terminating
[       OK ] Endpoint/SlaveEndpointTest.AuthorizedRequest/1 (13 ms)
[ RUN      ] Endpoint/SlaveEndpointTest.AuthorizedRequest/2
I0509 19:27:12.272044 25388 containerizer.cpp:221] Using isolation: posix/cpu,posix/mem,filesystem/posix,network/cni
W0509 19:27:12.272402 25388 backend.cpp:76] Failed to create 'aufs' backend: AufsBackend requires
root privileges
W0509 19:27:12.272445 25388 backend.cpp:76] Failed to create 'bind' backend: BindBackend requires
root privileges
I0509 19:27:12.272459 25388 provisioner.cpp:249] Using default backend 'copy'
I0509 19:27:12.273905 25400 slave.cpp:225] Mesos agent started on (744)@172.17.0.3:55396
I0509 19:27:12.273928 25400 slave.cpp:226] Flags at startup: --acls="" --appc_simple_discovery_uri_prefix="http://"
--appc_store_dir="/tmp/mesos/store/appc" --authenticate_http_readonly="true" --authenticate_http_readwrite="true"
--authenticatee="crammd5" --authentication_backoff_factor="1secs" --authorizer="local" --cgroups_cpu_enable_pids_and_tids_count="false"
--cgroups_enable_cfs="false" --cgroups_hierarchy="/sys/fs/cgroup" --cgroups_limit_swap="false"
--cgroups_root="mesos" --container_disk_watch_interval="15secs" --containerizers="mesos" --credential="/tmp/Endpoint_SlaveEndpointTest_AuthorizedRequest_2_6ZDYNN/credential"
--default_role="*" --disk_watch_interval="1mins" --docker="docker" --docker_kill_orphans="true"
--docker_registry="https://registry-1.docker.io" --docker_remove_delay="6hrs" --docker_socket="/var/run/docker.sock"
--docker_stop_timeout="0ns" --docker_store_dir="/tmp/mesos/store/docker" --docker_volume_checkpoint_dir="/var/run/mesos/isolators/docker/volume"
--enforce_container_disk_quota="false" --executor_registration_timeout="1mins" --executor_shutdown_grace_period="5secs"
--fetcher_cache_dir="/tmp/Endpoint_SlaveEndpointTest_AuthorizedRequest_2_6ZDYNN/fetch" --fetcher_cache_size="2GB"
--frameworks_home="" --gc_delay="1weeks" --gc_disk_headroom="0.1" --hadoop_home="" --help="false"
--hostname_lookup="true" --http_command_executor="false" --http_credentials="/tmp/Endpoint_SlaveEndpointTest_AuthorizedRequest_2_6ZDYNN/http_credentials"
--http_heartbeat_interval="30secs" --initialize_driver_logging="true" --isolation="posix/cpu,posix/mem"
--launcher="posix" --launcher_dir="/mesos/build/src" --logbufsecs="0" --logging_level="INFO"
--max_completed_executors_per_framework="150" --oversubscribed_resources_interval="15secs"
--perf_duration="10secs" --perf_interval="1mins" --port="5051" --qos_correction_interval_min="0ns"
--quiet="false" --recover="reconnect" --recovery_timeout="15mins" --registration_backoff_factor="10ms"
--resources="cpus:2;gpus:0;mem:1024;disk:1024;ports:[31000-32000]" --revocable_cpu_low_priority="true"
--runtime_dir="/tmp/Endpoint_SlaveEndpointTest_AuthorizedRequest_2_6ZDYNN" --sandbox_directory="/mnt/mesos/sandbox"
--strict="true" --switch_user="true" --systemd_enable_support="true" --systemd_runtime_directory="/run/systemd/system"
--version="false" --work_dir="/tmp/Endpoint_SlaveEndpointTest_AuthorizedRequest_2_IFiBry"
I0509 19:27:12.274224 25400 credentials.hpp:86] Loading credential for authentication from
'/tmp/Endpoint_SlaveEndpointTest_AuthorizedRequest_2_6ZDYNN/credential'
I0509 19:27:12.274317 25400 slave.cpp:258] Agent using credential for: test-principal
I0509 19:27:12.274332 25400 credentials.hpp:37] Loading credentials for authentication from
'/tmp/Endpoint_SlaveEndpointTest_AuthorizedRequest_2_6ZDYNN/http_credentials'
I0509 19:27:12.274452 25400 http.cpp:975] Creating default 'basic' HTTP authenticator for
realm 'mesos-agent-readonly'
I0509 19:27:12.274514 25400 http.cpp:975] Creating default 'basic' HTTP authenticator for
realm 'mesos-agent-readwrite'
I0509 19:27:12.275130 25400 slave.cpp:525] Agent resources: cpus(*):2; mem(*):1024; disk(*):1024;
ports(*):[31000-32000]
I0509 19:27:12.275171 25400 slave.cpp:533] Agent attributes: [  ]
I0509 19:27:12.275179 25400 slave.cpp:538] Agent hostname: 287312d2934c
I0509 19:27:12.275328 25390 status_update_manager.cpp:177] Pausing sending status updates
I0509 19:27:12.275645 25389 state.cpp:62] Recovering state from '/tmp/Endpoint_SlaveEndpointTest_AuthorizedRequest_2_IFiBry/meta'
I0509 19:27:12.275887 25399 status_update_manager.cpp:203] Recovering status update manager
I0509 19:27:12.276048 25391 containerizer.cpp:608] Recovering containerizer
I0509 19:27:12.276734 25401 provisioner.cpp:410] Provisioner recovery complete
I0509 19:27:12.276903 25393 slave.cpp:5963] Finished recovery
I0509 19:27:12.277197 25393 slave.cpp:6145] Querying resource estimator for oversubscribable
resources
I0509 19:27:12.277315 25393 slave.cpp:6159] Received oversubscribable resources {} from the
resource estimator
I0509 19:27:12.277830 25399 process.cpp:3730] Handling HTTP event for process 'slave(744)'
with path: '/slave(744)/containers'
I0509 19:27:12.278327 25393 http.cpp:1115] HTTP GET for /slave(744)/containers from 172.17.0.3:43813
I0509 19:27:12.278425 25393 http.cpp:936] Authorizing principal 'test-principal' to GET the
'/containers' endpoint
I0509 19:27:12.280706 25393 slave.cpp:790] Agent terminating
[       OK ] Endpoint/SlaveEndpointTest.AuthorizedRequest/2 (14 ms)
[ RUN      ] Endpoint/SlaveEndpointTest.UnauthorizedRequest/0
I0509 19:27:12.286044 25388 containerizer.cpp:221] Using isolation: posix/cpu,posix/mem,filesystem/posix,network/cni
W0509 19:27:12.286360 25388 backend.cpp:76] Failed to create 'aufs' backend: AufsBackend requires
root privileges
W0509 19:27:12.286401 25388 backend.cpp:76] Failed to create 'bind' backend: BindBackend requires
root privileges
I0509 19:27:12.286415 25388 provisioner.cpp:249] Using default backend 'copy'
I0509 19:27:12.288154 25401 slave.cpp:225] Mesos agent started on (745)@172.17.0.3:55396
I0509 19:27:12.288175 25401 slave.cpp:226] Flags at startup: --acls="" --appc_simple_discovery_uri_prefix="http://"
--appc_store_dir="/tmp/mesos/store/appc" --authenticate_http_readonly="true" --authenticate_http_readwrite="true"
--authenticatee="crammd5" --authentication_backoff_factor="1secs" --authorizer="local" --cgroups_cpu_enable_pids_and_tids_count="false"
--cgroups_enable_cfs="false" --cgroups_hierarchy="/sys/fs/cgroup" --cgroups_limit_swap="false"
--cgroups_root="mesos" --container_disk_watch_interval="15secs" --containerizers="mesos" --credential="/tmp/Endpoint_SlaveEndpointTest_UnauthorizedRequest_0_8k1cnN/credential"
--default_role="*" --disk_watch_interval="1mins" --docker="docker" --docker_kill_orphans="true"
--docker_registry="https://registry-1.docker.io" --docker_remove_delay="6hrs" --docker_socket="/var/run/docker.sock"
--docker_stop_timeout="0ns" --docker_store_dir="/tmp/mesos/store/docker" --docker_volume_checkpoint_dir="/var/run/mesos/isolators/docker/volume"
--enforce_container_disk_quota="false" --executor_registration_timeout="1mins" --executor_shutdown_grace_period="5secs"
--fetcher_cache_dir="/tmp/Endpoint_SlaveEndpointTest_UnauthorizedRequest_0_8k1cnN/fetch" --fetcher_cache_size="2GB"
--frameworks_home="" --gc_delay="1weeks" --gc_disk_headroom="0.1" --hadoop_home="" --help="false"
--hostname_lookup="true" --http_command_executor="false" --http_credentials="/tmp/Endpoint_SlaveEndpointTest_UnauthorizedRequest_0_8k1cnN/http_credentials"
--http_heartbeat_interval="30secs" --initialize_driver_logging="true" --isolation="posix/cpu,posix/mem"
--launcher="posix" --launcher_dir="/mesos/build/src" --logbufsecs="0" --logging_level="INFO"
--max_completed_executors_per_framework="150" --oversubscribed_resources_interval="15secs"
--perf_duration="10secs" --perf_interval="1mins" --port="5051" --qos_correction_interval_min="0ns"
--quiet="false" --recover="reconnect" --recovery_timeout="15mins" --registration_backoff_factor="10ms"
--resources="cpus:2;gpus:0;mem:1024;disk:1024;ports:[31000-32000]" --revocable_cpu_low_priority="true"
--runtime_dir="/tmp/Endpoint_SlaveEndpointTest_UnauthorizedRequest_0_8k1cnN" --sandbox_directory="/mnt/mesos/sandbox"
--strict="true" --switch_user="true" --systemd_enable_support="true" --systemd_runtime_directory="/run/systemd/system"
--version="false" --work_dir="/tmp/Endpoint_SlaveEndpointTest_UnauthorizedRequest_0_sv5xYx"
I0509 19:27:12.288415 25401 credentials.hpp:86] Loading credential for authentication from
'/tmp/Endpoint_SlaveEndpointTest_UnauthorizedRequest_0_8k1cnN/credential'
I0509 19:27:12.288506 25401 slave.cpp:258] Agent using credential for: test-principal
I0509 19:27:12.288522 25401 credentials.hpp:37] Loading credentials for authentication from
'/tmp/Endpoint_SlaveEndpointTest_UnauthorizedRequest_0_8k1cnN/http_credentials'
I0509 19:27:12.288601 25401 http.cpp:975] Creating default 'basic' HTTP authenticator for
realm 'mesos-agent-readonly'
I0509 19:27:12.288645 25401 http.cpp:975] Creating default 'basic' HTTP authenticator for
realm 'mesos-agent-readwrite'
I0509 19:27:12.288941 25401 slave.cpp:525] Agent resources: cpus(*):2; mem(*):1024; disk(*):1024;
ports(*):[31000-32000]
I0509 19:27:12.288969 25401 slave.cpp:533] Agent attributes: [  ]
I0509 19:27:12.288974 25401 slave.cpp:538] Agent hostname: 287312d2934c
I0509 19:27:12.289038 25402 status_update_manager.cpp:177] Pausing sending status updates
I0509 19:27:12.289234 25404 state.cpp:62] Recovering state from '/tmp/Endpoint_SlaveEndpointTest_UnauthorizedRequest_0_sv5xYx/meta'
I0509 19:27:12.289520 25391 status_update_manager.cpp:203] Recovering status update manager
I0509 19:27:12.289646 25401 containerizer.cpp:608] Recovering containerizer
I0509 19:27:12.290395 25394 provisioner.cpp:410] Provisioner recovery complete
I0509 19:27:12.290730 25392 slave.cpp:5963] Finished recovery
I0509 19:27:12.291086 25392 slave.cpp:6145] Querying resource estimator for oversubscribable
resources
I0509 19:27:12.291350 25389 slave.cpp:6159] Received oversubscribable resources {} from the
resource estimator
I0509 19:27:12.291934 25393 process.cpp:3730] Handling HTTP event for process 'slave(745)'
with path: '/slave(745)/monitor/statistics'
I0509 19:27:12.292528 25390 http.cpp:1115] HTTP GET for /slave(745)/monitor/statistics from
172.17.0.3:43814
I0509 19:27:12.292567 25390 http.cpp:936] Authorizing principal 'test-principal' to GET the
'/monitor/statistics' endpoint
I0509 19:27:12.293920 25400 slave.cpp:790] Agent terminating
[       OK ] Endpoint/SlaveEndpointTest.UnauthorizedRequest/0 (13 ms)
[ RUN      ] Endpoint/SlaveEndpointTest.UnauthorizedRequest/1
I0509 19:27:12.299589 25388 containerizer.cpp:221] Using isolation: posix/cpu,posix/mem,filesystem/posix,network/cni
W0509 19:27:12.299907 25388 backend.cpp:76] Failed to create 'aufs' backend: AufsBackend requires
root privileges
W0509 19:27:12.299948 25388 backend.cpp:76] Failed to create 'bind' backend: BindBackend requires
root privileges
I0509 19:27:12.299964 25388 provisioner.cpp:249] Using default backend 'copy'
I0509 19:27:12.301481 25404 slave.cpp:225] Mesos agent started on (746)@172.17.0.3:55396
I0509 19:27:12.301501 25404 slave.cpp:226] Flags at startup: --acls="" --appc_simple_discovery_uri_prefix="http://"
--appc_store_dir="/tmp/mesos/store/appc" --authenticate_http_readonly="true" --authenticate_http_readwrite="true"
--authenticatee="crammd5" --authentication_backoff_factor="1secs" --authorizer="local" --cgroups_cpu_enable_pids_and_tids_count="false"
--cgroups_enable_cfs="false" --cgroups_hierarchy="/sys/fs/cgroup" --cgroups_limit_swap="false"
--cgroups_root="mesos" --container_disk_watch_interval="15secs" --containerizers="mesos" --credential="/tmp/Endpoint_SlaveEndpointTest_UnauthorizedRequest_1_g4Bg5M/credential"
--default_role="*" --disk_watch_interval="1mins" --docker="docker" --docker_kill_orphans="true"
--docker_registry="https://registry-1.docker.io" --docker_remove_delay="6hrs" --docker_socket="/var/run/docker.sock"
--docker_stop_timeout="0ns" --docker_store_dir="/tmp/mesos/store/docker" --docker_volume_checkpoint_dir="/var/run/mesos/isolators/docker/volume"
--enforce_container_disk_quota="false" --executor_registration_timeout="1mins" --executor_shutdown_grace_period="5secs"
--fetcher_cache_dir="/tmp/Endpoint_SlaveEndpointTest_UnauthorizedRequest_1_g4Bg5M/fetch" --fetcher_cache_size="2GB"
--frameworks_home="" --gc_delay="1weeks" --gc_disk_headroom="0.1" --hadoop_home="" --help="false"
--hostname_lookup="true" --http_command_executor="false" --http_credentials="/tmp/Endpoint_SlaveEndpointTest_UnauthorizedRequest_1_g4Bg5M/http_credentials"
--http_heartbeat_interval="30secs" --initialize_driver_logging="true" --isolation="posix/cpu,posix/mem"
--launcher="posix" --launcher_dir="/mesos/build/src" --logbufsecs="0" --logging_level="INFO"
--max_completed_executors_per_framework="150" --oversubscribed_resources_interval="15secs"
--perf_duration="10secs" --perf_interval="1mins" --port="5051" --qos_correction_interval_min="0ns"
--quiet="false" --recover="reconnect" --recovery_timeout="15mins" --registration_backoff_factor="10ms"
--resources="cpus:2;gpus:0;mem:1024;disk:1024;ports:[31000-32000]" --revocable_cpu_low_priority="true"
--runtime_dir="/tmp/Endpoint_SlaveEndpointTest_UnauthorizedRequest_1_g4Bg5M" --sandbox_directory="/mnt/mesos/sandbox"
--strict="true" --switch_user="true" --systemd_enable_support="true" --systemd_runtime_directory="/run/systemd/system"
--version="false" --work_dir="/tmp/Endpoint_SlaveEndpointTest_UnauthorizedRequest_1_CyHpEx"
I0509 19:27:12.301758 25404 credentials.hpp:86] Loading credential for authentication from
'/tmp/Endpoint_SlaveEndpointTest_UnauthorizedRequest_1_g4Bg5M/credential'
I0509 19:27:12.301852 25404 slave.cpp:258] Agent using credential for: test-principal
I0509 19:27:12.301869 25404 credentials.hpp:37] Loading credentials for authentication from
'/tmp/Endpoint_SlaveEndpointTest_UnauthorizedRequest_1_g4Bg5M/http_credentials'
I0509 19:27:12.301990 25404 http.cpp:975] Creating default 'basic' HTTP authenticator for
realm 'mesos-agent-readonly'
I0509 19:27:12.302054 25404 http.cpp:975] Creating default 'basic' HTTP authenticator for
realm 'mesos-agent-readwrite'
I0509 19:27:12.302502 25404 slave.cpp:525] Agent resources: cpus(*):2; mem(*):1024; disk(*):1024;
ports(*):[31000-32000]
I0509 19:27:12.302542 25404 slave.cpp:533] Agent attributes: [  ]
I0509 19:27:12.302552 25404 slave.cpp:538] Agent hostname: 287312d2934c
I0509 19:27:12.302672 25401 status_update_manager.cpp:177] Pausing sending status updates
I0509 19:27:12.302980 25391 state.cpp:62] Recovering state from '/tmp/Endpoint_SlaveEndpointTest_UnauthorizedRequest_1_CyHpEx/meta'
I0509 19:27:12.303261 25397 status_update_manager.cpp:203] Recovering status update manager
I0509 19:27:12.303390 25394 containerizer.cpp:608] Recovering containerizer
I0509 19:27:12.303999 25399 provisioner.cpp:410] Provisioner recovery complete
I0509 19:27:12.304155 25397 slave.cpp:5963] Finished recovery
I0509 19:27:12.304556 25397 slave.cpp:6145] Querying resource estimator for oversubscribable
resources
I0509 19:27:12.304724 25404 slave.cpp:6159] Received oversubscribable resources {} from the
resource estimator
I0509 19:27:12.305516 25394 process.cpp:3730] Handling HTTP event for process 'slave(746)'
with path: '/slave(746)/monitor/statistics.json'
I0509 19:27:12.305991 25397 http.cpp:1115] HTTP GET for /slave(746)/monitor/statistics.json
from 172.17.0.3:43815
I0509 19:27:12.306041 25397 http.cpp:936] Authorizing principal 'test-principal' to GET the
'/monitor/statistics.json' endpoint
I0509 19:27:12.307117 25390 slave.cpp:790] Agent terminating
[       OK ] Endpoint/SlaveEndpointTest.UnauthorizedRequest/1 (12 ms)
[ RUN      ] Endpoint/SlaveEndpointTest.UnauthorizedRequest/2
I0509 19:27:12.311787 25388 containerizer.cpp:221] Using isolation: posix/cpu,posix/mem,filesystem/posix,network/cni
W0509 19:27:12.312106 25388 backend.cpp:76] Failed to create 'aufs' backend: AufsBackend requires
root privileges
W0509 19:27:12.312150 25388 backend.cpp:76] Failed to create 'bind' backend: BindBackend requires
root privileges
I0509 19:27:12.312171 25388 provisioner.cpp:249] Using default backend 'copy'
I0509 19:27:12.313272 25399 slave.cpp:225] Mesos agent started on (747)@172.17.0.3:55396
I0509 19:27:12.313324 25399 slave.cpp:226] Flags at startup: --acls="" --appc_simple_discovery_uri_prefix="http://"
--appc_store_dir="/tmp/mesos/store/appc" --authenticate_http_readonly="true" --authenticate_http_readwrite="true"
--authenticatee="crammd5" --authentication_backoff_factor="1secs" --authorizer="local" --cgroups_cpu_enable_pids_and_tids_count="false"
--cgroups_enable_cfs="false" --cgroups_hierarchy="/sys/fs/cgroup" --cgroups_limit_swap="false"
--cgroups_root="mesos" --container_disk_watch_interval="15secs" --containerizers="mesos" --credential="/tmp/Endpoint_SlaveEndpointTest_UnauthorizedRequest_2_EPREVM/credential"
--default_role="*" --disk_watch_interval="1mins" --docker="docker" --docker_kill_orphans="true"
--docker_registry="https://registry-1.docker.io" --docker_remove_delay="6hrs" --docker_socket="/var/run/docker.sock"
--docker_stop_timeout="0ns" --docker_store_dir="/tmp/mesos/store/docker" --docker_volume_checkpoint_dir="/var/run/mesos/isolators/docker/volume"
--enforce_container_disk_quota="false" --executor_registration_timeout="1mins" --executor_shutdown_grace_period="5secs"
--fetcher_cache_dir="/tmp/Endpoint_SlaveEndpointTest_UnauthorizedRequest_2_EPREVM/fetch" --fetcher_cache_size="2GB"
--frameworks_home="" --gc_delay="1weeks" --gc_disk_headroom="0.1" --hadoop_home="" --help="false"
--hostname_lookup="true" --http_command_executor="false" --http_credentials="/tmp/Endpoint_SlaveEndpointTest_UnauthorizedRequest_2_EPREVM/http_credentials"
--http_heartbeat_interval="30secs" --initialize_driver_logging="true" --isolation="posix/cpu,posix/mem"
--launcher="posix" --launcher_dir="/mesos/build/src" --logbufsecs="0" --logging_level="INFO"
--max_completed_executors_per_framework="150" --oversubscribed_resources_interval="15secs"
--perf_duration="10secs" --perf_interval="1mins" --port="5051" --qos_correction_interval_min="0ns"
--quiet="false" --recover="reconnect" --recovery_timeout="15mins" --registration_backoff_factor="10ms"
--resources="cpus:2;gpus:0;mem:1024;disk:1024;ports:[31000-32000]" --revocable_cpu_low_priority="true"
--runtime_dir="/tmp/Endpoint_SlaveEndpointTest_UnauthorizedRequest_2_EPREVM" --sandbox_directory="/mnt/mesos/sandbox"
--strict="true" --switch_user="true" --systemd_enable_support="true" --systemd_runtime_directory="/run/systemd/system"
--version="false" --work_dir="/tmp/Endpoint_SlaveEndpointTest_UnauthorizedRequest_2_knVLsx"
I0509 19:27:12.313491 25399 credentials.hpp:86] Loading credential for authentication from
'/tmp/Endpoint_SlaveEndpointTest_UnauthorizedRequest_2_EPREVM/credential'
I0509 19:27:12.313556 25399 slave.cpp:258] Agent using credential for: test-principal
I0509 19:27:12.313567 25399 credentials.hpp:37] Loading credentials for authentication from
'/tmp/Endpoint_SlaveEndpointTest_UnauthorizedRequest_2_EPREVM/http_credentials'
I0509 19:27:12.313644 25399 http.cpp:975] Creating default 'basic' HTTP authenticator for
realm 'mesos-agent-readonly'
I0509 19:27:12.313678 25399 http.cpp:975] Creating default 'basic' HTTP authenticator for
realm 'mesos-agent-readwrite'
I0509 19:27:12.314026 25399 slave.cpp:525] Agent resources: cpus(*):2; mem(*):1024; disk(*):1024;
ports(*):[31000-32000]
I0509 19:27:12.314056 25399 slave.cpp:533] Agent attributes: [  ]
I0509 19:27:12.314064 25399 slave.cpp:538] Agent hostname: 287312d2934c
I0509 19:27:12.314131 25404 status_update_manager.cpp:177] Pausing sending status updates
I0509 19:27:12.314364 25404 state.cpp:62] Recovering state from '/tmp/Endpoint_SlaveEndpointTest_UnauthorizedRequest_2_knVLsx/meta'
I0509 19:27:12.314488 25393 status_update_manager.cpp:203] Recovering status update manager
I0509 19:27:12.314581 25396 containerizer.cpp:608] Recovering containerizer
I0509 19:27:12.315048 25391 provisioner.cpp:410] Provisioner recovery complete
I0509 19:27:12.315220 25389 slave.cpp:5963] Finished recovery
I0509 19:27:12.315549 25389 slave.cpp:6145] Querying resource estimator for oversubscribable
resources
I0509 19:27:12.315661 25396 slave.cpp:6159] Received oversubscribable resources {} from the
resource estimator
I0509 19:27:12.316169 25401 process.cpp:3730] Handling HTTP event for process 'slave(747)'
with path: '/slave(747)/containers'
I0509 19:27:12.316515 25402 http.cpp:1115] HTTP GET for /slave(747)/containers from 172.17.0.3:43816
I0509 19:27:12.316546 25402 http.cpp:936] Authorizing principal 'test-principal' to GET the
'/containers' endpoint
I0509 19:27:12.317381 25396 slave.cpp:790] Agent terminating
[       OK ] Endpoint/SlaveEndpointTest.UnauthorizedRequest/2 (10 ms)
[ RUN      ] Endpoint/SlaveEndpointTest.NoAuthorizer/0
I0509 19:27:12.321852 25388 containerizer.cpp:221] Using isolation: posix/cpu,posix/mem,filesystem/posix,network/cni
W0509 19:27:12.322228 25388 backend.cpp:76] Failed to create 'aufs' backend: AufsBackend requires
root privileges
W0509 19:27:12.322271 25388 backend.cpp:76] Failed to create 'bind' backend: BindBackend requires
root privileges
I0509 19:27:12.322289 25388 provisioner.cpp:249] Using default backend 'copy'
I0509 19:27:12.322991 25388 cluster.cpp:448] Creating default 'local' authorizer
I0509 19:27:12.323416 25393 slave.cpp:225] Mesos agent started on (748)@172.17.0.3:55396
I0509 19:27:12.323432 25393 slave.cpp:226] Flags at startup: --acls="" --appc_simple_discovery_uri_prefix="http://"
--appc_store_dir="/tmp/mesos/store/appc" --authenticate_http_readonly="true" --authenticate_http_readwrite="true"
--authenticatee="crammd5" --authentication_backoff_factor="1secs" --authorizer="local" --cgroups_cpu_enable_pids_and_tids_count="false"
--cgroups_enable_cfs="false" --cgroups_hierarchy="/sys/fs/cgroup" --cgroups_limit_swap="false"
--cgroups_root="mesos" --container_disk_watch_interval="15secs" --containerizers="mesos" --credential="/tmp/Endpoint_SlaveEndpointTest_NoAuthorizer_0_oc0vSM/credential"
--default_role="*" --disk_watch_interval="1mins" --docker="docker" --docker_kill_orphans="true"
--docker_registry="https://registry-1.docker.io" --docker_remove_delay="6hrs" --docker_socket="/var/run/docker.sock"
--docker_stop_timeout="0ns" --docker_store_dir="/tmp/mesos/store/docker" --docker_volume_checkpoint_dir="/var/run/mesos/isolators/docker/volume"
--enforce_container_disk_quota="false" --executor_registration_timeout="1mins" --executor_shutdown_grace_period="5secs"
--fetcher_cache_dir="/tmp/Endpoint_SlaveEndpointTest_NoAuthorizer_0_oc0vSM/fetch" --fetcher_cache_size="2GB"
--frameworks_home="" --gc_delay="1weeks" --gc_disk_headroom="0.1" --hadoop_home="" --help="false"
--hostname_lookup="true" --http_command_executor="false" --http_credentials="/tmp/Endpoint_SlaveEndpointTest_NoAuthorizer_0_oc0vSM/http_credentials"
--http_heartbeat_interval="30secs" --initialize_driver_logging="true" --isolation="posix/cpu,posix/mem"
--launcher="posix" --launcher_dir="/mesos/build/src" --logbufsecs="0" --logging_level="INFO"
--max_completed_executors_per_framework="150" --oversubscribed_resources_interval="15secs"
--perf_duration="10secs" --perf_interval="1mins" --port="5051" --qos_correction_interval_min="0ns"
--quiet="false" --recover="reconnect" --recovery_timeout="15mins" --registration_backoff_factor="10ms"
--resources="cpus:2;gpus:0;mem:1024;disk:1024;ports:[31000-32000]" --revocable_cpu_low_priority="true"
--runtime_dir="/tmp/Endpoint_SlaveEndpointTest_NoAuthorizer_0_oc0vSM" --sandbox_directory="/mnt/mesos/sandbox"
--strict="true" --switch_user="true" --systemd_enable_support="true" --systemd_runtime_directory="/run/systemd/system"
--version="false" --work_dir="/tmp/Endpoint_SlaveEndpointTest_NoAuthorizer_0_a8K3nx"
I0509 19:27:12.323633 25393 credentials.hpp:86] Loading credential for authentication from
'/tmp/Endpoint_SlaveEndpointTest_NoAuthorizer_0_oc0vSM/credential'
I0509 19:27:12.323705 25393 slave.cpp:258] Agent using credential for: test-principal
I0509 19:27:12.323720 25393 credentials.hpp:37] Loading credentials for authentication from
'/tmp/Endpoint_SlaveEndpointTest_NoAuthorizer_0_oc0vSM/http_credentials'
I0509 19:27:12.323808 25393 http.cpp:975] Creating default 'basic' HTTP authenticator for
realm 'mesos-agent-readonly'
I0509 19:27:12.323851 25393 http.cpp:975] Creating default 'basic' HTTP authenticator for
realm 'mesos-agent-readwrite'
I0509 19:27:12.324201 25393 slave.cpp:525] Agent resources: cpus(*):2; mem(*):1024; disk(*):1024;
ports(*):[31000-32000]
I0509 19:27:12.324231 25393 slave.cpp:533] Agent attributes: [  ]
I0509 19:27:12.324236 25393 slave.cpp:538] Agent hostname: 287312d2934c
I0509 19:27:12.324286 25402 status_update_manager.cpp:177] Pausing sending status updates
I0509 19:27:12.324542 25390 state.cpp:62] Recovering state from '/tmp/Endpoint_SlaveEndpointTest_NoAuthorizer_0_a8K3nx/meta'
I0509 19:27:12.324648 25396 status_update_manager.cpp:203] Recovering status update manager
I0509 19:27:12.324739 25390 containerizer.cpp:608] Recovering containerizer
I0509 19:27:12.325181 25389 provisioner.cpp:410] Provisioner recovery complete
I0509 19:27:12.325330 25399 slave.cpp:5963] Finished recovery
I0509 19:27:12.325661 25399 slave.cpp:6145] Querying resource estimator for oversubscribable
resources
I0509 19:27:12.325774 25404 slave.cpp:6159] Received oversubscribable resources {} from the
resource estimator
I0509 19:27:12.326251 25390 process.cpp:3730] Handling HTTP event for process 'slave(748)'
with path: '/slave(748)/monitor/statistics'
I0509 19:27:12.326586 25394 http.cpp:1115] HTTP GET for /slave(748)/monitor/statistics from
172.17.0.3:43817
I0509 19:27:12.326619 25394 http.cpp:936] Authorizing principal 'test-principal' to GET the
'/monitor/statistics' endpoint
I0509 19:27:12.327785 25392 slave.cpp:790] Agent terminating
[       OK ] Endpoint/SlaveEndpointTest.NoAuthorizer/0 (10 ms)
[ RUN      ] Endpoint/SlaveEndpointTest.NoAuthorizer/1
I0509 19:27:12.332144 25388 containerizer.cpp:221] Using isolation: posix/cpu,posix/mem,filesystem/posix,network/cni
W0509 19:27:12.332507 25388 backend.cpp:76] Failed to create 'aufs' backend: AufsBackend requires
root privileges
W0509 19:27:12.332550 25388 backend.cpp:76] Failed to create 'bind' backend: BindBackend requires
root privileges
I0509 19:27:12.332563 25388 provisioner.cpp:249] Using default backend 'copy'
I0509 19:27:12.333219 25388 cluster.cpp:448] Creating default 'local' authorizer
I0509 19:27:12.334071 25393 slave.cpp:225] Mesos agent started on (749)@172.17.0.3:55396
I0509 19:27:12.334095 25393 slave.cpp:226] Flags at startup: --acls="" --appc_simple_discovery_uri_prefix="http://"
--appc_store_dir="/tmp/mesos/store/appc" --authenticate_http_readonly="true" --authenticate_http_readwrite="true"
--authenticatee="crammd5" --authentication_backoff_factor="1secs" --authorizer="local" --cgroups_cpu_enable_pids_and_tids_count="false"
--cgroups_enable_cfs="false" --cgroups_hierarchy="/sys/fs/cgroup" --cgroups_limit_swap="false"
--cgroups_root="mesos" --container_disk_watch_interval="15secs" --containerizers="mesos" --credential="/tmp/Endpoint_SlaveEndpointTest_NoAuthorizer_1_qRZ3VM/credential"
--default_role="*" --disk_watch_interval="1mins" --docker="docker" --docker_kill_orphans="true"
--docker_registry="https://registry-1.docker.io" --docker_remove_delay="6hrs" --docker_socket="/var/run/docker.sock"
--docker_stop_timeout="0ns" --docker_store_dir="/tmp/mesos/store/docker" --docker_volume_checkpoint_dir="/var/run/mesos/isolators/docker/volume"
--enforce_container_disk_quota="false" --executor_registration_timeout="1mins" --executor_shutdown_grace_period="5secs"
--fetcher_cache_dir="/tmp/Endpoint_SlaveEndpointTest_NoAuthorizer_1_qRZ3VM/fetch" --fetcher_cache_size="2GB"
--frameworks_home="" --gc_delay="1weeks" --gc_disk_headroom="0.1" --hadoop_home="" --help="false"
--hostname_lookup="true" --http_command_executor="false" --http_credentials="/tmp/Endpoint_SlaveEndpointTest_NoAuthorizer_1_qRZ3VM/http_credentials"
--http_heartbeat_interval="30secs" --initialize_driver_logging="true" --isolation="posix/cpu,posix/mem"
--launcher="posix" --launcher_dir="/mesos/build/src" --logbufsecs="0" --logging_level="INFO"
--max_completed_executors_per_framework="150" --oversubscribed_resources_interval="15secs"
--perf_duration="10secs" --perf_interval="1mins" --port="5051" --qos_correction_interval_min="0ns"
--quiet="false" --recover="reconnect" --recovery_timeout="15mins" --registration_backoff_factor="10ms"
--resources="cpus:2;gpus:0;mem:1024;disk:1024;ports:[31000-32000]" --revocable_cpu_low_priority="true"
--runtime_dir="/tmp/Endpoint_SlaveEndpointTest_NoAuthorizer_1_qRZ3VM" --sandbox_directory="/mnt/mesos/sandbox"
--strict="true" --switch_user="true" --systemd_enable_support="true" --systemd_runtime_directory="/run/systemd/system"
--version="false" --work_dir="/tmp/Endpoint_SlaveEndpointTest_NoAuthorizer_1_UE8Vpx"
I0509 19:27:12.334417 25393 credentials.hpp:86] Loading credential for authentication from
'/tmp/Endpoint_SlaveEndpointTest_NoAuthorizer_1_qRZ3VM/credential'
I0509 19:27:12.334540 25393 slave.cpp:258] Agent using credential for: test-principal
I0509 19:27:12.334559 25393 credentials.hpp:37] Loading credentials for authentication from
'/tmp/Endpoint_SlaveEndpointTest_NoAuthorizer_1_qRZ3VM/http_credentials'
I0509 19:27:12.334708 25393 http.cpp:975] Creating default 'basic' HTTP authenticator for
realm 'mesos-agent-readonly'
I0509 19:27:12.334764 25393 http.cpp:975] Creating default 'basic' HTTP authenticator for
realm 'mesos-agent-readwrite'
I0509 19:27:12.335264 25393 slave.cpp:525] Agent resources: cpus(*):2; mem(*):1024; disk(*):1024;
ports(*):[31000-32000]
I0509 19:27:12.335309 25393 slave.cpp:533] Agent attributes: [  ]
I0509 19:27:12.335322 25393 slave.cpp:538] Agent hostname: 287312d2934c
I0509 19:27:12.335494 25398 status_update_manager.cpp:177] Pausing sending status updates
I0509 19:27:12.335783 25391 state.cpp:62] Recovering state from '/tmp/Endpoint_SlaveEndpointTest_NoAuthorizer_1_UE8Vpx/meta'
I0509 19:27:12.336055 25403 status_update_manager.cpp:203] Recovering status update manager
I0509 19:27:12.336168 25390 containerizer.cpp:608] Recovering containerizer
I0509 19:27:12.336760 25402 provisioner.cpp:410] Provisioner recovery complete
I0509 19:27:12.336938 25404 slave.cpp:5963] Finished recovery
I0509 19:27:12.337412 25404 slave.cpp:6145] Querying resource estimator for oversubscribable
resources
I0509 19:27:12.337543 25394 slave.cpp:6159] Received oversubscribable resources {} from the
resource estimator
I0509 19:27:12.338213 25390 process.cpp:3730] Handling HTTP event for process 'slave(749)'
with path: '/slave(749)/monitor/statistics.json'
I0509 19:27:12.338693 25399 http.cpp:1115] HTTP GET for /slave(749)/monitor/statistics.json
from 172.17.0.3:43819
I0509 19:27:12.338737 25399 http.cpp:936] Authorizing principal 'test-principal' to GET the
'/monitor/statistics.json' endpoint
I0509 19:27:12.340564 25395 slave.cpp:790] Agent terminating
[       OK ] Endpoint/SlaveEndpointTest.NoAuthorizer/1 (14 ms)
[ RUN      ] Endpoint/SlaveEndpointTest.NoAuthorizer/2
I0509 19:27:12.346165 25388 containerizer.cpp:221] Using isolation: posix/cpu,posix/mem,filesystem/posix,network/cni
W0509 19:27:12.346503 25388 backend.cpp:76] Failed to create 'aufs' backend: AufsBackend requires
root privileges
W0509 19:27:12.346544 25388 backend.cpp:76] Failed to create 'bind' backend: BindBackend requires
root privileges
I0509 19:27:12.346560 25388 provisioner.cpp:249] Using default backend 'copy'
I0509 19:27:12.347184 25388 cluster.cpp:448] Creating default 'local' authorizer
I0509 19:27:12.347739 25397 slave.cpp:225] Mesos agent started on (750)@172.17.0.3:55396
I0509 19:27:12.347764 25397 slave.cpp:226] Flags at startup: --acls="" --appc_simple_discovery_uri_prefix="http://"
--appc_store_dir="/tmp/mesos/store/appc" --authenticate_http_readonly="true" --authenticate_http_readwrite="true"
--authenticatee="crammd5" --authentication_backoff_factor="1secs" --authorizer="local" --cgroups_cpu_enable_pids_and_tids_count="false"
--cgroups_enable_cfs="false" --cgroups_hierarchy="/sys/fs/cgroup" --cgroups_limit_swap="false"
--cgroups_root="mesos" --container_disk_watch_interval="15secs" --containerizers="mesos" --credential="/tmp/Endpoint_SlaveEndpointTest_NoAuthorizer_2_UN5h8M/credential"
--default_role="*" --disk_watch_interval="1mins" --docker="docker" --docker_kill_orphans="true"
--docker_registry="https://registry-1.docker.io" --docker_remove_delay="6hrs" --docker_socket="/var/run/docker.sock"
--docker_stop_timeout="0ns" --docker_store_dir="/tmp/mesos/store/docker" --docker_volume_checkpoint_dir="/var/run/mesos/isolators/docker/volume"
--enforce_container_disk_quota="false" --executor_registration_timeout="1mins" --executor_shutdown_grace_period="5secs"
--fetcher_cache_dir="/tmp/Endpoint_SlaveEndpointTest_NoAuthorizer_2_UN5h8M/fetch" --fetcher_cache_size="2GB"
--frameworks_home="" --gc_delay="1weeks" --gc_disk_headroom="0.1" --hadoop_home="" --help="false"
--hostname_lookup="true" --http_command_executor="false" --http_credentials="/tmp/Endpoint_SlaveEndpointTest_NoAuthorizer_2_UN5h8M/http_credentials"
--http_heartbeat_interval="30secs" --initialize_driver_logging="true" --isolation="posix/cpu,posix/mem"
--launcher="posix" --launcher_dir="/mesos/build/src" --logbufsecs="0" --logging_level="INFO"
--max_completed_executors_per_framework="150" --oversubscribed_resources_interval="15secs"
--perf_duration="10secs" --perf_interval="1mins" --port="5051" --qos_correction_interval_min="0ns"
--quiet="false" --recover="reconnect" --recovery_timeout="15mins" --registration_backoff_factor="10ms"
--resources="cpus:2;gpus:0;mem:1024;disk:1024;ports:[31000-32000]" --revocable_cpu_low_priority="true"
--runtime_dir="/tmp/Endpoint_SlaveEndpointTest_NoAuthorizer_2_UN5h8M" --sandbox_directory="/mnt/mesos/sandbox"
--strict="true" --switch_user="true" --systemd_enable_support="true" --systemd_runtime_directory="/run/systemd/system"
--version="false" --work_dir="/tmp/Endpoint_SlaveEndpointTest_NoAuthorizer_2_ik1Szx"
I0509 19:27:12.348007 25397 credentials.hpp:86] Loading credential for authentication from
'/tmp/Endpoint_SlaveEndpointTest_NoAuthorizer_2_UN5h8M/credential'
I0509 19:27:12.348099 25397 slave.cpp:258] Agent using credential for: test-principal
I0509 19:27:12.348115 25397 credentials.hpp:37] Loading credentials for authentication from
'/tmp/Endpoint_SlaveEndpointTest_NoAuthorizer_2_UN5h8M/http_credentials'
I0509 19:27:12.348239 25397 http.cpp:975] Creating default 'basic' HTTP authenticator for
realm 'mesos-agent-readonly'
I0509 19:27:12.348289 25397 http.cpp:975] Creating default 'basic' HTTP authenticator for
realm 'mesos-agent-readwrite'
I0509 19:27:12.348861 25397 slave.cpp:525] Agent resources: cpus(*):2; mem(*):1024; disk(*):1024;
ports(*):[31000-32000]
I0509 19:27:12.348903 25397 slave.cpp:533] Agent attributes: [  ]
I0509 19:27:12.348911 25397 slave.cpp:538] Agent hostname: 287312d2934c
I0509 19:27:12.349019 25394 status_update_manager.cpp:177] Pausing sending status updates
I0509 19:27:12.349369 25393 state.cpp:62] Recovering state from '/tmp/Endpoint_SlaveEndpointTest_NoAuthorizer_2_ik1Szx/meta'
I0509 19:27:12.349488 25393 status_update_manager.cpp:203] Recovering status update manager
I0509 19:27:12.349555 25393 containerizer.cpp:608] Recovering containerizer
I0509 19:27:12.350159 25390 provisioner.cpp:410] Provisioner recovery complete
I0509 19:27:12.350373 25400 slave.cpp:5963] Finished recovery
I0509 19:27:12.350819 25400 slave.cpp:6145] Querying resource estimator for oversubscribable
resources
I0509 19:27:12.351016 25404 slave.cpp:6159] Received oversubscribable resources {} from the
resource estimator
I0509 19:27:12.351692 25394 process.cpp:3730] Handling HTTP event for process 'slave(750)'
with path: '/slave(750)/containers'
I0509 19:27:12.352165 25399 http.cpp:1115] HTTP GET for /slave(750)/containers from 172.17.0.3:43820
I0509 19:27:12.352212 25399 http.cpp:936] Authorizing principal 'test-principal' to GET the
'/containers' endpoint
I0509 19:27:12.353510 25390 slave.cpp:790] Agent terminating
[       OK ] Endpoint/SlaveEndpointTest.NoAuthorizer/2 (12 ms)
[----------] 9 tests from Endpoint/SlaveEndpointTest (117 ms total)

[----------] Global test environment tear-down
[==========] 1523 tests from 167 test cases ran. (262507 ms total)
[  PASSED  ] 1522 tests.
[  FAILED  ] 1 test, listed below:
[  FAILED  ] MasterTest.RateLimitRecoveredSlaveRemoval

 1 FAILED TEST
  YOU HAVE 19 DISABLED TESTS

E0509 19:27:12.404281 25405 process.cpp:950] Failed to accept socket: future discarded
make[3]: *** [CMakeFiles/check] Error 1
make[3]: Leaving directory `/mesos/build'
make[2]: *** [CMakeFiles/check.dir/all] Error 2
make[2]: Leaving directory `/mesos/build'
make[1]: *** [CMakeFiles/check.dir/rule] Error 2
make[1]: Leaving directory `/mesos/build'
make: *** [check] Error 2
+ docker rmi mesos-1494355134-25326
Untagged: mesos-1494355134-25326:latest
Deleted: sha256:ff8e8b539ec16933eb8abc2702b1b2ae8ed44cf6fcbe027cd8ccad2c3ccfc22f
Deleted: sha256:134d6d427b2d9f2fb91656fc38d5952763d59e409ac3aa2b44e49ebd0021bee4
Deleted: sha256:324ffea9b29409b4c0197e4f95e20b6277b4c8c22fbe68cb93f7309f2603ec25
Deleted: sha256:00d12f6588fc5653006155805add7fb39bcbb1b54d08467c30a7c16ee786d8f7
Deleted: sha256:a7220e97880383ca27430708390e62bcf0a351e8edb62197928d0d4ce10f2280
Deleted: sha256:6f3307fe770a8353120869f15838258b1d313f997e6dcacc1554d1be5475e230
Deleted: sha256:464fbf009b82ef35b6b6af91489d9d860c35db078170134f384f19f1ddf5ff77
Deleted: sha256:2e5a51582a1976696dd15161c3a5b9e44bfa45d1a1851fa651514cb050b34495
Deleted: sha256:39a9a933dab3208791d91a32d49d8efb0b0591bd727cb80d18c3182b5cae14c1
Deleted: sha256:167dae17e8a4a02439387540d51e9ae03c1a8535f90ce82a3004ed15ec038530
Deleted: sha256:4454d0da6f1d08525ab6c906863462baea5d2e42d2ac1e0a6f0612663010eaee
Deleted: sha256:0a3fa9781cc08c79bb6e7c20527060b45258358a09f73d6b190a35cd22ed020d
Deleted: sha256:a1f7e50adb9578e01a12bf5712fa83bcb897a93700c62dff25330d808c81aa63
Deleted: sha256:f9a0dd144629a943a150945160b6cea54be9c51edeb3e9227df0a3963c9505ec
Deleted: sha256:4309395508cfd8aea22be84dfc6c177ee9cf3a6891aa06b50244eb6301b63ff8
Deleted: sha256:bd7221ae7534946dca660287e88121f1eca776d4a8e3f226a568bd6c487d26f4
Deleted: sha256:a3d2c532768ff4d01fe5dbda1fcf9b5b36047084848f1974b7a47a353065fd1d
Deleted: sha256:ed9d49d62cc6ff05afc906fdb0df1fb8ece54ce68eabb10cefc075aa87899185
Deleted: sha256:f43edf77174afb7b4254266c32d09c475262c102be1f13ffab7ea439ea5f444c
Deleted: sha256:3730af70f87c01df369c582ba7918dd4dfa092d89dc0ba685e116e915ccf9376
Deleted: sha256:fc3ce857c5c7a4c20e44193befb89b650188605145187c6eef27fdaea2637095
Deleted: sha256:9f06f7bb5cd1414404db4ca0bea98baa709886e30b265f18620f7401cf9b7773
Deleted: sha256:2a5e482440cc87bbeda3e78e0567f917bc2be8710345f2e7d66b3cf0827eb8f8
Deleted: sha256:c25c2e9447d15a269762975419e617595396f4f79529fcfbd6be4906049e8cb7
Build step 'Execute shell' marked build as failure
Not sending mail to unregistered user neil.conway@gmail.com

Mime
View raw message