mesos-builds mailing list archives

Site index · List index
Message view « Date » · « Thread »
Top « Date » · « Thread »
From Apache Jenkins Server <jenk...@builds.apache.org>
Subject Build failed in Jenkins: Mesos-Buildbot » autotools,gcc,--verbose --enable-libevent --enable-ssl,GLOG_v=1 MESOS_VERBOSE=1,centos:7,(docker||Hadoop)&&(!ubuntu-us1)&&(!ubuntu-eu2) #3744
Date Mon, 29 May 2017 22:56:28 GMT
See <https://builds.apache.org/job/Mesos-Buildbot/BUILDTOOL=autotools,COMPILER=gcc,CONFIGURATION=--verbose%20--enable-libevent%20--enable-ssl,ENVIRONMENT=GLOG_v=1%20MESOS_VERBOSE=1,OS=centos%3A7,label_exp=(docker%7C%7CHadoop)&&(!ubuntu-us1)&&(!ubuntu-eu2)/3744/display/redirect?page=changes>

Changes:

[klueska] Added 'mesos config show' command to the new Mesos CLI.

------------------------------------------
[...truncated 28.85 MB...]
I0529 22:56:18.126942 25797 http.cpp:1115] HTTP GET for /slave(754)/containers from 172.17.0.3:41389
I0529 22:56:18.127029 25797 http.cpp:936] Authorizing principal 'test-principal' to GET the
'/containers' endpoint
I0529 22:56:18.130393 25796 slave.cpp:801] Agent terminating
[       OK ] Endpoint/SlaveEndpointTest.AuthorizedRequest/2 (35 ms)
[ RUN      ] Endpoint/SlaveEndpointTest.UnauthorizedRequest/0
I0529 22:56:18.141460  7903 containerizer.cpp:230] Using isolation: posix/cpu,posix/mem,filesystem/posix,network/cni,environment_secret
W0529 22:56:18.141995  7903 backend.cpp:76] Failed to create 'aufs' backend: AufsBackend requires
root privileges
W0529 22:56:18.142114  7903 backend.cpp:76] Failed to create 'bind' backend: BindBackend requires
root privileges
I0529 22:56:18.142155  7903 provisioner.cpp:255] Using default backend 'copy'
I0529 22:56:18.145393 25795 slave.cpp:232] Mesos agent started on (755)@172.17.0.3:57574
I0529 22:56:18.145529 25795 slave.cpp:233] Flags at startup: --acls="" --appc_simple_discovery_uri_prefix="http://"
--appc_store_dir="/tmp/mesos/store/appc" --authenticate_http_executors="true" --authenticate_http_readonly="true"
--authenticate_http_readwrite="true" --authenticatee="crammd5" --authentication_backoff_factor="1secs"
--authorizer="local" --cgroups_cpu_enable_pids_and_tids_count="false" --cgroups_enable_cfs="false"
--cgroups_hierarchy="/sys/fs/cgroup" --cgroups_limit_swap="false" --cgroups_root="mesos" --container_disk_watch_interval="15secs"
--containerizers="mesos" --credential="/tmp/Endpoint_SlaveEndpointTest_UnauthorizedRequest_0_JEjsTj/credential"
--default_role="*" --disk_watch_interval="1mins" --docker="docker" --docker_kill_orphans="true"
--docker_registry="https://registry-1.docker.io" --docker_remove_delay="6hrs" --docker_socket="/var/run/docker.sock"
--docker_stop_timeout="0ns" --docker_store_dir="/tmp/mesos/store/docker" --docker_volume_checkpoint_dir="/var/run/mesos/isolators/docker/volume"
--enforce_container_disk_quota="false" --executor_registration_timeout="1mins" --executor_reregistration_timeout="2secs"
--executor_secret_key="/tmp/Endpoint_SlaveEndpointTest_UnauthorizedRequest_0_JEjsTj/executor_secret_key"
--executor_shutdown_grace_period="5secs" --fetcher_cache_dir="/tmp/Endpoint_SlaveEndpointTest_UnauthorizedRequest_0_JEjsTj/fetch"
--fetcher_cache_size="2GB" --frameworks_home="" --gc_delay="1weeks" --gc_disk_headroom="0.1"
--hadoop_home="" --help="false" --hostname_lookup="true" --http_command_executor="false" --http_credentials="/tmp/Endpoint_SlaveEndpointTest_UnauthorizedRequest_0_JEjsTj/http_credentials"
--http_heartbeat_interval="30secs" --initialize_driver_logging="true" --isolation="posix/cpu,posix/mem"
--launcher="posix" --launcher_dir="/mesos/mesos-1.4.0/_build/src" --logbufsecs="0" --logging_level="INFO"
--max_completed_executors_per_framework="150" --oversubscribed_resources_interval="15secs"
--perf_duration="10secs" --perf_interval="1mins" --port="5051" --qos_correction_interval_min="0ns"
--quiet="false" --recover="reconnect" --recovery_timeout="15mins" --registration_backoff_factor="10ms"
--resources="cpus:2;gpus:0;mem:1024;disk:1024;ports:[31000-32000]" --revocable_cpu_low_priority="true"
--runtime_dir="/tmp/Endpoint_SlaveEndpointTest_UnauthorizedRequest_0_JEjsTj" --sandbox_directory="/mnt/mesos/sandbox"
--strict="true" --switch_user="true" --systemd_enable_support="true" --systemd_runtime_directory="/run/systemd/system"
--version="false" --work_dir="/tmp/Endpoint_SlaveEndpointTest_UnauthorizedRequest_0_wuvlwO"
I0529 22:56:18.146189 25795 credentials.hpp:86] Loading credential for authentication from
'/tmp/Endpoint_SlaveEndpointTest_UnauthorizedRequest_0_JEjsTj/credential'
I0529 22:56:18.146433 25795 slave.cpp:265] Agent using credential for: test-principal
I0529 22:56:18.146461 25795 credentials.hpp:37] Loading credentials for authentication from
'/tmp/Endpoint_SlaveEndpointTest_UnauthorizedRequest_0_JEjsTj/http_credentials'
I0529 22:56:18.146955 25795 http.cpp:975] Creating default 'basic' HTTP authenticator for
realm 'mesos-agent-executor'
I0529 22:56:18.147076 25795 http.cpp:996] Creating default 'jwt' HTTP authenticator for realm
'mesos-agent-executor'
I0529 22:56:18.147303 25795 http.cpp:975] Creating default 'basic' HTTP authenticator for
realm 'mesos-agent-readonly'
I0529 22:56:18.147399 25795 http.cpp:996] Creating default 'jwt' HTTP authenticator for realm
'mesos-agent-readonly'
I0529 22:56:18.147603 25795 http.cpp:975] Creating default 'basic' HTTP authenticator for
realm 'mesos-agent-readwrite'
I0529 22:56:18.147696 25795 http.cpp:996] Creating default 'jwt' HTTP authenticator for realm
'mesos-agent-readwrite'
I0529 22:56:18.149293 25795 slave.cpp:536] Agent resources: cpus(*):2; mem(*):1024; disk(*):1024;
ports(*):[31000-32000]
I0529 22:56:18.149368 25795 slave.cpp:544] Agent attributes: [  ]
I0529 22:56:18.149381 25795 slave.cpp:549] Agent hostname: bfa2603b6292
I0529 22:56:18.149533 25798 status_update_manager.cpp:177] Pausing sending status updates
I0529 22:56:18.151087 25790 state.cpp:62] Recovering state from '/tmp/Endpoint_SlaveEndpointTest_UnauthorizedRequest_0_wuvlwO/meta'
I0529 22:56:18.151443 25794 status_update_manager.cpp:203] Recovering status update manager
I0529 22:56:18.151638 25785 containerizer.cpp:582] Recovering containerizer
I0529 22:56:18.153270 25792 provisioner.cpp:416] Provisioner recovery complete
I0529 22:56:18.153710 25790 slave.cpp:6083] Finished recovery
I0529 22:56:18.154314 25790 slave.cpp:6265] Querying resource estimator for oversubscribable
resources
I0529 22:56:18.154690 25792 slave.cpp:6279] Received oversubscribable resources {} from the
resource estimator
I0529 22:56:18.157537 25799 process.cpp:3730] Handling HTTP event for process 'slave(755)'
with path: '/slave(755)/monitor/statistics'
I0529 22:56:18.160091 25785 http.cpp:1115] HTTP GET for /slave(755)/monitor/statistics from
172.17.0.3:41390
I0529 22:56:18.160167 25785 http.cpp:936] Authorizing principal 'test-principal' to GET the
'/monitor/statistics' endpoint
I0529 22:56:18.163225 25798 slave.cpp:801] Agent terminating
[       OK ] Endpoint/SlaveEndpointTest.UnauthorizedRequest/0 (33 ms)
[ RUN      ] Endpoint/SlaveEndpointTest.UnauthorizedRequest/1
I0529 22:56:18.177392  7903 containerizer.cpp:230] Using isolation: posix/cpu,posix/mem,filesystem/posix,network/cni,environment_secret
W0529 22:56:18.178133  7903 backend.cpp:76] Failed to create 'aufs' backend: AufsBackend requires
root privileges
W0529 22:56:18.178270  7903 backend.cpp:76] Failed to create 'bind' backend: BindBackend requires
root privileges
I0529 22:56:18.178320  7903 provisioner.cpp:255] Using default backend 'copy'
I0529 22:56:18.182992 25787 slave.cpp:232] Mesos agent started on (756)@172.17.0.3:57574
I0529 22:56:18.183019 25787 slave.cpp:233] Flags at startup: --acls="" --appc_simple_discovery_uri_prefix="http://"
--appc_store_dir="/tmp/mesos/store/appc" --authenticate_http_executors="true" --authenticate_http_readonly="true"
--authenticate_http_readwrite="true" --authenticatee="crammd5" --authentication_backoff_factor="1secs"
--authorizer="local" --cgroups_cpu_enable_pids_and_tids_count="false" --cgroups_enable_cfs="false"
--cgroups_hierarchy="/sys/fs/cgroup" --cgroups_limit_swap="false" --cgroups_root="mesos" --container_disk_watch_interval="15secs"
--containerizers="mesos" --credential="/tmp/Endpoint_SlaveEndpointTest_UnauthorizedRequest_1_jFSAGl/credential"
--default_role="*" --disk_watch_interval="1mins" --docker="docker" --docker_kill_orphans="true"
--docker_registry="https://registry-1.docker.io" --docker_remove_delay="6hrs" --docker_socket="/var/run/docker.sock"
--docker_stop_timeout="0ns" --docker_store_dir="/tmp/mesos/store/docker" --docker_volume_checkpoint_dir="/var/run/mesos/isolators/docker/volume"
--enforce_container_disk_quota="false" --executor_registration_timeout="1mins" --executor_reregistration_timeout="2secs"
--executor_secret_key="/tmp/Endpoint_SlaveEndpointTest_UnauthorizedRequest_1_jFSAGl/executor_secret_key"
--executor_shutdown_grace_period="5secs" --fetcher_cache_dir="/tmp/Endpoint_SlaveEndpointTest_UnauthorizedRequest_1_jFSAGl/fetch"
--fetcher_cache_size="2GB" --frameworks_home="" --gc_delay="1weeks" --gc_disk_headroom="0.1"
--hadoop_home="" --help="false" --hostname_lookup="true" --http_command_executor="false" --http_credentials="/tmp/Endpoint_SlaveEndpointTest_UnauthorizedRequest_1_jFSAGl/http_credentials"
--http_heartbeat_interval="30secs" --initialize_driver_logging="true" --isolation="posix/cpu,posix/mem"
--launcher="posix" --launcher_dir="/mesos/mesos-1.4.0/_build/src" --logbufsecs="0" --logging_level="INFO"
--max_completed_executors_per_framework="150" --oversubscribed_resources_interval="15secs"
--perf_duration="10secs" --perf_interval="1mins" --port="5051" --qos_correction_interval_min="0ns"
--quiet="false" --recover="reconnect" --recovery_timeout="15mins" --registration_backoff_factor="10ms"
--resources="cpus:2;gpus:0;mem:1024;disk:1024;ports:[31000-32000]" --revocable_cpu_low_priority="true"
--runtime_dir="/tmp/Endpoint_SlaveEndpointTest_UnauthorizedRequest_1_jFSAGl" --sandbox_directory="/mnt/mesos/sandbox"
--strict="true" --switch_user="true" --systemd_enable_support="true" --systemd_runtime_directory="/run/systemd/system"
--version="false" --work_dir="/tmp/Endpoint_SlaveEndpointTest_UnauthorizedRequest_1_MjTSdQ"
I0529 22:56:18.183529 25787 credentials.hpp:86] Loading credential for authentication from
'/tmp/Endpoint_SlaveEndpointTest_UnauthorizedRequest_1_jFSAGl/credential'
I0529 22:56:18.183742 25787 slave.cpp:265] Agent using credential for: test-principal
I0529 22:56:18.183771 25787 credentials.hpp:37] Loading credentials for authentication from
'/tmp/Endpoint_SlaveEndpointTest_UnauthorizedRequest_1_jFSAGl/http_credentials'
I0529 22:56:18.184173 25787 http.cpp:975] Creating default 'basic' HTTP authenticator for
realm 'mesos-agent-executor'
I0529 22:56:18.184325 25787 http.cpp:996] Creating default 'jwt' HTTP authenticator for realm
'mesos-agent-executor'
I0529 22:56:18.184633 25787 http.cpp:975] Creating default 'basic' HTTP authenticator for
realm 'mesos-agent-readonly'
I0529 22:56:18.184742 25787 http.cpp:996] Creating default 'jwt' HTTP authenticator for realm
'mesos-agent-readonly'
I0529 22:56:18.185122 25787 http.cpp:975] Creating default 'basic' HTTP authenticator for
realm 'mesos-agent-readwrite'
I0529 22:56:18.185233 25787 http.cpp:996] Creating default 'jwt' HTTP authenticator for realm
'mesos-agent-readwrite'
I0529 22:56:18.186637 25787 slave.cpp:536] Agent resources: cpus(*):2; mem(*):1024; disk(*):1024;
ports(*):[31000-32000]
I0529 22:56:18.186712 25787 slave.cpp:544] Agent attributes: [  ]
I0529 22:56:18.186734 25787 slave.cpp:549] Agent hostname: bfa2603b6292
I0529 22:56:18.186887 25796 status_update_manager.cpp:177] Pausing sending status updates
I0529 22:56:18.188601 25791 state.cpp:62] Recovering state from '/tmp/Endpoint_SlaveEndpointTest_UnauthorizedRequest_1_MjTSdQ/meta'
I0529 22:56:18.188920 25785 status_update_manager.cpp:203] Recovering status update manager
I0529 22:56:18.189281 25785 containerizer.cpp:582] Recovering containerizer
I0529 22:56:18.191035 25795 provisioner.cpp:416] Provisioner recovery complete
I0529 22:56:18.191476 25788 slave.cpp:6083] Finished recovery
I0529 22:56:18.192059 25788 slave.cpp:6265] Querying resource estimator for oversubscribable
resources
I0529 22:56:18.192541 25788 slave.cpp:6279] Received oversubscribable resources {} from the
resource estimator
I0529 22:56:18.195458 25785 process.cpp:3730] Handling HTTP event for process 'slave(756)'
with path: '/slave(756)/monitor/statistics.json'
I0529 22:56:18.197329 25793 http.cpp:1115] HTTP GET for /slave(756)/monitor/statistics.json
from 172.17.0.3:41391
I0529 22:56:18.197466 25793 http.cpp:936] Authorizing principal 'test-principal' to GET the
'/monitor/statistics.json' endpoint
I0529 22:56:18.199321 25795 slave.cpp:801] Agent terminating
[       OK ] Endpoint/SlaveEndpointTest.UnauthorizedRequest/1 (35 ms)
[ RUN      ] Endpoint/SlaveEndpointTest.UnauthorizedRequest/2
I0529 22:56:18.210178  7903 containerizer.cpp:230] Using isolation: posix/cpu,posix/mem,filesystem/posix,network/cni,environment_secret
W0529 22:56:18.210698  7903 backend.cpp:76] Failed to create 'aufs' backend: AufsBackend requires
root privileges
W0529 22:56:18.210804  7903 backend.cpp:76] Failed to create 'bind' backend: BindBackend requires
root privileges
I0529 22:56:18.210847  7903 provisioner.cpp:255] Using default backend 'copy'
I0529 22:56:18.213924 25792 slave.cpp:232] Mesos agent started on (757)@172.17.0.3:57574
I0529 22:56:18.213951 25792 slave.cpp:233] Flags at startup: --acls="" --appc_simple_discovery_uri_prefix="http://"
--appc_store_dir="/tmp/mesos/store/appc" --authenticate_http_executors="true" --authenticate_http_readonly="true"
--authenticate_http_readwrite="true" --authenticatee="crammd5" --authentication_backoff_factor="1secs"
--authorizer="local" --cgroups_cpu_enable_pids_and_tids_count="false" --cgroups_enable_cfs="false"
--cgroups_hierarchy="/sys/fs/cgroup" --cgroups_limit_swap="false" --cgroups_root="mesos" --container_disk_watch_interval="15secs"
--containerizers="mesos" --credential="/tmp/Endpoint_SlaveEndpointTest_UnauthorizedRequest_2_nVvLQn/credential"
--default_role="*" --disk_watch_interval="1mins" --docker="docker" --docker_kill_orphans="true"
--docker_registry="https://registry-1.docker.io" --docker_remove_delay="6hrs" --docker_socket="/var/run/docker.sock"
--docker_stop_timeout="0ns" --docker_store_dir="/tmp/mesos/store/docker" --docker_volume_checkpoint_dir="/var/run/mesos/isolators/docker/volume"
--enforce_container_disk_quota="false" --executor_registration_timeout="1mins" --executor_reregistration_timeout="2secs"
--executor_secret_key="/tmp/Endpoint_SlaveEndpointTest_UnauthorizedRequest_2_nVvLQn/executor_secret_key"
--executor_shutdown_grace_period="5secs" --fetcher_cache_dir="/tmp/Endpoint_SlaveEndpointTest_UnauthorizedRequest_2_nVvLQn/fetch"
--fetcher_cache_size="2GB" --frameworks_home="" --gc_delay="1weeks" --gc_disk_headroom="0.1"
--hadoop_home="" --help="false" --hostname_lookup="true" --http_command_executor="false" --http_credentials="/tmp/Endpoint_SlaveEndpointTest_UnauthorizedRequest_2_nVvLQn/http_credentials"
--http_heartbeat_interval="30secs" --initialize_driver_logging="true" --isolation="posix/cpu,posix/mem"
--launcher="posix" --launcher_dir="/mesos/mesos-1.4.0/_build/src" --logbufsecs="0" --logging_level="INFO"
--max_completed_executors_per_framework="150" --oversubscribed_resources_interval="15secs"
--perf_duration="10secs" --perf_interval="1mins" --port="5051" --qos_correction_interval_min="0ns"
--quiet="false" --recover="reconnect" --recovery_timeout="15mins" --registration_backoff_factor="10ms"
--resources="cpus:2;gpus:0;mem:1024;disk:1024;ports:[31000-32000]" --revocable_cpu_low_priority="true"
--runtime_dir="/tmp/Endpoint_SlaveEndpointTest_UnauthorizedRequest_2_nVvLQn" --sandbox_directory="/mnt/mesos/sandbox"
--strict="true" --switch_user="true" --systemd_enable_support="true" --systemd_runtime_directory="/run/systemd/system"
--version="false" --work_dir="/tmp/Endpoint_SlaveEndpointTest_UnauthorizedRequest_2_sIvuiS"
I0529 22:56:18.214539 25792 credentials.hpp:86] Loading credential for authentication from
'/tmp/Endpoint_SlaveEndpointTest_UnauthorizedRequest_2_nVvLQn/credential'
I0529 22:56:18.214740 25792 slave.cpp:265] Agent using credential for: test-principal
I0529 22:56:18.214771 25792 credentials.hpp:37] Loading credentials for authentication from
'/tmp/Endpoint_SlaveEndpointTest_UnauthorizedRequest_2_nVvLQn/http_credentials'
I0529 22:56:18.215178 25792 http.cpp:975] Creating default 'basic' HTTP authenticator for
realm 'mesos-agent-executor'
I0529 22:56:18.215323 25792 http.cpp:996] Creating default 'jwt' HTTP authenticator for realm
'mesos-agent-executor'
I0529 22:56:18.215595 25792 http.cpp:975] Creating default 'basic' HTTP authenticator for
realm 'mesos-agent-readonly'
I0529 22:56:18.215708 25792 http.cpp:996] Creating default 'jwt' HTTP authenticator for realm
'mesos-agent-readonly'
I0529 22:56:18.215986 25792 http.cpp:975] Creating default 'basic' HTTP authenticator for
realm 'mesos-agent-readwrite'
I0529 22:56:18.216152 25792 http.cpp:996] Creating default 'jwt' HTTP authenticator for realm
'mesos-agent-readwrite'
I0529 22:56:18.218228 25792 slave.cpp:536] Agent resources: cpus(*):2; mem(*):1024; disk(*):1024;
ports(*):[31000-32000]
I0529 22:56:18.218348 25792 slave.cpp:544] Agent attributes: [  ]
I0529 22:56:18.218374 25792 slave.cpp:549] Agent hostname: bfa2603b6292
I0529 22:56:18.218586 25787 status_update_manager.cpp:177] Pausing sending status updates
I0529 22:56:18.220513 25787 state.cpp:62] Recovering state from '/tmp/Endpoint_SlaveEndpointTest_UnauthorizedRequest_2_sIvuiS/meta'
I0529 22:56:18.220845 25790 status_update_manager.cpp:203] Recovering status update manager
I0529 22:56:18.221086 25788 containerizer.cpp:582] Recovering containerizer
I0529 22:56:18.222764 25789 provisioner.cpp:416] Provisioner recovery complete
I0529 22:56:18.223168 25785 slave.cpp:6083] Finished recovery
I0529 22:56:18.223688 25785 slave.cpp:6265] Querying resource estimator for oversubscribable
resources
I0529 22:56:18.224046 25786 slave.cpp:6279] Received oversubscribable resources {} from the
resource estimator
I0529 22:56:18.226742 25788 process.cpp:3730] Handling HTTP event for process 'slave(757)'
with path: '/slave(757)/containers'
I0529 22:56:18.228513 25786 http.cpp:1115] HTTP GET for /slave(757)/containers from 172.17.0.3:41394
I0529 22:56:18.228673 25786 http.cpp:936] Authorizing principal 'test-principal' to GET the
'/containers' endpoint
I0529 22:56:18.230836 25799 slave.cpp:801] Agent terminating
[       OK ] Endpoint/SlaveEndpointTest.UnauthorizedRequest/2 (31 ms)
[ RUN      ] Endpoint/SlaveEndpointTest.NoAuthorizer/0
I0529 22:56:18.244947  7903 containerizer.cpp:230] Using isolation: posix/cpu,posix/mem,filesystem/posix,network/cni,environment_secret
W0529 22:56:18.245679  7903 backend.cpp:76] Failed to create 'aufs' backend: AufsBackend requires
root privileges
W0529 22:56:18.245815  7903 backend.cpp:76] Failed to create 'bind' backend: BindBackend requires
root privileges
I0529 22:56:18.245862  7903 provisioner.cpp:255] Using default backend 'copy'
I0529 22:56:18.248178  7903 cluster.cpp:448] Creating default 'local' authorizer
I0529 22:56:18.250474 25786 slave.cpp:232] Mesos agent started on (758)@172.17.0.3:57574
I0529 22:56:18.250499 25786 slave.cpp:233] Flags at startup: --acls="" --appc_simple_discovery_uri_prefix="http://"
--appc_store_dir="/tmp/mesos/store/appc" --authenticate_http_executors="true" --authenticate_http_readonly="true"
--authenticate_http_readwrite="true" --authenticatee="crammd5" --authentication_backoff_factor="1secs"
--authorizer="local" --cgroups_cpu_enable_pids_and_tids_count="false" --cgroups_enable_cfs="false"
--cgroups_hierarchy="/sys/fs/cgroup" --cgroups_limit_swap="false" --cgroups_root="mesos" --container_disk_watch_interval="15secs"
--containerizers="mesos" --credential="/tmp/Endpoint_SlaveEndpointTest_NoAuthorizer_0_pT1Ulq/credential"
--default_role="*" --disk_watch_interval="1mins" --docker="docker" --docker_kill_orphans="true"
--docker_registry="https://registry-1.docker.io" --docker_remove_delay="6hrs" --docker_socket="/var/run/docker.sock"
--docker_stop_timeout="0ns" --docker_store_dir="/tmp/mesos/store/docker" --docker_volume_checkpoint_dir="/var/run/mesos/isolators/docker/volume"
--enforce_container_disk_quota="false" --executor_registration_timeout="1mins" --executor_reregistration_timeout="2secs"
--executor_secret_key="/tmp/Endpoint_SlaveEndpointTest_NoAuthorizer_0_pT1Ulq/executor_secret_key"
--executor_shutdown_grace_period="5secs" --fetcher_cache_dir="/tmp/Endpoint_SlaveEndpointTest_NoAuthorizer_0_pT1Ulq/fetch"
--fetcher_cache_size="2GB" --frameworks_home="" --gc_delay="1weeks" --gc_disk_headroom="0.1"
--hadoop_home="" --help="false" --hostname_lookup="true" --http_command_executor="false" --http_credentials="/tmp/Endpoint_SlaveEndpointTest_NoAuthorizer_0_pT1Ulq/http_credentials"
--http_heartbeat_interval="30secs" --initialize_driver_logging="true" --isolation="posix/cpu,posix/mem"
--launcher="posix" --launcher_dir="/mesos/mesos-1.4.0/_build/src" --logbufsecs="0" --logging_level="INFO"
--max_completed_executors_per_framework="150" --oversubscribed_resources_interval="15secs"
--perf_duration="10secs" --perf_interval="1mins" --port="5051" --qos_correction_interval_min="0ns"
--quiet="false" --recover="reconnect" --recovery_timeout="15mins" --registration_backoff_factor="10ms"
--resources="cpus:2;gpus:0;mem:1024;disk:1024;ports:[31000-32000]" --revocable_cpu_low_priority="true"
--runtime_dir="/tmp/Endpoint_SlaveEndpointTest_NoAuthorizer_0_pT1Ulq" --sandbox_directory="/mnt/mesos/sandbox"
--strict="true" --switch_user="true" --systemd_enable_support="true" --systemd_runtime_directory="/run/systemd/system"
--version="false" --work_dir="/tmp/Endpoint_SlaveEndpointTest_NoAuthorizer_0_0hKiIU"
I0529 22:56:18.251077 25786 credentials.hpp:86] Loading credential for authentication from
'/tmp/Endpoint_SlaveEndpointTest_NoAuthorizer_0_pT1Ulq/credential'
I0529 22:56:18.251266 25786 slave.cpp:265] Agent using credential for: test-principal
I0529 22:56:18.251288 25786 credentials.hpp:37] Loading credentials for authentication from
'/tmp/Endpoint_SlaveEndpointTest_NoAuthorizer_0_pT1Ulq/http_credentials'
I0529 22:56:18.251613 25786 http.cpp:975] Creating default 'basic' HTTP authenticator for
realm 'mesos-agent-executor'
I0529 22:56:18.251734 25786 http.cpp:996] Creating default 'jwt' HTTP authenticator for realm
'mesos-agent-executor'
I0529 22:56:18.251981 25786 http.cpp:975] Creating default 'basic' HTTP authenticator for
realm 'mesos-agent-readonly'
I0529 22:56:18.252084 25786 http.cpp:996] Creating default 'jwt' HTTP authenticator for realm
'mesos-agent-readonly'
I0529 22:56:18.252357 25786 http.cpp:975] Creating default 'basic' HTTP authenticator for
realm 'mesos-agent-readwrite'
I0529 22:56:18.252473 25786 http.cpp:996] Creating default 'jwt' HTTP authenticator for realm
'mesos-agent-readwrite'
I0529 22:56:18.253783 25786 slave.cpp:536] Agent resources: cpus(*):2; mem(*):1024; disk(*):1024;
ports(*):[31000-32000]
I0529 22:56:18.253859 25786 slave.cpp:544] Agent attributes: [  ]
I0529 22:56:18.253881 25786 slave.cpp:549] Agent hostname: bfa2603b6292
I0529 22:56:18.254232 25796 status_update_manager.cpp:177] Pausing sending status updates
I0529 22:56:18.255750 25788 state.cpp:62] Recovering state from '/tmp/Endpoint_SlaveEndpointTest_NoAuthorizer_0_0hKiIU/meta'
I0529 22:56:18.256199 25789 status_update_manager.cpp:203] Recovering status update manager
I0529 22:56:18.256549 25793 containerizer.cpp:582] Recovering containerizer
I0529 22:56:18.258059 25794 provisioner.cpp:416] Provisioner recovery complete
I0529 22:56:18.258497 25791 slave.cpp:6083] Finished recovery
I0529 22:56:18.259121 25791 slave.cpp:6265] Querying resource estimator for oversubscribable
resources
I0529 22:56:18.259394 25790 slave.cpp:6279] Received oversubscribable resources {} from the
resource estimator
I0529 22:56:18.262042 25790 process.cpp:3730] Handling HTTP event for process 'slave(758)'
with path: '/slave(758)/monitor/statistics'
I0529 22:56:18.263959 25788 http.cpp:1115] HTTP GET for /slave(758)/monitor/statistics from
172.17.0.3:41396
I0529 22:56:18.264053 25788 http.cpp:936] Authorizing principal 'test-principal' to GET the
'/monitor/statistics' endpoint
I0529 22:56:18.267235 25791 slave.cpp:801] Agent terminating
[       OK ] Endpoint/SlaveEndpointTest.NoAuthorizer/0 (36 ms)
[ RUN      ] Endpoint/SlaveEndpointTest.NoAuthorizer/1
I0529 22:56:18.278826  7903 containerizer.cpp:230] Using isolation: posix/cpu,posix/mem,filesystem/posix,network/cni,environment_secret
W0529 22:56:18.279381  7903 backend.cpp:76] Failed to create 'aufs' backend: AufsBackend requires
root privileges
W0529 22:56:18.279492  7903 backend.cpp:76] Failed to create 'bind' backend: BindBackend requires
root privileges
I0529 22:56:18.279538  7903 provisioner.cpp:255] Using default backend 'copy'
I0529 22:56:18.281296  7903 cluster.cpp:448] Creating default 'local' authorizer
I0529 22:56:18.282785 25794 slave.cpp:232] Mesos agent started on (759)@172.17.0.3:57574
I0529 22:56:18.282809 25794 slave.cpp:233] Flags at startup: --acls="" --appc_simple_discovery_uri_prefix="http://"
--appc_store_dir="/tmp/mesos/store/appc" --authenticate_http_executors="true" --authenticate_http_readonly="true"
--authenticate_http_readwrite="true" --authenticatee="crammd5" --authentication_backoff_factor="1secs"
--authorizer="local" --cgroups_cpu_enable_pids_and_tids_count="false" --cgroups_enable_cfs="false"
--cgroups_hierarchy="/sys/fs/cgroup" --cgroups_limit_swap="false" --cgroups_root="mesos" --container_disk_watch_interval="15secs"
--containerizers="mesos" --credential="/tmp/Endpoint_SlaveEndpointTest_NoAuthorizer_1_Xjpiet/credential"
--default_role="*" --disk_watch_interval="1mins" --docker="docker" --docker_kill_orphans="true"
--docker_registry="https://registry-1.docker.io" --docker_remove_delay="6hrs" --docker_socket="/var/run/docker.sock"
--docker_stop_timeout="0ns" --docker_store_dir="/tmp/mesos/store/docker" --docker_volume_checkpoint_dir="/var/run/mesos/isolators/docker/volume"
--enforce_container_disk_quota="false" --executor_registration_timeout="1mins" --executor_reregistration_timeout="2secs"
--executor_secret_key="/tmp/Endpoint_SlaveEndpointTest_NoAuthorizer_1_Xjpiet/executor_secret_key"
--executor_shutdown_grace_period="5secs" --fetcher_cache_dir="/tmp/Endpoint_SlaveEndpointTest_NoAuthorizer_1_Xjpiet/fetch"
--fetcher_cache_size="2GB" --frameworks_home="" --gc_delay="1weeks" --gc_disk_headroom="0.1"
--hadoop_home="" --help="false" --hostname_lookup="true" --http_command_executor="false" --http_credentials="/tmp/Endpoint_SlaveEndpointTest_NoAuthorizer_1_Xjpiet/http_credentials"
--http_heartbeat_interval="30secs" --initialize_driver_logging="true" --isolation="posix/cpu,posix/mem"
--launcher="posix" --launcher_dir="/mesos/mesos-1.4.0/_build/src" --logbufsecs="0" --logging_level="INFO"
--max_completed_executors_per_framework="150" --oversubscribed_resources_interval="15secs"
--perf_duration="10secs" --perf_interval="1mins" --port="5051" --qos_correction_interval_min="0ns"
--quiet="false" --recover="reconnect" --recovery_timeout="15mins" --registration_backoff_factor="10ms"
--resources="cpus:2;gpus:0;mem:1024;disk:1024;ports:[31000-32000]" --revocable_cpu_low_priority="true"
--runtime_dir="/tmp/Endpoint_SlaveEndpointTest_NoAuthorizer_1_Xjpiet" --sandbox_directory="/mnt/mesos/sandbox"
--strict="true" --switch_user="true" --systemd_enable_support="true" --systemd_runtime_directory="/run/systemd/system"
--version="false" --work_dir="/tmp/Endpoint_SlaveEndpointTest_NoAuthorizer_1_YpXUuX"
I0529 22:56:18.283339 25794 credentials.hpp:86] Loading credential for authentication from
'/tmp/Endpoint_SlaveEndpointTest_NoAuthorizer_1_Xjpiet/credential'
I0529 22:56:18.283525 25794 slave.cpp:265] Agent using credential for: test-principal
I0529 22:56:18.283550 25794 credentials.hpp:37] Loading credentials for authentication from
'/tmp/Endpoint_SlaveEndpointTest_NoAuthorizer_1_Xjpiet/http_credentials'
I0529 22:56:18.283912 25794 http.cpp:975] Creating default 'basic' HTTP authenticator for
realm 'mesos-agent-executor'
I0529 22:56:18.284040 25794 http.cpp:996] Creating default 'jwt' HTTP authenticator for realm
'mesos-agent-executor'
I0529 22:56:18.284286 25794 http.cpp:975] Creating default 'basic' HTTP authenticator for
realm 'mesos-agent-readonly'
I0529 22:56:18.284399 25794 http.cpp:996] Creating default 'jwt' HTTP authenticator for realm
'mesos-agent-readonly'
I0529 22:56:18.284597 25794 http.cpp:975] Creating default 'basic' HTTP authenticator for
realm 'mesos-agent-readwrite'
I0529 22:56:18.284698 25794 http.cpp:996] Creating default 'jwt' HTTP authenticator for realm
'mesos-agent-readwrite'
I0529 22:56:18.286651 25794 slave.cpp:536] Agent resources: cpus(*):2; mem(*):1024; disk(*):1024;
ports(*):[31000-32000]
I0529 22:56:18.286769 25794 slave.cpp:544] Agent attributes: [  ]
I0529 22:56:18.286793 25794 slave.cpp:549] Agent hostname: bfa2603b6292
I0529 22:56:18.287010 25793 status_update_manager.cpp:177] Pausing sending status updates
I0529 22:56:18.288923 25791 state.cpp:62] Recovering state from '/tmp/Endpoint_SlaveEndpointTest_NoAuthorizer_1_YpXUuX/meta'
I0529 22:56:18.289362 25789 status_update_manager.cpp:203] Recovering status update manager
I0529 22:56:18.289561 25798 containerizer.cpp:582] Recovering containerizer
I0529 22:56:18.291277 25792 provisioner.cpp:416] Provisioner recovery complete
I0529 22:56:18.291662 25786 slave.cpp:6083] Finished recovery
I0529 22:56:18.292204 25786 slave.cpp:6265] Querying resource estimator for oversubscribable
resources
I0529 22:56:18.292502 25784 slave.cpp:6279] Received oversubscribable resources {} from the
resource estimator
I0529 22:56:18.295081 25790 process.cpp:3730] Handling HTTP event for process 'slave(759)'
with path: '/slave(759)/monitor/statistics.json'
I0529 22:56:18.296792 25790 http.cpp:1115] HTTP GET for /slave(759)/monitor/statistics.json
from 172.17.0.3:41397
I0529 22:56:18.296870 25790 http.cpp:936] Authorizing principal 'test-principal' to GET the
'/monitor/statistics.json' endpoint
I0529 22:56:18.299783 25796 slave.cpp:801] Agent terminating
[       OK ] Endpoint/SlaveEndpointTest.NoAuthorizer/1 (31 ms)
[ RUN      ] Endpoint/SlaveEndpointTest.NoAuthorizer/2
I0529 22:56:18.309943  7903 containerizer.cpp:230] Using isolation: posix/cpu,posix/mem,filesystem/posix,network/cni,environment_secret
W0529 22:56:18.310468  7903 backend.cpp:76] Failed to create 'aufs' backend: AufsBackend requires
root privileges
W0529 22:56:18.310580  7903 backend.cpp:76] Failed to create 'bind' backend: BindBackend requires
root privileges
I0529 22:56:18.310626  7903 provisioner.cpp:255] Using default backend 'copy'
I0529 22:56:18.312427  7903 cluster.cpp:448] Creating default 'local' authorizer
I0529 22:56:18.313913 25790 slave.cpp:232] Mesos agent started on (760)@172.17.0.3:57574
I0529 22:56:18.314087 25790 slave.cpp:233] Flags at startup: --acls="" --appc_simple_discovery_uri_prefix="http://"
--appc_store_dir="/tmp/mesos/store/appc" --authenticate_http_executors="true" --authenticate_http_readonly="true"
--authenticate_http_readwrite="true" --authenticatee="crammd5" --authentication_backoff_factor="1secs"
--authorizer="local" --cgroups_cpu_enable_pids_and_tids_count="false" --cgroups_enable_cfs="false"
--cgroups_hierarchy="/sys/fs/cgroup" --cgroups_limit_swap="false" --cgroups_root="mesos" --container_disk_watch_interval="15secs"
--containerizers="mesos" --credential="/tmp/Endpoint_SlaveEndpointTest_NoAuthorizer_2_H6gerw/credential"
--default_role="*" --disk_watch_interval="1mins" --docker="docker" --docker_kill_orphans="true"
--docker_registry="https://registry-1.docker.io" --docker_remove_delay="6hrs" --docker_socket="/var/run/docker.sock"
--docker_stop_timeout="0ns" --docker_store_dir="/tmp/mesos/store/docker" --docker_volume_checkpoint_dir="/var/run/mesos/isolators/docker/volume"
--enforce_container_disk_quota="false" --executor_registration_timeout="1mins" --executor_reregistration_timeout="2secs"
--executor_secret_key="/tmp/Endpoint_SlaveEndpointTest_NoAuthorizer_2_H6gerw/executor_secret_key"
--executor_shutdown_grace_period="5secs" --fetcher_cache_dir="/tmp/Endpoint_SlaveEndpointTest_NoAuthorizer_2_H6gerw/fetch"
--fetcher_cache_size="2GB" --frameworks_home="" --gc_delay="1weeks" --gc_disk_headroom="0.1"
--hadoop_home="" --help="false" --hostname_lookup="true" --http_command_executor="false" --http_credentials="/tmp/Endpoint_SlaveEndpointTest_NoAuthorizer_2_H6gerw/http_credentials"
--http_heartbeat_interval="30secs" --initialize_driver_logging="true" --isolation="posix/cpu,posix/mem"
--launcher="posix" --launcher_dir="/mesos/mesos-1.4.0/_build/src" --logbufsecs="0" --logging_level="INFO"
--max_completed_executors_per_framework="150" --oversubscribed_resources_interval="15secs"
--perf_duration="10secs" --perf_interval="1mins" --port="5051" --qos_correction_interval_min="0ns"
--quiet="false" --recover="reconnect" --recovery_timeout="15mins" --registration_backoff_factor="10ms"
--resources="cpus:2;gpus:0;mem:1024;disk:1024;ports:[31000-32000]" --revocable_cpu_low_priority="true"
--runtime_dir="/tmp/Endpoint_SlaveEndpointTest_NoAuthorizer_2_H6gerw" --sandbox_directory="/mnt/mesos/sandbox"
--strict="true" --switch_user="true" --systemd_enable_support="true" --systemd_runtime_directory="/run/systemd/system"
--version="false" --work_dir="/tmp/Endpoint_SlaveEndpointTest_NoAuthorizer_2_ux3MC0"
I0529 22:56:18.314474 25790 credentials.hpp:86] Loading credential for authentication from
'/tmp/Endpoint_SlaveEndpointTest_NoAuthorizer_2_H6gerw/credential'
I0529 22:56:18.314695 25790 slave.cpp:265] Agent using credential for: test-principal
I0529 22:56:18.314721 25790 credentials.hpp:37] Loading credentials for authentication from
'/tmp/Endpoint_SlaveEndpointTest_NoAuthorizer_2_H6gerw/http_credentials'
I0529 22:56:18.315121 25790 http.cpp:975] Creating default 'basic' HTTP authenticator for
realm 'mesos-agent-executor'
I0529 22:56:18.315274 25790 http.cpp:996] Creating default 'jwt' HTTP authenticator for realm
'mesos-agent-executor'
I0529 22:56:18.315510 25790 http.cpp:975] Creating default 'basic' HTTP authenticator for
realm 'mesos-agent-readonly'
I0529 22:56:18.315627 25790 http.cpp:996] Creating default 'jwt' HTTP authenticator for realm
'mesos-agent-readonly'
I0529 22:56:18.315902 25790 http.cpp:975] Creating default 'basic' HTTP authenticator for
realm 'mesos-agent-readwrite'
I0529 22:56:18.316112 25790 http.cpp:996] Creating default 'jwt' HTTP authenticator for realm
'mesos-agent-readwrite'
I0529 22:56:18.317436 25790 slave.cpp:536] Agent resources: cpus(*):2; mem(*):1024; disk(*):1024;
ports(*):[31000-32000]
I0529 22:56:18.317512 25790 slave.cpp:544] Agent attributes: [  ]
I0529 22:56:18.317596 25790 slave.cpp:549] Agent hostname: bfa2603b6292
I0529 22:56:18.317765 25797 status_update_manager.cpp:177] Pausing sending status updates
I0529 22:56:18.319157 25795 state.cpp:62] Recovering state from '/tmp/Endpoint_SlaveEndpointTest_NoAuthorizer_2_ux3MC0/meta'
I0529 22:56:18.319563 25786 status_update_manager.cpp:203] Recovering status update manager
I0529 22:56:18.319759 25799 containerizer.cpp:582] Recovering containerizer
I0529 22:56:18.322594 25784 provisioner.cpp:416] Provisioner recovery complete
I0529 22:56:18.323866 25784 slave.cpp:6083] Finished recovery
I0529 22:56:18.325402 25784 slave.cpp:6265] Querying resource estimator for oversubscribable
resources
I0529 22:56:18.326422 25793 slave.cpp:6279] Received oversubscribable resources {} from the
resource estimator
I0529 22:56:18.328672 25787 process.cpp:3730] Handling HTTP event for process 'slave(760)'
with path: '/slave(760)/containers'
I0529 22:56:18.330560 25792 http.cpp:1115] HTTP GET for /slave(760)/containers from 172.17.0.3:41399
I0529 22:56:18.330884 25792 http.cpp:936] Authorizing principal 'test-principal' to GET the
'/containers' endpoint
I0529 22:56:18.334115 25797 slave.cpp:801] Agent terminating
[       OK ] Endpoint/SlaveEndpointTest.NoAuthorizer/2 (34 ms)
[----------] 9 tests from Endpoint/SlaveEndpointTest (332 ms total)

[----------] Global test environment tear-down
[==========] 1584 tests from 177 test cases ran. (498461 ms total)
[  PASSED  ] 1583 tests.
[  FAILED  ] 1 test, listed below:
[  FAILED  ] FaultToleranceTest.SchedulerReregisterAfterFailoverTimeout

 1 FAILED TEST
  YOU HAVE 22 DISABLED TESTS

E0529 22:56:18.400260 25800 process.cpp:950] Failed to accept socket: future discarded
make[4]: *** [check-local] Error 1
make[4]: Leaving directory `/mesos/mesos-1.4.0/_build/src'
make[3]: *** [check-am] Error 2
make[3]: Leaving directory `/mesos/mesos-1.4.0/_build/src'
make[2]: *** [check] Error 2
make[2]: Leaving directory `/mesos/mesos-1.4.0/_build/src'
make[1]: *** [check-recursive] Error 1
make[1]: Leaving directory `/mesos/mesos-1.4.0/_build'
make: *** [distcheck] Error 1
+ docker rmi mesos-1496095871-9243
Untagged: mesos-1496095871-9243:latest
Deleted: sha256:4843792be07914c807897c73f8546b37f50001519dfc217d1512ead09b10998c
Deleted: sha256:3fc0b96a20eedcdb412d213e7bf3e5cf676cb299185ead0691ef967bf3f88c45
Deleted: sha256:260933994b326d90cdeb782f134456b76a7581068a4fc72f091497baa0b1ccf3
Deleted: sha256:35135f659ecea80c78ffa200fe179629b49c025abbffabd12d0735e3f7c35aba
Deleted: sha256:fd2c8052791d712489ad5c6c40a50bb668c22428344c057e0ab721bbe07a6370
Deleted: sha256:30540a53a3e286819c38cb3a10ec959eee627c5ab4fb520920331d0383f66fc6
Deleted: sha256:4e53768767b2a3378f5aa7a47a816116316d20c811855a3267d8e9cf314b3ffd
Deleted: sha256:a4a831ce824adf66c161cf8658511cf6ec1e70a4b9bcf923198b9b6a18ba88cd
Deleted: sha256:35a3cbc6c6b452509bbe5b7e60179ea243d2fbeb305cb31ff4aae6f8cdae99b2
Deleted: sha256:26ace12fe7333c53bfea0c5ae4aa7f5bc6eb6b4854a11451fa4305d59f8033f9
Deleted: sha256:e9db7bf296ba184068e76e75a47c8cc0af3682b2edac0922d80a495f49bb74ec
Deleted: sha256:1ddd8b9d35e56612c4db5a48eb556866f8a0dbcffa4b31511853d271ae5dbf68
Deleted: sha256:c1903305c711026c4d9823a56f0a731e32ae901c972f1702f3d34ebdf5e511d5
Deleted: sha256:dea9f3f44059de8f7c688ec6f86df95fcb61a516e1c57696213b39c831e258df
Deleted: sha256:82111ffb3b8763fc36b542da6be4ff831c76b00bd624ca91511bfd7df78e59a3
Deleted: sha256:73dbde2f60355b5a1962adbc1f8141c1a23ddbdc8dd2a13cb7c031a7f53a7870
Deleted: sha256:20784ad50a75fe24c61c296f585131060cef0485a75d753ae9703f7a7d79f4ef
Deleted: sha256:dba519ecaf367c3de3c82d41ffec53188216253425888d3a7b6ba35b57108223
Deleted: sha256:ad33845321f27534c60745c03aa61d6937090fb1d20ed2d314a45d130d66ea33
Deleted: sha256:57fda784e6bdcc5f12d6920f8f77b404ecf10135f8c0f75e3fe9c3f0f7f37950
Deleted: sha256:0993cf8469a9c4309de093481940b953adf9d2e0aab7c2dcf6673c4f43dae4ef
Deleted: sha256:b3e247f2e34327fdaad9507667a53319d7223f71d695721fe161a52086410032
Deleted: sha256:836ddff76f8a5a91756e714aeb047c71fb88b3b22d9e10fb568e732b066915e2
Deleted: sha256:12cb587d7b14046d5bd9261e5e4f18f65467034be061a38a8b70e1327aa23904
Deleted: sha256:f17fd54e038c572bc5f344886f208a540cd293d879d43ac90fa333c828bb09a0
Build step 'Execute shell' marked build as failure
Not sending mail to unregistered user neil.conway@gmail.com

Mime
View raw message