mesos-builds mailing list archives

Site index · List index
Message view « Date » · « Thread »
Top « Date » · « Thread »
From Apache Jenkins Server <jenk...@builds.apache.org>
Subject Build failed in Jenkins: Mesos-Buildbot » cmake,clang,--verbose --enable-libevent --enable-ssl,GLOG_v=1 MESOS_VERBOSE=1,ubuntu:14.04,(docker||Hadoop)&&(!ubuntu-us1)&&(!ubuntu-eu2) #3719
Date Wed, 24 May 2017 19:07:03 GMT
See <https://builds.apache.org/job/Mesos-Buildbot/BUILDTOOL=cmake,COMPILER=clang,CONFIGURATION=--verbose%20--enable-libevent%20--enable-ssl,ENVIRONMENT=GLOG_v=1%20MESOS_VERBOSE=1,OS=ubuntu%3A14.04,label_exp=(docker%7C%7CHadoop)&&(!ubuntu-us1)&&(!ubuntu-eu2)/3719/display/redirect?page=changes>

Changes:

[neil.conway] Renamed RegisterAgent.agent to RegisterAgent.agents in acls.proto.

------------------------------------------
[...truncated 26.42 MB...]
I0524 19:06:57.953800 31695 slave.cpp:6152] Querying resource estimator for oversubscribable
resources
I0524 19:06:57.953981 31695 slave.cpp:6166] Received oversubscribable resources {} from the
resource estimator
I0524 19:06:57.955224 31692 process.cpp:3731] Handling HTTP event for process 'slave(743)'
with path: '/slave(743)/containers'
I0524 19:06:57.955719 31692 http.cpp:1115] HTTP GET for /slave(743)/containers from 172.17.0.2:48299
I0524 19:06:57.955765 31692 http.cpp:936] Authorizing principal 'test-principal' to GET the
'/containers' endpoint
I0524 19:06:57.957263 31691 slave.cpp:790] Agent terminating
[       OK ] Endpoint/SlaveEndpointTest.AuthorizedRequest/2 (17 ms)
[ RUN      ] Endpoint/SlaveEndpointTest.UnauthorizedRequest/0
I0524 19:06:57.964217 25996 containerizer.cpp:221] Using isolation: posix/cpu,posix/mem,filesystem/posix,network/cni
W0524 19:06:57.964668 25996 backend.cpp:76] Failed to create 'aufs' backend: AufsBackend requires
root privileges
W0524 19:06:57.964721 25996 backend.cpp:76] Failed to create 'bind' backend: BindBackend requires
root privileges
I0524 19:06:57.964761 25996 provisioner.cpp:249] Using default backend 'copy'
I0524 19:06:57.966331 31694 slave.cpp:225] Mesos agent started on (744)@172.17.0.2:49651
I0524 19:06:57.966365 31694 slave.cpp:226] Flags at startup: --acls="" --appc_simple_discovery_uri_prefix="http://"
--appc_store_dir="/tmp/mesos/store/appc" --authenticate_http_executors="true" --authenticate_http_readonly="true"
--authenticate_http_readwrite="true" --authenticatee="crammd5" --authentication_backoff_factor="1secs"
--authorizer="local" --cgroups_cpu_enable_pids_and_tids_count="false" --cgroups_enable_cfs="false"
--cgroups_hierarchy="/sys/fs/cgroup" --cgroups_limit_swap="false" --cgroups_root="mesos" --container_disk_watch_interval="15secs"
--containerizers="mesos" --credential="/tmp/Endpoint_SlaveEndpointTest_UnauthorizedRequest_0_DOwtDI/credential"
--default_role="*" --disk_watch_interval="1mins" --docker="docker" --docker_kill_orphans="true"
--docker_registry="https://registry-1.docker.io" --docker_remove_delay="6hrs" --docker_socket="/var/run/docker.sock"
--docker_stop_timeout="0ns" --docker_store_dir="/tmp/mesos/store/docker" --docker_volume_checkpoint_dir="/var/run/mesos/isolators/docker/volume"
--enforce_container_disk_quota="false" --executor_registration_timeout="1mins" --executor_secret_key="/tmp/Endpoint_SlaveEndpointTest_UnauthorizedRequest_0_DOwtDI/executor_secret_key"
--executor_shutdown_grace_period="5secs" --fetcher_cache_dir="/tmp/Endpoint_SlaveEndpointTest_UnauthorizedRequest_0_DOwtDI/fetch"
--fetcher_cache_size="2GB" --frameworks_home="" --gc_delay="1weeks" --gc_disk_headroom="0.1"
--hadoop_home="" --help="false" --hostname_lookup="true" --http_command_executor="false" --http_credentials="/tmp/Endpoint_SlaveEndpointTest_UnauthorizedRequest_0_DOwtDI/http_credentials"
--http_heartbeat_interval="30secs" --initialize_driver_logging="true" --isolation="posix/cpu,posix/mem"
--launcher="posix" --launcher_dir="/mesos/build/src" --logbufsecs="0" --logging_level="INFO"
--max_completed_executors_per_framework="150" --oversubscribed_resources_interval="15secs"
--perf_duration="10secs" --perf_interval="1mins" --port="5051" --qos_correction_interval_min="0ns"
--quiet="false" --recover="reconnect" --recovery_timeout="15mins" --registration_backoff_factor="10ms"
--resources="cpus:2;gpus:0;mem:1024;disk:1024;ports:[31000-32000]" --revocable_cpu_low_priority="true"
--runtime_dir="/tmp/Endpoint_SlaveEndpointTest_UnauthorizedRequest_0_DOwtDI" --sandbox_directory="/mnt/mesos/sandbox"
--strict="true" --switch_user="true" --systemd_enable_support="true" --systemd_runtime_directory="/run/systemd/system"
--version="false" --work_dir="/tmp/Endpoint_SlaveEndpointTest_UnauthorizedRequest_0_TLPOj8"
I0524 19:06:57.966586 31694 credentials.hpp:86] Loading credential for authentication from
'/tmp/Endpoint_SlaveEndpointTest_UnauthorizedRequest_0_DOwtDI/credential'
I0524 19:06:57.966724 31694 slave.cpp:258] Agent using credential for: test-principal
I0524 19:06:57.966740 31694 credentials.hpp:37] Loading credentials for authentication from
'/tmp/Endpoint_SlaveEndpointTest_UnauthorizedRequest_0_DOwtDI/http_credentials'
I0524 19:06:57.966899 31694 http.cpp:975] Creating default 'basic' HTTP authenticator for
realm 'mesos-agent-executor'
I0524 19:06:57.966944 31694 http.cpp:996] Creating default 'jwt' HTTP authenticator for realm
'mesos-agent-executor'
I0524 19:06:57.966998 31694 http.cpp:975] Creating default 'basic' HTTP authenticator for
realm 'mesos-agent-readonly'
I0524 19:06:57.967025 31694 http.cpp:996] Creating default 'jwt' HTTP authenticator for realm
'mesos-agent-readonly'
I0524 19:06:57.967059 31694 http.cpp:975] Creating default 'basic' HTTP authenticator for
realm 'mesos-agent-readwrite'
I0524 19:06:57.967128 31694 http.cpp:996] Creating default 'jwt' HTTP authenticator for realm
'mesos-agent-readwrite'
I0524 19:06:57.967682 31694 slave.cpp:525] Agent resources: cpus(*):2; mem(*):1024; disk(*):1024;
ports(*):[31000-32000]
I0524 19:06:57.967747 31694 slave.cpp:533] Agent attributes: [  ]
I0524 19:06:57.967769 31694 slave.cpp:538] Agent hostname: e617c29d27e1
I0524 19:06:57.967874 31683 status_update_manager.cpp:177] Pausing sending status updates
I0524 19:06:57.968323 31685 state.cpp:62] Recovering state from '/tmp/Endpoint_SlaveEndpointTest_UnauthorizedRequest_0_TLPOj8/meta'
I0524 19:06:57.968612 31687 status_update_manager.cpp:203] Recovering status update manager
I0524 19:06:57.968724 31687 containerizer.cpp:608] Recovering containerizer
I0524 19:06:57.969419 31685 provisioner.cpp:410] Provisioner recovery complete
I0524 19:06:57.969615 31685 slave.cpp:5970] Finished recovery
I0524 19:06:57.970038 31685 slave.cpp:6152] Querying resource estimator for oversubscribable
resources
I0524 19:06:57.970142 31683 slave.cpp:6166] Received oversubscribable resources {} from the
resource estimator
I0524 19:06:57.971066 31683 process.cpp:3731] Handling HTTP event for process 'slave(744)'
with path: '/slave(744)/monitor/statistics'
I0524 19:06:57.971751 31685 http.cpp:1115] HTTP GET for /slave(744)/monitor/statistics from
172.17.0.2:48300
I0524 19:06:57.971842 31685 http.cpp:936] Authorizing principal 'test-principal' to GET the
'/monitor/statistics' endpoint
I0524 19:06:57.972896 25996 slave.cpp:790] Agent terminating
[       OK ] Endpoint/SlaveEndpointTest.UnauthorizedRequest/0 (15 ms)
[ RUN      ] Endpoint/SlaveEndpointTest.UnauthorizedRequest/1
I0524 19:06:57.978601 25996 containerizer.cpp:221] Using isolation: posix/cpu,posix/mem,filesystem/posix,network/cni
W0524 19:06:57.978935 25996 backend.cpp:76] Failed to create 'aufs' backend: AufsBackend requires
root privileges
W0524 19:06:57.978977 25996 backend.cpp:76] Failed to create 'bind' backend: BindBackend requires
root privileges
I0524 19:06:57.979064 25996 provisioner.cpp:249] Using default backend 'copy'
I0524 19:06:57.980250 31687 slave.cpp:225] Mesos agent started on (745)@172.17.0.2:49651
I0524 19:06:57.980279 31687 slave.cpp:226] Flags at startup: --acls="" --appc_simple_discovery_uri_prefix="http://"
--appc_store_dir="/tmp/mesos/store/appc" --authenticate_http_executors="true" --authenticate_http_readonly="true"
--authenticate_http_readwrite="true" --authenticatee="crammd5" --authentication_backoff_factor="1secs"
--authorizer="local" --cgroups_cpu_enable_pids_and_tids_count="false" --cgroups_enable_cfs="false"
--cgroups_hierarchy="/sys/fs/cgroup" --cgroups_limit_swap="false" --cgroups_root="mesos" --container_disk_watch_interval="15secs"
--containerizers="mesos" --credential="/tmp/Endpoint_SlaveEndpointTest_UnauthorizedRequest_1_Drit23/credential"
--default_role="*" --disk_watch_interval="1mins" --docker="docker" --docker_kill_orphans="true"
--docker_registry="https://registry-1.docker.io" --docker_remove_delay="6hrs" --docker_socket="/var/run/docker.sock"
--docker_stop_timeout="0ns" --docker_store_dir="/tmp/mesos/store/docker" --docker_volume_checkpoint_dir="/var/run/mesos/isolators/docker/volume"
--enforce_container_disk_quota="false" --executor_registration_timeout="1mins" --executor_secret_key="/tmp/Endpoint_SlaveEndpointTest_UnauthorizedRequest_1_Drit23/executor_secret_key"
--executor_shutdown_grace_period="5secs" --fetcher_cache_dir="/tmp/Endpoint_SlaveEndpointTest_UnauthorizedRequest_1_Drit23/fetch"
--fetcher_cache_size="2GB" --frameworks_home="" --gc_delay="1weeks" --gc_disk_headroom="0.1"
--hadoop_home="" --help="false" --hostname_lookup="true" --http_command_executor="false" --http_credentials="/tmp/Endpoint_SlaveEndpointTest_UnauthorizedRequest_1_Drit23/http_credentials"
--http_heartbeat_interval="30secs" --initialize_driver_logging="true" --isolation="posix/cpu,posix/mem"
--launcher="posix" --launcher_dir="/mesos/build/src" --logbufsecs="0" --logging_level="INFO"
--max_completed_executors_per_framework="150" --oversubscribed_resources_interval="15secs"
--perf_duration="10secs" --perf_interval="1mins" --port="5051" --qos_correction_interval_min="0ns"
--quiet="false" --recover="reconnect" --recovery_timeout="15mins" --registration_backoff_factor="10ms"
--resources="cpus:2;gpus:0;mem:1024;disk:1024;ports:[31000-32000]" --revocable_cpu_low_priority="true"
--runtime_dir="/tmp/Endpoint_SlaveEndpointTest_UnauthorizedRequest_1_Drit23" --sandbox_directory="/mnt/mesos/sandbox"
--strict="true" --switch_user="true" --systemd_enable_support="true" --systemd_runtime_directory="/run/systemd/system"
--version="false" --work_dir="/tmp/Endpoint_SlaveEndpointTest_UnauthorizedRequest_1_9HcnGt"
I0524 19:06:57.980559 31687 credentials.hpp:86] Loading credential for authentication from
'/tmp/Endpoint_SlaveEndpointTest_UnauthorizedRequest_1_Drit23/credential'
I0524 19:06:57.980720 31687 slave.cpp:258] Agent using credential for: test-principal
I0524 19:06:57.980736 31687 credentials.hpp:37] Loading credentials for authentication from
'/tmp/Endpoint_SlaveEndpointTest_UnauthorizedRequest_1_Drit23/http_credentials'
I0524 19:06:57.981086 31687 http.cpp:975] Creating default 'basic' HTTP authenticator for
realm 'mesos-agent-executor'
I0524 19:06:57.981338 31687 http.cpp:996] Creating default 'jwt' HTTP authenticator for realm
'mesos-agent-executor'
I0524 19:06:57.981596 31687 http.cpp:975] Creating default 'basic' HTTP authenticator for
realm 'mesos-agent-readonly'
I0524 19:06:57.981905 31687 http.cpp:996] Creating default 'jwt' HTTP authenticator for realm
'mesos-agent-readonly'
I0524 19:06:57.982206 31687 http.cpp:975] Creating default 'basic' HTTP authenticator for
realm 'mesos-agent-readwrite'
I0524 19:06:57.982484 31687 http.cpp:996] Creating default 'jwt' HTTP authenticator for realm
'mesos-agent-readwrite'
I0524 19:06:57.983289 31687 slave.cpp:525] Agent resources: cpus(*):2; mem(*):1024; disk(*):1024;
ports(*):[31000-32000]
I0524 19:06:57.983574 31687 slave.cpp:533] Agent attributes: [  ]
I0524 19:06:57.983803 31687 slave.cpp:538] Agent hostname: e617c29d27e1
I0524 19:06:57.984112 31683 status_update_manager.cpp:177] Pausing sending status updates
I0524 19:06:57.984892 31687 state.cpp:62] Recovering state from '/tmp/Endpoint_SlaveEndpointTest_UnauthorizedRequest_1_9HcnGt/meta'
I0524 19:06:57.985239 31689 status_update_manager.cpp:203] Recovering status update manager
I0524 19:06:57.985389 31689 containerizer.cpp:608] Recovering containerizer
I0524 19:06:57.986039 31689 provisioner.cpp:410] Provisioner recovery complete
I0524 19:06:57.986282 31689 slave.cpp:5970] Finished recovery
I0524 19:06:57.986857 31689 slave.cpp:6152] Querying resource estimator for oversubscribable
resources
I0524 19:06:57.987263 31690 slave.cpp:6166] Received oversubscribable resources {} from the
resource estimator
I0524 19:06:57.988313 31697 process.cpp:3731] Handling HTTP event for process 'slave(745)'
with path: '/slave(745)/monitor/statistics.json'
I0524 19:06:57.988986 31695 http.cpp:1115] HTTP GET for /slave(745)/monitor/statistics.json
from 172.17.0.2:48301
I0524 19:06:57.989027 31695 http.cpp:936] Authorizing principal 'test-principal' to GET the
'/monitor/statistics.json' endpoint
I0524 19:06:57.990222 25996 slave.cpp:790] Agent terminating
[       OK ] Endpoint/SlaveEndpointTest.UnauthorizedRequest/1 (16 ms)
[ RUN      ] Endpoint/SlaveEndpointTest.UnauthorizedRequest/2
I0524 19:06:57.995060 25996 containerizer.cpp:221] Using isolation: posix/cpu,posix/mem,filesystem/posix,network/cni
W0524 19:06:57.995323 25996 backend.cpp:76] Failed to create 'aufs' backend: AufsBackend requires
root privileges
W0524 19:06:57.995379 25996 backend.cpp:76] Failed to create 'bind' backend: BindBackend requires
root privileges
I0524 19:06:57.995400 25996 provisioner.cpp:249] Using default backend 'copy'
I0524 19:06:57.996496 31695 slave.cpp:225] Mesos agent started on (746)@172.17.0.2:49651
I0524 19:06:57.996769 31695 slave.cpp:226] Flags at startup: --acls="" --appc_simple_discovery_uri_prefix="http://"
--appc_store_dir="/tmp/mesos/store/appc" --authenticate_http_executors="true" --authenticate_http_readonly="true"
--authenticate_http_readwrite="true" --authenticatee="crammd5" --authentication_backoff_factor="1secs"
--authorizer="local" --cgroups_cpu_enable_pids_and_tids_count="false" --cgroups_enable_cfs="false"
--cgroups_hierarchy="/sys/fs/cgroup" --cgroups_limit_swap="false" --cgroups_root="mesos" --container_disk_watch_interval="15secs"
--containerizers="mesos" --credential="/tmp/Endpoint_SlaveEndpointTest_UnauthorizedRequest_2_zjEfCp/credential"
--default_role="*" --disk_watch_interval="1mins" --docker="docker" --docker_kill_orphans="true"
--docker_registry="https://registry-1.docker.io" --docker_remove_delay="6hrs" --docker_socket="/var/run/docker.sock"
--docker_stop_timeout="0ns" --docker_store_dir="/tmp/mesos/store/docker" --docker_volume_checkpoint_dir="/var/run/mesos/isolators/docker/volume"
--enforce_container_disk_quota="false" --executor_registration_timeout="1mins" --executor_secret_key="/tmp/Endpoint_SlaveEndpointTest_UnauthorizedRequest_2_zjEfCp/executor_secret_key"
--executor_shutdown_grace_period="5secs" --fetcher_cache_dir="/tmp/Endpoint_SlaveEndpointTest_UnauthorizedRequest_2_zjEfCp/fetch"
--fetcher_cache_size="2GB" --frameworks_home="" --gc_delay="1weeks" --gc_disk_headroom="0.1"
--hadoop_home="" --help="false" --hostname_lookup="true" --http_command_executor="false" --http_credentials="/tmp/Endpoint_SlaveEndpointTest_UnauthorizedRequest_2_zjEfCp/http_credentials"
--http_heartbeat_interval="30secs" --initialize_driver_logging="true" --isolation="posix/cpu,posix/mem"
--launcher="posix" --launcher_dir="/mesos/build/src" --logbufsecs="0" --logging_level="INFO"
--max_completed_executors_per_framework="150" --oversubscribed_resources_interval="15secs"
--perf_duration="10secs" --perf_interval="1mins" --port="5051" --qos_correction_interval_min="0ns"
--quiet="false" --recover="reconnect" --recovery_timeout="15mins" --registration_backoff_factor="10ms"
--resources="cpus:2;gpus:0;mem:1024;disk:1024;ports:[31000-32000]" --revocable_cpu_low_priority="true"
--runtime_dir="/tmp/Endpoint_SlaveEndpointTest_UnauthorizedRequest_2_zjEfCp" --sandbox_directory="/mnt/mesos/sandbox"
--strict="true" --switch_user="true" --systemd_enable_support="true" --systemd_runtime_directory="/run/systemd/system"
--version="false" --work_dir="/tmp/Endpoint_SlaveEndpointTest_UnauthorizedRequest_2_P2htdP"
I0524 19:06:57.997277 31695 credentials.hpp:86] Loading credential for authentication from
'/tmp/Endpoint_SlaveEndpointTest_UnauthorizedRequest_2_zjEfCp/credential'
I0524 19:06:57.997644 31695 slave.cpp:258] Agent using credential for: test-principal
I0524 19:06:57.997884 31695 credentials.hpp:37] Loading credentials for authentication from
'/tmp/Endpoint_SlaveEndpointTest_UnauthorizedRequest_2_zjEfCp/http_credentials'
I0524 19:06:57.998265 31695 http.cpp:975] Creating default 'basic' HTTP authenticator for
realm 'mesos-agent-executor'
I0524 19:06:57.998575 31695 http.cpp:996] Creating default 'jwt' HTTP authenticator for realm
'mesos-agent-executor'
I0524 19:06:57.998880 31695 http.cpp:975] Creating default 'basic' HTTP authenticator for
realm 'mesos-agent-readonly'
I0524 19:06:57.999119 31695 http.cpp:996] Creating default 'jwt' HTTP authenticator for realm
'mesos-agent-readonly'
I0524 19:06:57.999373 31695 http.cpp:975] Creating default 'basic' HTTP authenticator for
realm 'mesos-agent-readwrite'
I0524 19:06:57.999651 31695 http.cpp:996] Creating default 'jwt' HTTP authenticator for realm
'mesos-agent-readwrite'
I0524 19:06:58.000466 31695 slave.cpp:525] Agent resources: cpus(*):2; mem(*):1024; disk(*):1024;
ports(*):[31000-32000]
I0524 19:06:58.000730 31695 slave.cpp:533] Agent attributes: [  ]
I0524 19:06:58.000932 31695 slave.cpp:538] Agent hostname: e617c29d27e1
I0524 19:06:58.001207 31691 status_update_manager.cpp:177] Pausing sending status updates
I0524 19:06:58.001729 31695 state.cpp:62] Recovering state from '/tmp/Endpoint_SlaveEndpointTest_UnauthorizedRequest_2_P2htdP/meta'
I0524 19:06:58.002013 31695 status_update_manager.cpp:203] Recovering status update manager
I0524 19:06:58.002279 31685 containerizer.cpp:608] Recovering containerizer
I0524 19:06:58.002966 31685 provisioner.cpp:410] Provisioner recovery complete
I0524 19:06:58.003293 31685 slave.cpp:5970] Finished recovery
I0524 19:06:58.004045 31685 slave.cpp:6152] Querying resource estimator for oversubscribable
resources
I0524 19:06:58.004436 31687 slave.cpp:6166] Received oversubscribable resources {} from the
resource estimator
I0524 19:06:58.005398 31690 process.cpp:3731] Handling HTTP event for process 'slave(746)'
with path: '/slave(746)/containers'
I0524 19:06:58.008579 31687 http.cpp:1115] HTTP GET for /slave(746)/containers from 172.17.0.2:48302
I0524 19:06:58.008621 31687 http.cpp:936] Authorizing principal 'test-principal' to GET the
'/containers' endpoint
I0524 19:06:58.009970 31696 slave.cpp:790] Agent terminating
[       OK ] Endpoint/SlaveEndpointTest.UnauthorizedRequest/2 (19 ms)
[ RUN      ] Endpoint/SlaveEndpointTest.NoAuthorizer/0
I0524 19:06:58.015758 25996 containerizer.cpp:221] Using isolation: posix/cpu,posix/mem,filesystem/posix,network/cni
W0524 19:06:58.016177 25996 backend.cpp:76] Failed to create 'aufs' backend: AufsBackend requires
root privileges
W0524 19:06:58.016225 25996 backend.cpp:76] Failed to create 'bind' backend: BindBackend requires
root privileges
I0524 19:06:58.016245 25996 provisioner.cpp:249] Using default backend 'copy'
I0524 19:06:58.017060 25996 cluster.cpp:448] Creating default 'local' authorizer
I0524 19:06:58.017936 31692 slave.cpp:225] Mesos agent started on (747)@172.17.0.2:49651
I0524 19:06:58.017964 31692 slave.cpp:226] Flags at startup: --acls="" --appc_simple_discovery_uri_prefix="http://"
--appc_store_dir="/tmp/mesos/store/appc" --authenticate_http_executors="true" --authenticate_http_readonly="true"
--authenticate_http_readwrite="true" --authenticatee="crammd5" --authentication_backoff_factor="1secs"
--authorizer="local" --cgroups_cpu_enable_pids_and_tids_count="false" --cgroups_enable_cfs="false"
--cgroups_hierarchy="/sys/fs/cgroup" --cgroups_limit_swap="false" --cgroups_root="mesos" --container_disk_watch_interval="15secs"
--containerizers="mesos" --credential="/tmp/Endpoint_SlaveEndpointTest_NoAuthorizer_0_EBcvoL/credential"
--default_role="*" --disk_watch_interval="1mins" --docker="docker" --docker_kill_orphans="true"
--docker_registry="https://registry-1.docker.io" --docker_remove_delay="6hrs" --docker_socket="/var/run/docker.sock"
--docker_stop_timeout="0ns" --docker_store_dir="/tmp/mesos/store/docker" --docker_volume_checkpoint_dir="/var/run/mesos/isolators/docker/volume"
--enforce_container_disk_quota="false" --executor_registration_timeout="1mins" --executor_secret_key="/tmp/Endpoint_SlaveEndpointTest_NoAuthorizer_0_EBcvoL/executor_secret_key"
--executor_shutdown_grace_period="5secs" --fetcher_cache_dir="/tmp/Endpoint_SlaveEndpointTest_NoAuthorizer_0_EBcvoL/fetch"
--fetcher_cache_size="2GB" --frameworks_home="" --gc_delay="1weeks" --gc_disk_headroom="0.1"
--hadoop_home="" --help="false" --hostname_lookup="true" --http_command_executor="false" --http_credentials="/tmp/Endpoint_SlaveEndpointTest_NoAuthorizer_0_EBcvoL/http_credentials"
--http_heartbeat_interval="30secs" --initialize_driver_logging="true" --isolation="posix/cpu,posix/mem"
--launcher="posix" --launcher_dir="/mesos/build/src" --logbufsecs="0" --logging_level="INFO"
--max_completed_executors_per_framework="150" --oversubscribed_resources_interval="15secs"
--perf_duration="10secs" --perf_interval="1mins" --port="5051" --qos_correction_interval_min="0ns"
--quiet="false" --recover="reconnect" --recovery_timeout="15mins" --registration_backoff_factor="10ms"
--resources="cpus:2;gpus:0;mem:1024;disk:1024;ports:[31000-32000]" --revocable_cpu_low_priority="true"
--runtime_dir="/tmp/Endpoint_SlaveEndpointTest_NoAuthorizer_0_EBcvoL" --sandbox_directory="/mnt/mesos/sandbox"
--strict="true" --switch_user="true" --systemd_enable_support="true" --systemd_runtime_directory="/run/systemd/system"
--version="false" --work_dir="/tmp/Endpoint_SlaveEndpointTest_NoAuthorizer_0_4OBsWa"
I0524 19:06:58.018174 31692 credentials.hpp:86] Loading credential for authentication from
'/tmp/Endpoint_SlaveEndpointTest_NoAuthorizer_0_EBcvoL/credential'
I0524 19:06:58.018301 31692 slave.cpp:258] Agent using credential for: test-principal
I0524 19:06:58.018316 31692 credentials.hpp:37] Loading credentials for authentication from
'/tmp/Endpoint_SlaveEndpointTest_NoAuthorizer_0_EBcvoL/http_credentials'
I0524 19:06:58.018473 31692 http.cpp:975] Creating default 'basic' HTTP authenticator for
realm 'mesos-agent-executor'
I0524 19:06:58.018525 31692 http.cpp:996] Creating default 'jwt' HTTP authenticator for realm
'mesos-agent-executor'
I0524 19:06:58.018604 31692 http.cpp:975] Creating default 'basic' HTTP authenticator for
realm 'mesos-agent-readonly'
I0524 19:06:58.018640 31692 http.cpp:996] Creating default 'jwt' HTTP authenticator for realm
'mesos-agent-readonly'
I0524 19:06:58.018712 31692 http.cpp:975] Creating default 'basic' HTTP authenticator for
realm 'mesos-agent-readwrite'
I0524 19:06:58.018748 31692 http.cpp:996] Creating default 'jwt' HTTP authenticator for realm
'mesos-agent-readwrite'
I0524 19:06:58.019222 31692 slave.cpp:525] Agent resources: cpus(*):2; mem(*):1024; disk(*):1024;
ports(*):[31000-32000]
I0524 19:06:58.019263 31692 slave.cpp:533] Agent attributes: [  ]
I0524 19:06:58.019270 31692 slave.cpp:538] Agent hostname: e617c29d27e1
I0524 19:06:58.019405 31694 status_update_manager.cpp:177] Pausing sending status updates
I0524 19:06:58.019744 31684 state.cpp:62] Recovering state from '/tmp/Endpoint_SlaveEndpointTest_NoAuthorizer_0_4OBsWa/meta'
I0524 19:06:58.019963 31689 status_update_manager.cpp:203] Recovering status update manager
I0524 19:06:58.020104 31683 containerizer.cpp:608] Recovering containerizer
I0524 19:06:58.020766 31690 provisioner.cpp:410] Provisioner recovery complete
I0524 19:06:58.020947 31686 slave.cpp:5970] Finished recovery
I0524 19:06:58.021405 31686 slave.cpp:6152] Querying resource estimator for oversubscribable
resources
I0524 19:06:58.021520 31686 slave.cpp:6166] Received oversubscribable resources {} from the
resource estimator
I0524 19:06:58.022440 31693 process.cpp:3731] Handling HTTP event for process 'slave(747)'
with path: '/slave(747)/monitor/statistics'
I0524 19:06:58.023108 31686 http.cpp:1115] HTTP GET for /slave(747)/monitor/statistics from
172.17.0.2:48303
I0524 19:06:58.023155 31686 http.cpp:936] Authorizing principal 'test-principal' to GET the
'/monitor/statistics' endpoint
I0524 19:06:58.024606 25996 slave.cpp:790] Agent terminating
[       OK ] Endpoint/SlaveEndpointTest.NoAuthorizer/0 (15 ms)
[ RUN      ] Endpoint/SlaveEndpointTest.NoAuthorizer/1
I0524 19:06:58.031481 25996 containerizer.cpp:221] Using isolation: posix/cpu,posix/mem,filesystem/posix,network/cni
W0524 19:06:58.032135 25996 backend.cpp:76] Failed to create 'aufs' backend: AufsBackend requires
root privileges
W0524 19:06:58.032477 25996 backend.cpp:76] Failed to create 'bind' backend: BindBackend requires
root privileges
I0524 19:06:58.032524 25996 provisioner.cpp:249] Using default backend 'copy'
I0524 19:06:58.033268 25996 cluster.cpp:448] Creating default 'local' authorizer
I0524 19:06:58.033870 31692 slave.cpp:225] Mesos agent started on (748)@172.17.0.2:49651
I0524 19:06:58.033900 31692 slave.cpp:226] Flags at startup: --acls="" --appc_simple_discovery_uri_prefix="http://"
--appc_store_dir="/tmp/mesos/store/appc" --authenticate_http_executors="true" --authenticate_http_readonly="true"
--authenticate_http_readwrite="true" --authenticatee="crammd5" --authentication_backoff_factor="1secs"
--authorizer="local" --cgroups_cpu_enable_pids_and_tids_count="false" --cgroups_enable_cfs="false"
--cgroups_hierarchy="/sys/fs/cgroup" --cgroups_limit_swap="false" --cgroups_root="mesos" --container_disk_watch_interval="15secs"
--containerizers="mesos" --credential="/tmp/Endpoint_SlaveEndpointTest_NoAuthorizer_1_DjYdl7/credential"
--default_role="*" --disk_watch_interval="1mins" --docker="docker" --docker_kill_orphans="true"
--docker_registry="https://registry-1.docker.io" --docker_remove_delay="6hrs" --docker_socket="/var/run/docker.sock"
--docker_stop_timeout="0ns" --docker_store_dir="/tmp/mesos/store/docker" --docker_volume_checkpoint_dir="/var/run/mesos/isolators/docker/volume"
--enforce_container_disk_quota="false" --executor_registration_timeout="1mins" --executor_secret_key="/tmp/Endpoint_SlaveEndpointTest_NoAuthorizer_1_DjYdl7/executor_secret_key"
--executor_shutdown_grace_period="5secs" --fetcher_cache_dir="/tmp/Endpoint_SlaveEndpointTest_NoAuthorizer_1_DjYdl7/fetch"
--fetcher_cache_size="2GB" --frameworks_home="" --gc_delay="1weeks" --gc_disk_headroom="0.1"
--hadoop_home="" --help="false" --hostname_lookup="true" --http_command_executor="false" --http_credentials="/tmp/Endpoint_SlaveEndpointTest_NoAuthorizer_1_DjYdl7/http_credentials"
--http_heartbeat_interval="30secs" --initialize_driver_logging="true" --isolation="posix/cpu,posix/mem"
--launcher="posix" --launcher_dir="/mesos/build/src" --logbufsecs="0" --logging_level="INFO"
--max_completed_executors_per_framework="150" --oversubscribed_resources_interval="15secs"
--perf_duration="10secs" --perf_interval="1mins" --port="5051" --qos_correction_interval_min="0ns"
--quiet="false" --recover="reconnect" --recovery_timeout="15mins" --registration_backoff_factor="10ms"
--resources="cpus:2;gpus:0;mem:1024;disk:1024;ports:[31000-32000]" --revocable_cpu_low_priority="true"
--runtime_dir="/tmp/Endpoint_SlaveEndpointTest_NoAuthorizer_1_DjYdl7" --sandbox_directory="/mnt/mesos/sandbox"
--strict="true" --switch_user="true" --systemd_enable_support="true" --systemd_runtime_directory="/run/systemd/system"
--version="false" --work_dir="/tmp/Endpoint_SlaveEndpointTest_NoAuthorizer_1_wd3DQw"
I0524 19:06:58.034184 31692 credentials.hpp:86] Loading credential for authentication from
'/tmp/Endpoint_SlaveEndpointTest_NoAuthorizer_1_DjYdl7/credential'
I0524 19:06:58.034313 31692 slave.cpp:258] Agent using credential for: test-principal
I0524 19:06:58.034325 31692 credentials.hpp:37] Loading credentials for authentication from
'/tmp/Endpoint_SlaveEndpointTest_NoAuthorizer_1_DjYdl7/http_credentials'
I0524 19:06:58.034463 31692 http.cpp:975] Creating default 'basic' HTTP authenticator for
realm 'mesos-agent-executor'
I0524 19:06:58.034510 31692 http.cpp:996] Creating default 'jwt' HTTP authenticator for realm
'mesos-agent-executor'
I0524 19:06:58.034593 31692 http.cpp:975] Creating default 'basic' HTTP authenticator for
realm 'mesos-agent-readonly'
I0524 19:06:58.034634 31692 http.cpp:996] Creating default 'jwt' HTTP authenticator for realm
'mesos-agent-readonly'
I0524 19:06:58.034708 31692 http.cpp:975] Creating default 'basic' HTTP authenticator for
realm 'mesos-agent-readwrite'
I0524 19:06:58.034746 31692 http.cpp:996] Creating default 'jwt' HTTP authenticator for realm
'mesos-agent-readwrite'
I0524 19:06:58.035135 31692 slave.cpp:525] Agent resources: cpus(*):2; mem(*):1024; disk(*):1024;
ports(*):[31000-32000]
I0524 19:06:58.035166 31692 slave.cpp:533] Agent attributes: [  ]
I0524 19:06:58.035171 31692 slave.cpp:538] Agent hostname: e617c29d27e1
I0524 19:06:58.035254 31693 status_update_manager.cpp:177] Pausing sending status updates
I0524 19:06:58.035531 31685 state.cpp:62] Recovering state from '/tmp/Endpoint_SlaveEndpointTest_NoAuthorizer_1_wd3DQw/meta'
I0524 19:06:58.035702 31688 status_update_manager.cpp:203] Recovering status update manager
I0524 19:06:58.035882 31684 containerizer.cpp:608] Recovering containerizer
I0524 19:06:58.036497 31689 provisioner.cpp:410] Provisioner recovery complete
I0524 19:06:58.036717 31683 slave.cpp:5970] Finished recovery
I0524 19:06:58.037232 31683 slave.cpp:6152] Querying resource estimator for oversubscribable
resources
I0524 19:06:58.037456 31693 slave.cpp:6166] Received oversubscribable resources {} from the
resource estimator
I0524 19:06:58.038177 31692 process.cpp:3731] Handling HTTP event for process 'slave(748)'
with path: '/slave(748)/monitor/statistics.json'
I0524 19:06:58.038748 31685 http.cpp:1115] HTTP GET for /slave(748)/monitor/statistics.json
from 172.17.0.2:48304
I0524 19:06:58.038780 31685 http.cpp:936] Authorizing principal 'test-principal' to GET the
'/monitor/statistics.json' endpoint
I0524 19:06:58.040299 31694 slave.cpp:790] Agent terminating
[       OK ] Endpoint/SlaveEndpointTest.NoAuthorizer/1 (15 ms)
[ RUN      ] Endpoint/SlaveEndpointTest.NoAuthorizer/2
I0524 19:06:58.047235 25996 containerizer.cpp:221] Using isolation: posix/cpu,posix/mem,filesystem/posix,network/cni
W0524 19:06:58.047616 25996 backend.cpp:76] Failed to create 'aufs' backend: AufsBackend requires
root privileges
W0524 19:06:58.047668 25996 backend.cpp:76] Failed to create 'bind' backend: BindBackend requires
root privileges
I0524 19:06:58.047719 25996 provisioner.cpp:249] Using default backend 'copy'
I0524 19:06:58.048609 25996 cluster.cpp:448] Creating default 'local' authorizer
I0524 19:06:58.049295 31688 slave.cpp:225] Mesos agent started on (749)@172.17.0.2:49651
I0524 19:06:58.049324 31688 slave.cpp:226] Flags at startup: --acls="" --appc_simple_discovery_uri_prefix="http://"
--appc_store_dir="/tmp/mesos/store/appc" --authenticate_http_executors="true" --authenticate_http_readonly="true"
--authenticate_http_readwrite="true" --authenticatee="crammd5" --authentication_backoff_factor="1secs"
--authorizer="local" --cgroups_cpu_enable_pids_and_tids_count="false" --cgroups_enable_cfs="false"
--cgroups_hierarchy="/sys/fs/cgroup" --cgroups_limit_swap="false" --cgroups_root="mesos" --container_disk_watch_interval="15secs"
--containerizers="mesos" --credential="/tmp/Endpoint_SlaveEndpointTest_NoAuthorizer_2_hZM8rt/credential"
--default_role="*" --disk_watch_interval="1mins" --docker="docker" --docker_kill_orphans="true"
--docker_registry="https://registry-1.docker.io" --docker_remove_delay="6hrs" --docker_socket="/var/run/docker.sock"
--docker_stop_timeout="0ns" --docker_store_dir="/tmp/mesos/store/docker" --docker_volume_checkpoint_dir="/var/run/mesos/isolators/docker/volume"
--enforce_container_disk_quota="false" --executor_registration_timeout="1mins" --executor_secret_key="/tmp/Endpoint_SlaveEndpointTest_NoAuthorizer_2_hZM8rt/executor_secret_key"
--executor_shutdown_grace_period="5secs" --fetcher_cache_dir="/tmp/Endpoint_SlaveEndpointTest_NoAuthorizer_2_hZM8rt/fetch"
--fetcher_cache_size="2GB" --frameworks_home="" --gc_delay="1weeks" --gc_disk_headroom="0.1"
--hadoop_home="" --help="false" --hostname_lookup="true" --http_command_executor="false" --http_credentials="/tmp/Endpoint_SlaveEndpointTest_NoAuthorizer_2_hZM8rt/http_credentials"
--http_heartbeat_interval="30secs" --initialize_driver_logging="true" --isolation="posix/cpu,posix/mem"
--launcher="posix" --launcher_dir="/mesos/build/src" --logbufsecs="0" --logging_level="INFO"
--max_completed_executors_per_framework="150" --oversubscribed_resources_interval="15secs"
--perf_duration="10secs" --perf_interval="1mins" --port="5051" --qos_correction_interval_min="0ns"
--quiet="false" --recover="reconnect" --recovery_timeout="15mins" --registration_backoff_factor="10ms"
--resources="cpus:2;gpus:0;mem:1024;disk:1024;ports:[31000-32000]" --revocable_cpu_low_priority="true"
--runtime_dir="/tmp/Endpoint_SlaveEndpointTest_NoAuthorizer_2_hZM8rt" --sandbox_directory="/mnt/mesos/sandbox"
--strict="true" --switch_user="true" --systemd_enable_support="true" --systemd_runtime_directory="/run/systemd/system"
--version="false" --work_dir="/tmp/Endpoint_SlaveEndpointTest_NoAuthorizer_2_umh1US"
I0524 19:06:58.049618 31688 credentials.hpp:86] Loading credential for authentication from
'/tmp/Endpoint_SlaveEndpointTest_NoAuthorizer_2_hZM8rt/credential'
I0524 19:06:58.049722 31688 slave.cpp:258] Agent using credential for: test-principal
I0524 19:06:58.049733 31688 credentials.hpp:37] Loading credentials for authentication from
'/tmp/Endpoint_SlaveEndpointTest_NoAuthorizer_2_hZM8rt/http_credentials'
I0524 19:06:58.049867 31688 http.cpp:975] Creating default 'basic' HTTP authenticator for
realm 'mesos-agent-executor'
I0524 19:06:58.049911 31688 http.cpp:996] Creating default 'jwt' HTTP authenticator for realm
'mesos-agent-executor'
I0524 19:06:58.050045 31688 http.cpp:975] Creating default 'basic' HTTP authenticator for
realm 'mesos-agent-readonly'
I0524 19:06:58.050142 31688 http.cpp:996] Creating default 'jwt' HTTP authenticator for realm
'mesos-agent-readonly'
I0524 19:06:58.050271 31688 http.cpp:975] Creating default 'basic' HTTP authenticator for
realm 'mesos-agent-readwrite'
I0524 19:06:58.050360 31688 http.cpp:996] Creating default 'jwt' HTTP authenticator for realm
'mesos-agent-readwrite'
I0524 19:06:58.050793 31688 slave.cpp:525] Agent resources: cpus(*):2; mem(*):1024; disk(*):1024;
ports(*):[31000-32000]
I0524 19:06:58.050824 31688 slave.cpp:533] Agent attributes: [  ]
I0524 19:06:58.050830 31688 slave.cpp:538] Agent hostname: e617c29d27e1
I0524 19:06:58.051033 31695 status_update_manager.cpp:177] Pausing sending status updates
I0524 19:06:58.051307 31683 state.cpp:62] Recovering state from '/tmp/Endpoint_SlaveEndpointTest_NoAuthorizer_2_umh1US/meta'
I0524 19:06:58.051576 31682 status_update_manager.cpp:203] Recovering status update manager
I0524 19:06:58.051719 31682 containerizer.cpp:608] Recovering containerizer
I0524 19:06:58.052218 31692 provisioner.cpp:410] Provisioner recovery complete
I0524 19:06:58.052408 31693 slave.cpp:5970] Finished recovery
I0524 19:06:58.052907 31693 slave.cpp:6152] Querying resource estimator for oversubscribable
resources
I0524 19:06:58.053077 31687 slave.cpp:6166] Received oversubscribable resources {} from the
resource estimator
I0524 19:06:58.053865 31685 process.cpp:3731] Handling HTTP event for process 'slave(749)'
with path: '/slave(749)/containers'
I0524 19:06:58.054415 31689 http.cpp:1115] HTTP GET for /slave(749)/containers from 172.17.0.2:48305
I0524 19:06:58.054452 31689 http.cpp:936] Authorizing principal 'test-principal' to GET the
'/containers' endpoint
I0524 19:06:58.055923 31690 slave.cpp:790] Agent terminating
[       OK ] Endpoint/SlaveEndpointTest.NoAuthorizer/2 (15 ms)
[----------] 9 tests from Endpoint/SlaveEndpointTest (161 ms total)

[----------] Global test environment tear-down
[==========] 1526 tests from 169 test cases ran. (227812 ms total)
[  PASSED  ] 1525 tests.
[  FAILED  ] 1 test, listed below:
[  FAILED  ] RegisterSlaveValidationTest.DropInvalidRegistration

 1 FAILED TEST
  YOU HAVE 22 DISABLED TESTS

E0524 19:06:58.126698 31698 process.cpp:951] Failed to accept socket: future discarded
make[3]: Leaving directory `/mesos/build'
make[3]: *** [CMakeFiles/check] Error 1
make[2]: *** [CMakeFiles/check.dir/all] Error 2
make[2]: Leaving directory `/mesos/build'
make[1]: *** [CMakeFiles/check.dir/rule] Error 2
make[1]: Leaving directory `/mesos/build'
make: *** [check] Error 2
+ docker rmi mesos-1495650399-28500
Untagged: mesos-1495650399-28500:latest
Deleted: sha256:924eb4d7f4ec3ca8fcf8984a1d02bab4cf2d5b3d02cbb6f22013474e5677f656
Deleted: sha256:1983ecbedaf971aaf455685e847c4bb10a57590f5dc41fd5b2dd0c242a19db19
Deleted: sha256:cb50eeb2b59c313eb6996ad62ea7e2a6d612b888c1ce370728b98b5bde69e011
Deleted: sha256:d247d6ea4592ded71210664ccd81c20d7acfe8638b02667a160cb3a2a9bd0408
Deleted: sha256:d5bd4016e1302e08a5cab69fc199cb4e0f70742942284cc9a94b8afec63b5d1b
Deleted: sha256:3a9b558e5696c79e32f30293d0c4e2979e1bf8f908bbac265374be4b9ad090f8
Deleted: sha256:412563ab2fae466c350bc2b22438c3a9953d966eb05cfabd7a67d02f4522581d
Deleted: sha256:2061a264644b019cb691e5b536df356380977c2a7e18877e0f4d3c0d8326ae06
Deleted: sha256:f018bef63638c290db6862d644058a1fb79cf2ac27d60b2b5e42f49a614b9c1d
Deleted: sha256:73d17e8534c68bb8a69ba2fd1a408754937d9298957423648123472f05073897
Deleted: sha256:407f72bbc5102331361b3155292c7249155086733608bdd96d32f8e47433ef73
Deleted: sha256:f9e119bec4ad9847912c07ba4302c4a676dd89505621302fb770a29821717c09
Deleted: sha256:94e3b8e40e7317ecea0708eea4d3831617d89dcec9e2815cbec963dc645c0de7
Deleted: sha256:edffb1da714d65ecb3bf7972fd793aa5f8631d8484333be46651f2d48869ad93
Deleted: sha256:af26c13444355f4d4aab086fe07032d95966936796ea8ebc80b6689bc6a4f554
Deleted: sha256:cd6a907c85cae8e10df4d385501a89e9854276fa31fae4965a3480c5af8123c0
Deleted: sha256:507b804eb4b6640527d2aee25cd8c46afaeb39772ee220eaa5a8e3391a681ff4
Deleted: sha256:ae0ef49794e71fb5b90db5b375ab76bce842e8721ae3171e137608428fc305de
Deleted: sha256:d71794c485578d6b6795fb85f9aeeeb8a3ba7de0a6fe79385c79c17e09f5e898
Deleted: sha256:db7cfd685827351c3b7841e59f333e7ce2e093f047ac2dc5228e90b5db804ff4
Deleted: sha256:cb7306d19631d978e01b4a75e7daf1f4394d8da3f50e50bbc55ea280738df636
Deleted: sha256:45a1b35d30a0b1a303f8974f7613e17e73d2066b673862dc25cdffec32a4ad52
Deleted: sha256:424d484914063ce39e21963911d46258114e517c33732f5944db02cf7b0a3537
Deleted: sha256:3fe0b70f7cc0ab3d0d65e58098c091a6bf5a483e809c77050abc86ebd9823026
Build step 'Execute shell' marked build as failure
Not sending mail to unregistered user neil.conway@gmail.com

Mime
View raw message