mesos-builds mailing list archives

Site index · List index
Message view « Date » · « Thread »
Top « Date » · « Thread »
From Apache Jenkins Server <jenk...@builds.apache.org>
Subject Build failed in Jenkins: Mesos-Buildbot » cmake,gcc,--verbose --enable-libevent --enable-ssl,GLOG_v=1 MESOS_VERBOSE=1,centos:7,(docker||Hadoop)&&(!ubuntu-us1)&&(!ubuntu-eu2) #3608
Date Thu, 04 May 2017 20:33:43 GMT
See <https://builds.apache.org/job/Mesos-Buildbot/BUILDTOOL=cmake,COMPILER=gcc,CONFIGURATION=--verbose%20--enable-libevent%20--enable-ssl,ENVIRONMENT=GLOG_v=1%20MESOS_VERBOSE=1,OS=centos%3A7,label_exp=(docker%7C%7CHadoop)&&(!ubuntu-us1)&&(!ubuntu-eu2)/3608/display/redirect?page=changes>

Changes:

[vinodkone] Exposed full unreserved resources in /slaves endpoint on master.

[vinodkone] Exposed full unreserved resources in /state endpoint on agent.

------------------------------------------
[...truncated 1.69 MB...]
I0504 20:33:21.194332 25592 openssl.cpp:424] CA directory path unspecified! NOTE: Set CA directory
path with LIBPROCESS_SSL_CA_DIR=<dirpath>
I0504 20:33:21.194337 25592 openssl.cpp:429] Will not verify peer certificate!
NOTE: Set LIBPROCESS_SSL_VERIFY_CERT=1 to enable peer certificate verification
I0504 20:33:21.194340 25592 openssl.cpp:435] Will only verify peer certificate if presented!
NOTE: Set LIBPROCESS_SSL_REQUIRE_CERT=1 to require peer certificate verification
I0504 20:33:21.197304 25093 libevent_ssl_socket.cpp:1170] Socket error: error:140760FC:SSL
routines:SSL23_GET_CLIENT_HELLO:unknown protocol
I0504 20:33:21.277889 25076 ssl_tests.cpp:472] Testing server protocol 'LIBPROCESS_SSL_ENABLE_TLS_V1_2'
with client protocol 'LIBPROCESS_SSL_ENABLE_TLS_V1_1'
I0504 20:33:21.278300 25076 openssl.cpp:419] CA file path is unspecified! NOTE: Set CA file
path with LIBPROCESS_SSL_CA_FILE=<filepath>
I0504 20:33:21.278318 25076 openssl.cpp:424] CA directory path unspecified! NOTE: Set CA directory
path with LIBPROCESS_SSL_CA_DIR=<dirpath>
I0504 20:33:21.278328 25076 openssl.cpp:429] Will not verify peer certificate!
NOTE: Set LIBPROCESS_SSL_VERIFY_CERT=1 to enable peer certificate verification
I0504 20:33:21.278338 25076 openssl.cpp:435] Will only verify peer certificate if presented!
NOTE: Set LIBPROCESS_SSL_REQUIRE_CERT=1 to require peer certificate verification
WARNING: Logging before InitGoogleLogging() is written to STDERR
I0504 20:33:21.297685 25610 openssl.cpp:419] CA file path is unspecified! NOTE: Set CA file
path with LIBPROCESS_SSL_CA_FILE=<filepath>
I0504 20:33:21.297775 25610 openssl.cpp:424] CA directory path unspecified! NOTE: Set CA directory
path with LIBPROCESS_SSL_CA_DIR=<dirpath>
I0504 20:33:21.297781 25610 openssl.cpp:429] Will not verify peer certificate!
NOTE: Set LIBPROCESS_SSL_VERIFY_CERT=1 to enable peer certificate verification
I0504 20:33:21.297791 25610 openssl.cpp:435] Will only verify peer certificate if presented!
NOTE: Set LIBPROCESS_SSL_REQUIRE_CERT=1 to require peer certificate verification
I0504 20:33:21.300757 25093 libevent_ssl_socket.cpp:1170] Socket error: error:140760FC:SSL
routines:SSL23_GET_CLIENT_HELLO:unknown protocol
I0504 20:33:21.381759 25076 ssl_tests.cpp:472] Testing server protocol 'LIBPROCESS_SSL_ENABLE_TLS_V1_2'
with client protocol 'LIBPROCESS_SSL_ENABLE_TLS_V1_2'
I0504 20:33:21.382170 25076 openssl.cpp:419] CA file path is unspecified! NOTE: Set CA file
path with LIBPROCESS_SSL_CA_FILE=<filepath>
I0504 20:33:21.382187 25076 openssl.cpp:424] CA directory path unspecified! NOTE: Set CA directory
path with LIBPROCESS_SSL_CA_DIR=<dirpath>
I0504 20:33:21.382194 25076 openssl.cpp:429] Will not verify peer certificate!
NOTE: Set LIBPROCESS_SSL_VERIFY_CERT=1 to enable peer certificate verification
I0504 20:33:21.382201 25076 openssl.cpp:435] Will only verify peer certificate if presented!
NOTE: Set LIBPROCESS_SSL_REQUIRE_CERT=1 to require peer certificate verification
WARNING: Logging before InitGoogleLogging() is written to STDERR
I0504 20:33:21.400337 25628 openssl.cpp:419] CA file path is unspecified! NOTE: Set CA file
path with LIBPROCESS_SSL_CA_FILE=<filepath>
I0504 20:33:21.400439 25628 openssl.cpp:424] CA directory path unspecified! NOTE: Set CA directory
path with LIBPROCESS_SSL_CA_DIR=<dirpath>
I0504 20:33:21.400442 25628 openssl.cpp:429] Will not verify peer certificate!
NOTE: Set LIBPROCESS_SSL_VERIFY_CERT=1 to enable peer certificate verification
I0504 20:33:21.400446 25628 openssl.cpp:435] Will only verify peer certificate if presented!
NOTE: Set LIBPROCESS_SSL_REQUIRE_CERT=1 to require peer certificate verification
[       OK ] SSLTest.ProtocolMismatch (2032 ms)
[ RUN      ] SSLTest.ValidDowngrade
W0504 20:33:22.027143 25076 openssl.cpp:402] Failed SSL connections will be downgraded to
a non-SSL socket
I0504 20:33:22.027160 25076 openssl.cpp:419] CA file path is unspecified! NOTE: Set CA file
path with LIBPROCESS_SSL_CA_FILE=<filepath>
I0504 20:33:22.027165 25076 openssl.cpp:424] CA directory path unspecified! NOTE: Set CA directory
path with LIBPROCESS_SSL_CA_DIR=<dirpath>
I0504 20:33:22.027169 25076 openssl.cpp:429] Will not verify peer certificate!
NOTE: Set LIBPROCESS_SSL_VERIFY_CERT=1 to enable peer certificate verification
I0504 20:33:22.027173 25076 openssl.cpp:449] LIBPROCESS_SSL_REQUIRE_CERT implies peer certificate
verification.
LIBPROCESS_SSL_VERIFY_CERT set to true
I0504 20:33:22.038059 25076 openssl.cpp:511] Using default CA file '/etc/pki/tls/cert.pem'
and/or directory '/etc/pki/tls/certs'
[       OK ] SSLTest.ValidDowngrade (604 ms)
[ RUN      ] SSLTest.NoValidDowngrade
I0504 20:33:22.660022 25076 openssl.cpp:419] CA file path is unspecified! NOTE: Set CA file
path with LIBPROCESS_SSL_CA_FILE=<filepath>
I0504 20:33:22.660043 25076 openssl.cpp:424] CA directory path unspecified! NOTE: Set CA directory
path with LIBPROCESS_SSL_CA_DIR=<dirpath>
I0504 20:33:22.660048 25076 openssl.cpp:429] Will not verify peer certificate!
NOTE: Set LIBPROCESS_SSL_VERIFY_CERT=1 to enable peer certificate verification
I0504 20:33:22.660053 25076 openssl.cpp:449] LIBPROCESS_SSL_REQUIRE_CERT implies peer certificate
verification.
LIBPROCESS_SSL_VERIFY_CERT set to true
I0504 20:33:22.670277 25076 openssl.cpp:511] Using default CA file '/etc/pki/tls/cert.pem'
and/or directory '/etc/pki/tls/certs'
I0504 20:33:22.691135 25093 libevent_ssl_socket.cpp:1170] Socket error: error:140760FC:SSL
routines:SSL23_GET_CLIENT_HELLO:unknown protocol
[       OK ] SSLTest.NoValidDowngrade (705 ms)
[ RUN      ] SSLTest.ValidDowngradeEachProtocol
I0504 20:33:23.447975 25076 ssl_tests.cpp:591] Testing server protocol 'LIBPROCESS_SSL_ENABLE_SSL_V3'
W0504 20:33:23.449738 25076 openssl.cpp:402] Failed SSL connections will be downgraded to
a non-SSL socket
I0504 20:33:23.449751 25076 openssl.cpp:419] CA file path is unspecified! NOTE: Set CA file
path with LIBPROCESS_SSL_CA_FILE=<filepath>
I0504 20:33:23.449755 25076 openssl.cpp:424] CA directory path unspecified! NOTE: Set CA directory
path with LIBPROCESS_SSL_CA_DIR=<dirpath>
I0504 20:33:23.449759 25076 openssl.cpp:429] Will not verify peer certificate!
NOTE: Set LIBPROCESS_SSL_VERIFY_CERT=1 to enable peer certificate verification
I0504 20:33:23.449762 25076 openssl.cpp:435] Will only verify peer certificate if presented!
NOTE: Set LIBPROCESS_SSL_REQUIRE_CERT=1 to require peer certificate verification
I0504 20:33:23.495142 25076 ssl_tests.cpp:591] Testing server protocol 'LIBPROCESS_SSL_ENABLE_TLS_V1_0'
W0504 20:33:23.495436 25076 openssl.cpp:402] Failed SSL connections will be downgraded to
a non-SSL socket
I0504 20:33:23.495448 25076 openssl.cpp:419] CA file path is unspecified! NOTE: Set CA file
path with LIBPROCESS_SSL_CA_FILE=<filepath>
I0504 20:33:23.495452 25076 openssl.cpp:424] CA directory path unspecified! NOTE: Set CA directory
path with LIBPROCESS_SSL_CA_DIR=<dirpath>
I0504 20:33:23.495456 25076 openssl.cpp:429] Will not verify peer certificate!
NOTE: Set LIBPROCESS_SSL_VERIFY_CERT=1 to enable peer certificate verification
I0504 20:33:23.495460 25076 openssl.cpp:435] Will only verify peer certificate if presented!
NOTE: Set LIBPROCESS_SSL_REQUIRE_CERT=1 to require peer certificate verification
I0504 20:33:23.596663 25076 ssl_tests.cpp:591] Testing server protocol 'LIBPROCESS_SSL_ENABLE_TLS_V1_1'
W0504 20:33:23.597082 25076 openssl.cpp:402] Failed SSL connections will be downgraded to
a non-SSL socket
I0504 20:33:23.597100 25076 openssl.cpp:419] CA file path is unspecified! NOTE: Set CA file
path with LIBPROCESS_SSL_CA_FILE=<filepath>
I0504 20:33:23.597105 25076 openssl.cpp:424] CA directory path unspecified! NOTE: Set CA directory
path with LIBPROCESS_SSL_CA_DIR=<dirpath>
I0504 20:33:23.597111 25076 openssl.cpp:429] Will not verify peer certificate!
NOTE: Set LIBPROCESS_SSL_VERIFY_CERT=1 to enable peer certificate verification
I0504 20:33:23.597116 25076 openssl.cpp:435] Will only verify peer certificate if presented!
NOTE: Set LIBPROCESS_SSL_REQUIRE_CERT=1 to require peer certificate verification
I0504 20:33:23.698770 25076 ssl_tests.cpp:591] Testing server protocol 'LIBPROCESS_SSL_ENABLE_TLS_V1_2'
W0504 20:33:23.699231 25076 openssl.cpp:402] Failed SSL connections will be downgraded to
a non-SSL socket
I0504 20:33:23.699247 25076 openssl.cpp:419] CA file path is unspecified! NOTE: Set CA file
path with LIBPROCESS_SSL_CA_FILE=<filepath>
I0504 20:33:23.699254 25076 openssl.cpp:424] CA directory path unspecified! NOTE: Set CA directory
path with LIBPROCESS_SSL_CA_DIR=<dirpath>
I0504 20:33:23.699259 25076 openssl.cpp:429] Will not verify peer certificate!
NOTE: Set LIBPROCESS_SSL_VERIFY_CERT=1 to enable peer certificate verification
I0504 20:33:23.699265 25076 openssl.cpp:435] Will only verify peer certificate if presented!
NOTE: Set LIBPROCESS_SSL_REQUIRE_CERT=1 to require peer certificate verification
[       OK ] SSLTest.ValidDowngradeEachProtocol (1008 ms)
[ RUN      ] SSLTest.NoValidDowngradeEachProtocol
I0504 20:33:23.977900 25076 ssl_tests.cpp:638] Testing server protocol 'LIBPROCESS_SSL_ENABLE_SSL_V3'
I0504 20:33:23.978178 25076 openssl.cpp:419] CA file path is unspecified! NOTE: Set CA file
path with LIBPROCESS_SSL_CA_FILE=<filepath>
I0504 20:33:23.978190 25076 openssl.cpp:424] CA directory path unspecified! NOTE: Set CA directory
path with LIBPROCESS_SSL_CA_DIR=<dirpath>
I0504 20:33:23.978194 25076 openssl.cpp:429] Will not verify peer certificate!
NOTE: Set LIBPROCESS_SSL_VERIFY_CERT=1 to enable peer certificate verification
I0504 20:33:23.978199 25076 openssl.cpp:435] Will only verify peer certificate if presented!
NOTE: Set LIBPROCESS_SSL_REQUIRE_CERT=1 to require peer certificate verification
I0504 20:33:23.999125 25093 libevent_ssl_socket.cpp:1170] Socket error: error:140760FC:SSL
routines:SSL23_GET_CLIENT_HELLO:unknown protocol
I0504 20:33:24.003479 25076 ssl_tests.cpp:638] Testing server protocol 'LIBPROCESS_SSL_ENABLE_TLS_V1_0'
I0504 20:33:24.003908 25076 openssl.cpp:419] CA file path is unspecified! NOTE: Set CA file
path with LIBPROCESS_SSL_CA_FILE=<filepath>
I0504 20:33:24.003924 25076 openssl.cpp:424] CA directory path unspecified! NOTE: Set CA directory
path with LIBPROCESS_SSL_CA_DIR=<dirpath>
I0504 20:33:24.003931 25076 openssl.cpp:429] Will not verify peer certificate!
NOTE: Set LIBPROCESS_SSL_VERIFY_CERT=1 to enable peer certificate verification
I0504 20:33:24.003938 25076 openssl.cpp:435] Will only verify peer certificate if presented!
NOTE: Set LIBPROCESS_SSL_REQUIRE_CERT=1 to require peer certificate verification
I0504 20:33:24.023522 25093 libevent_ssl_socket.cpp:1170] Socket error: error:140760FC:SSL
routines:SSL23_GET_CLIENT_HELLO:unknown protocol
I0504 20:33:24.104075 25076 ssl_tests.cpp:638] Testing server protocol 'LIBPROCESS_SSL_ENABLE_TLS_V1_1'
I0504 20:33:24.104578 25076 openssl.cpp:419] CA file path is unspecified! NOTE: Set CA file
path with LIBPROCESS_SSL_CA_FILE=<filepath>
I0504 20:33:24.104596 25076 openssl.cpp:424] CA directory path unspecified! NOTE: Set CA directory
path with LIBPROCESS_SSL_CA_DIR=<dirpath>
I0504 20:33:24.104606 25076 openssl.cpp:429] Will not verify peer certificate!
NOTE: Set LIBPROCESS_SSL_VERIFY_CERT=1 to enable peer certificate verification
I0504 20:33:24.104620 25076 openssl.cpp:435] Will only verify peer certificate if presented!
NOTE: Set LIBPROCESS_SSL_REQUIRE_CERT=1 to require peer certificate verification
I0504 20:33:24.122999 25093 libevent_ssl_socket.cpp:1170] Socket error: error:140760FC:SSL
routines:SSL23_GET_CLIENT_HELLO:unknown protocol
I0504 20:33:24.205804 25076 ssl_tests.cpp:638] Testing server protocol 'LIBPROCESS_SSL_ENABLE_TLS_V1_2'
I0504 20:33:24.206207 25076 openssl.cpp:419] CA file path is unspecified! NOTE: Set CA file
path with LIBPROCESS_SSL_CA_FILE=<filepath>
I0504 20:33:24.206223 25076 openssl.cpp:424] CA directory path unspecified! NOTE: Set CA directory
path with LIBPROCESS_SSL_CA_DIR=<dirpath>
I0504 20:33:24.206228 25076 openssl.cpp:429] Will not verify peer certificate!
NOTE: Set LIBPROCESS_SSL_VERIFY_CERT=1 to enable peer certificate verification
I0504 20:33:24.206236 25076 openssl.cpp:435] Will only verify peer certificate if presented!
NOTE: Set LIBPROCESS_SSL_REQUIRE_CERT=1 to require peer certificate verification
I0504 20:33:24.226510 25093 libevent_ssl_socket.cpp:1170] Socket error: error:140760FC:SSL
routines:SSL23_GET_CLIENT_HELLO:unknown protocol
[       OK ] SSLTest.NoValidDowngradeEachProtocol (507 ms)
[ RUN      ] SSLTest.PeerAddress
I0504 20:33:24.971993 25076 openssl.cpp:419] CA file path is unspecified! NOTE: Set CA file
path with LIBPROCESS_SSL_CA_FILE=<filepath>
I0504 20:33:24.972013 25076 openssl.cpp:424] CA directory path unspecified! NOTE: Set CA directory
path with LIBPROCESS_SSL_CA_DIR=<dirpath>
I0504 20:33:24.972018 25076 openssl.cpp:429] Will not verify peer certificate!
NOTE: Set LIBPROCESS_SSL_VERIFY_CERT=1 to enable peer certificate verification
I0504 20:33:24.972023 25076 openssl.cpp:435] Will only verify peer certificate if presented!
NOTE: Set LIBPROCESS_SSL_REQUIRE_CERT=1 to require peer certificate verification
[       OK ] SSLTest.PeerAddress (670 ms)
[ RUN      ] SSLTest.HTTPSGet
I0504 20:33:25.243788 25076 openssl.cpp:419] CA file path is unspecified! NOTE: Set CA file
path with LIBPROCESS_SSL_CA_FILE=<filepath>
I0504 20:33:25.243803 25076 openssl.cpp:424] CA directory path unspecified! NOTE: Set CA directory
path with LIBPROCESS_SSL_CA_DIR=<dirpath>
I0504 20:33:25.243806 25076 openssl.cpp:429] Will not verify peer certificate!
NOTE: Set LIBPROCESS_SSL_VERIFY_CERT=1 to enable peer certificate verification
I0504 20:33:25.243810 25076 openssl.cpp:435] Will only verify peer certificate if presented!
NOTE: Set LIBPROCESS_SSL_REQUIRE_CERT=1 to require peer certificate verification
[       OK ] SSLTest.HTTPSGet (274 ms)
[ RUN      ] SSLTest.HTTPSPost
I0504 20:33:25.807166 25076 openssl.cpp:419] CA file path is unspecified! NOTE: Set CA file
path with LIBPROCESS_SSL_CA_FILE=<filepath>
I0504 20:33:25.807186 25076 openssl.cpp:424] CA directory path unspecified! NOTE: Set CA directory
path with LIBPROCESS_SSL_CA_DIR=<dirpath>
I0504 20:33:25.807191 25076 openssl.cpp:429] Will not verify peer certificate!
NOTE: Set LIBPROCESS_SSL_VERIFY_CERT=1 to enable peer certificate verification
I0504 20:33:25.807194 25076 openssl.cpp:435] Will only verify peer certificate if presented!
NOTE: Set LIBPROCESS_SSL_REQUIRE_CERT=1 to require peer certificate verification
[       OK ] SSLTest.HTTPSPost (564 ms)
[ RUN      ] SSLTest.SilentSocket
I0504 20:33:26.764950 25076 openssl.cpp:419] CA file path is unspecified! NOTE: Set CA file
path with LIBPROCESS_SSL_CA_FILE=<filepath>
I0504 20:33:26.764968 25076 openssl.cpp:424] CA directory path unspecified! NOTE: Set CA directory
path with LIBPROCESS_SSL_CA_DIR=<dirpath>
I0504 20:33:26.764973 25076 openssl.cpp:429] Will not verify peer certificate!
NOTE: Set LIBPROCESS_SSL_VERIFY_CERT=1 to enable peer certificate verification
I0504 20:33:26.764977 25076 openssl.cpp:435] Will only verify peer certificate if presented!
NOTE: Set LIBPROCESS_SSL_REQUIRE_CERT=1 to require peer certificate verification
I0504 20:33:26.773325 25093 libevent_ssl_socket.cpp:1170] Socket error: error:00000000:lib(0):func(0):reason(0)
[       OK ] SSLTest.SilentSocket (958 ms)
[----------] 15 tests from SSLTest (9944 ms total)

[----------] 42 tests from Scheme/HTTPTest
[ RUN      ] Scheme/HTTPTest.Endpoints/0
I0504 20:33:27.033341 25076 openssl.cpp:419] CA file path is unspecified! NOTE: Set CA file
path with LIBPROCESS_SSL_CA_FILE=<filepath>
I0504 20:33:27.033354 25076 openssl.cpp:424] CA directory path unspecified! NOTE: Set CA directory
path with LIBPROCESS_SSL_CA_DIR=<dirpath>
I0504 20:33:27.033360 25076 openssl.cpp:429] Will not verify peer certificate!
NOTE: Set LIBPROCESS_SSL_VERIFY_CERT=1 to enable peer certificate verification
I0504 20:33:27.033362 25076 openssl.cpp:435] Will only verify peer certificate if presented!
NOTE: Set LIBPROCESS_SSL_REQUIRE_CERT=1 to require peer certificate verification
E0504 20:33:27.033641 25093 process.cpp:950] Failed to accept socket: future discarded
I0504 20:33:27.037883 25076 process.cpp:1266] libprocess is initialized on 172.17.0.2:55640
with 16 worker threads
I0504 20:33:27.043606 25828 process.cpp:3730] Handling HTTP event for process '(77)' with
path: '/(77)/body'
I0504 20:33:27.050246 25838 process.cpp:3730] Handling HTTP event for process '(77)' with
path: '/(77)/pipe'
I0504 20:33:27.057204 25829 process.cpp:3730] Handling HTTP event for process '(77)' with
path: '/(77)/body'
I0504 20:33:27.057548 25839 process.cpp:1476] Returning '500 Internal Server Error' for '/(77)/body'
(failure)
I0504 20:33:27.057557 25833 process.cpp:3787] Failed to process request for '/(77)/body':
failure
[       OK ] Scheme/HTTPTest.Endpoints/0 (285 ms)
[ RUN      ] Scheme/HTTPTest.Endpoints/1
I0504 20:33:27.060802 25076 process.cpp:1266] libprocess is initialized on 172.17.0.2:40090
with 16 worker threads
I0504 20:33:27.061589 25852 process.cpp:3730] Handling HTTP event for process '(78)' with
path: '/(78)/body'
I0504 20:33:27.062784 25853 process.cpp:3730] Handling HTTP event for process '(78)' with
path: '/(78)/pipe'
I0504 20:33:27.064254 25847 process.cpp:3730] Handling HTTP event for process '(78)' with
path: '/(78)/body'
I0504 20:33:27.064574 25843 process.cpp:3787] Failed to process request for '/(78)/body':
failure
I0504 20:33:27.064656 25858 process.cpp:1476] Returning '500 Internal Server Error' for '/(78)/body'
(failure)
I0504 20:33:27.065140 25859 process.cpp:837] Decode failure: Connection reset by peer
E0504 20:33:27.065207 25859 process.cpp:2449] Failed to shutdown socket with fd 9, address
172.17.0.2:40090: Transport endpoint is not connected
[       OK ] Scheme/HTTPTest.Endpoints/1 (7 ms)
[ RUN      ] Scheme/HTTPTest.EndpointsHelp/0
I0504 20:33:27.584676 25076 openssl.cpp:419] CA file path is unspecified! NOTE: Set CA file
path with LIBPROCESS_SSL_CA_FILE=<filepath>
I0504 20:33:27.584688 25076 openssl.cpp:424] CA directory path unspecified! NOTE: Set CA directory
path with LIBPROCESS_SSL_CA_DIR=<dirpath>
I0504 20:33:27.584692 25076 openssl.cpp:429] Will not verify peer certificate!
NOTE: Set LIBPROCESS_SSL_VERIFY_CERT=1 to enable peer certificate verification
I0504 20:33:27.584697 25076 openssl.cpp:435] Will only verify peer certificate if presented!
NOTE: Set LIBPROCESS_SSL_REQUIRE_CERT=1 to require peer certificate verification
E0504 20:33:27.585126 25859 process.cpp:950] Failed to accept socket: future discarded
I0504 20:33:27.589923 25076 process.cpp:1266] libprocess is initialized on 172.17.0.2:60470
with 16 worker threads
*** Aborted at 1493930007 (unix time) try "date -d @1493930007" if you are using GNU date
***
PC: @     0x7f7b24e32745 (unknown)
*** SIGSEGV (@0x0) received by PID 25076 (TID 0x7f7b19afe700) from PID 0; stack trace: ***
    @     0x7f7b2492b370 (unknown)
    @     0x7f7b24e32745 (unknown)
    @     0x7f7b24e32d7a (unknown)
    @     0x7f7b24e35361 (unknown)
    @     0x7f7b24e35cb0 (unknown)
    @     0x7f7b24e35ef5 (unknown)
    @     0x7f7b251685b5 (unknown)
    @     0x7f7b26ad11ef do_handshake
    @     0x7f7b26ad138c be_openssl_handshakeeventcb
    @     0x7f7b26abc8f9 event_persist_closure
    @     0x7f7b26abcbe2 event_process_active_single_queue
    @     0x7f7b26abd20a event_process_active
    @     0x7f7b26abd966 event_base_loop
    @     0x7f7b26a796ad process::EventLoop::run()
    @     0x7f7b246c8230 (unknown)
    @     0x7f7b24923dc5 start_thread
    @     0x7f7b23e3173d __clone
make[3]: Leaving directory `/mesos/build'
make[3]: *** [CMakeFiles/check] Segmentation fault
make[2]: *** [CMakeFiles/check.dir/all] Error 2
make[2]: Leaving directory `/mesos/build'
make[1]: *** [CMakeFiles/check.dir/rule] Error 2
make[1]: Leaving directory `/mesos/build'
make: *** [check] Error 2
+ docker rmi mesos-1493927708-22643
Untagged: mesos-1493927708-22643:latest
Deleted: sha256:9087ac9250698bbebe44b90a0d1838885d0501d5deb73a653ef1e0a4bd12f952
Deleted: sha256:c942d6bf9060039a3167dda443f819a77fbc4bf29c7d180b1288fe2e26aded8b
Deleted: sha256:7bc7b7b08972990708039b6080c66c3a2375fa50fb265c0b3976d3959429984d
Deleted: sha256:20f17bd6f0941775ab5148d60e5d22570256c706dd01b87bb08faf59f673d12e
Deleted: sha256:20ac2a2deebc8602b46b68360ccae03156569ef301e82af554a624fabe470226
Deleted: sha256:e5c429a757552edd87cf2e11e7457e6282779cd076c8ae35a65644805d8d3543
Deleted: sha256:3557cf61c8f73eeb3a091aebbfb9aa8ce178b3cad4f2160b2385a478850518c4
Deleted: sha256:de1372406a7f93e00952d657178bdff8b3c37dd02a57e94027442458d0d3c537
Deleted: sha256:75c7e27974fc44ad9c53491fb4c41e13b4f778cfbf60ef441feb794fb9624807
Deleted: sha256:3119fd0aad2045213b3357c2183bbef32487b9e68b4b03bff6163995ed1580aa
Deleted: sha256:c997a7dedd4db892b1ce8caecda930ca02e8dacde64c9c776b643d0ff46c1f8f
Deleted: sha256:a8cdf5e7d0d9685d41f7f5783df7a7f4247e0cb96971bcd8b963b23fe3bb5be8
Deleted: sha256:0278eb607134ba5daa28dddd3890dc408b7fbb345e04965b8cea82e6d7f041cc
Deleted: sha256:5d861d345e8aeaeec3f6cc5885cd43dea594b57358e7865c59ab4791d39a663e
Deleted: sha256:f334ea2c1cbb02f42af00e1b3ba8154d21c30525d79b14a24f10bd44f3ad6e79
Deleted: sha256:f4dd9dba21d77454b9e1198800d8be0ee861cd579fba8763f14681023006a191
Deleted: sha256:007141d9229f82213336083b73e2ec1f886b855de4cdf856f51dd4c4d93c930d
Deleted: sha256:6c4b6d81ae157df9e7c6c63722174fb7e489b02f465047f8583f48a7b4a46dba
Deleted: sha256:0e41e2616c55f52ac6d37c2e6a244f51dff98373c8d9afb525ada0b5257b6482
Deleted: sha256:58dcb39b50e0bd2f74193ca44a78a88d0f27940ec8e0a81ea047a5f32ecdd455
Deleted: sha256:89c1614b2548a6a9d7deab67fe23f4a9a398e3f50b2ab5481b70f107819043d7
Deleted: sha256:7d9fd11423fc526d14409124310d650945f8f00ce68d0e5733dba2b8393af21d
Deleted: sha256:e088ead5de34bf6a57403e3cef65abd9aa58efb344e09ae744d92d0efe2ef8c8
Deleted: sha256:89b314ddda720e03610f64f6b664bb5044ac378de45717b00285350a09d79705
Deleted: sha256:b82d8d719b5b79fb59e497d52dec3223c663e4513695d0114752a20f1f3f384f
Build step 'Execute shell' marked build as failure

Mime
View raw message