mesos-builds mailing list archives

Site index · List index
Message view « Date » · « Thread »
Top « Date » · « Thread »
From Apache Jenkins Server <jenk...@builds.apache.org>
Subject Build failed in Jenkins: Mesos-Buildbot » autotools,gcc,--verbose,GLOG_v=1 MESOS_VERBOSE=1,centos:7,(docker||Hadoop)&&(!ubuntu-us1)&&(!ubuntu-eu2) #3733
Date Sat, 27 May 2017 00:56:39 GMT
See <https://builds.apache.org/job/Mesos-Buildbot/BUILDTOOL=autotools,COMPILER=gcc,CONFIGURATION=--verbose,ENVIRONMENT=GLOG_v=1%20MESOS_VERBOSE=1,OS=centos%3A7,label_exp=(docker%7C%7CHadoop)&&(!ubuntu-us1)&&(!ubuntu-eu2)/3733/display/redirect?page=changes>

Changes:

[bmahler] Don't crash when re-registering executor from an unknown framework.

[bmahler] Don't crash the agent when an unknown executor re-registers.

[bmahler] Removed a use of the 'default' switch case.

[bmahler] Added logging of executor re-registration messages.

[bmahler] Avoided use of [] operator for read only map access.

[bmahler] Minor logging cleanup to put open/close quotes on the same line.

------------------------------------------
[...truncated 27.26 MB...]
[ RUN      ] Endpoint/SlaveEndpointTest.AuthorizedRequest/2
I0527 00:56:30.650916  5654 containerizer.cpp:230] Using isolation: posix/cpu,posix/mem,filesystem/posix,network/cni,environment_secret
W0527 00:56:30.651358  5654 backend.cpp:76] Failed to create 'aufs' backend: AufsBackend requires
root privileges
W0527 00:56:30.651451  5654 backend.cpp:76] Failed to create 'bind' backend: BindBackend requires
root privileges
I0527 00:56:30.651484  5654 provisioner.cpp:255] Using default backend 'copy'
I0527 00:56:30.654615  5680 slave.cpp:232] Mesos agent started on (744)@172.17.0.3:58204
I0527 00:56:30.654662  5680 slave.cpp:233] Flags at startup: --acls="" --appc_simple_discovery_uri_prefix="http://"
--appc_store_dir="/tmp/mesos/store/appc" --authenticate_http_readonly="true" --authenticate_http_readwrite="true"
--authenticatee="crammd5" --authentication_backoff_factor="1secs" --authorizer="local" --cgroups_cpu_enable_pids_and_tids_count="false"
--cgroups_enable_cfs="false" --cgroups_hierarchy="/sys/fs/cgroup" --cgroups_limit_swap="false"
--cgroups_root="mesos" --container_disk_watch_interval="15secs" --containerizers="mesos" --credential="/tmp/Endpoint_SlaveEndpointTest_AuthorizedRequest_2_DNGawp/credential"
--default_role="*" --disk_watch_interval="1mins" --docker="docker" --docker_kill_orphans="true"
--docker_registry="https://registry-1.docker.io" --docker_remove_delay="6hrs" --docker_socket="/var/run/docker.sock"
--docker_stop_timeout="0ns" --docker_store_dir="/tmp/mesos/store/docker" --docker_volume_checkpoint_dir="/var/run/mesos/isolators/docker/volume"
--enforce_container_disk_quota="false" --executor_registration_timeout="1mins" --executor_reregistration_timeout="2secs"
--executor_shutdown_grace_period="5secs" --fetcher_cache_dir="/tmp/Endpoint_SlaveEndpointTest_AuthorizedRequest_2_DNGawp/fetch"
--fetcher_cache_size="2GB" --frameworks_home="" --gc_delay="1weeks" --gc_disk_headroom="0.1"
--hadoop_home="" --help="false" --hostname_lookup="true" --http_command_executor="false" --http_credentials="/tmp/Endpoint_SlaveEndpointTest_AuthorizedRequest_2_DNGawp/http_credentials"
--http_heartbeat_interval="30secs" --initialize_driver_logging="true" --isolation="posix/cpu,posix/mem"
--launcher="posix" --launcher_dir="/mesos/mesos-1.4.0/_build/src" --logbufsecs="0" --logging_level="INFO"
--max_completed_executors_per_framework="150" --oversubscribed_resources_interval="15secs"
--perf_duration="10secs" --perf_interval="1mins" --port="5051" --qos_correction_interval_min="0ns"
--quiet="false" --recover="reconnect" --recovery_timeout="15mins" --registration_backoff_factor="10ms"
--resources="cpus:2;gpus:0;mem:1024;disk:1024;ports:[31000-32000]" --revocable_cpu_low_priority="true"
--runtime_dir="/tmp/Endpoint_SlaveEndpointTest_AuthorizedRequest_2_DNGawp" --sandbox_directory="/mnt/mesos/sandbox"
--strict="true" --switch_user="true" --systemd_enable_support="true" --systemd_runtime_directory="/run/systemd/system"
--version="false" --work_dir="/tmp/Endpoint_SlaveEndpointTest_AuthorizedRequest_2_dEHsyb"
I0527 00:56:30.655086  5680 credentials.hpp:86] Loading credential for authentication from
'/tmp/Endpoint_SlaveEndpointTest_AuthorizedRequest_2_DNGawp/credential'
I0527 00:56:30.655267  5680 slave.cpp:265] Agent using credential for: test-principal
I0527 00:56:30.655289  5680 credentials.hpp:37] Loading credentials for authentication from
'/tmp/Endpoint_SlaveEndpointTest_AuthorizedRequest_2_DNGawp/http_credentials'
I0527 00:56:30.655580  5680 http.cpp:975] Creating default 'basic' HTTP authenticator for
realm 'mesos-agent-readonly'
I0527 00:56:30.655732  5680 http.cpp:975] Creating default 'basic' HTTP authenticator for
realm 'mesos-agent-readwrite'
I0527 00:56:30.656870  5680 slave.cpp:536] Agent resources: cpus(*):2; mem(*):1024; disk(*):1024;
ports(*):[31000-32000]
I0527 00:56:30.656940  5680 slave.cpp:544] Agent attributes: [  ]
I0527 00:56:30.656955  5680 slave.cpp:549] Agent hostname: e1a6274cbb83
I0527 00:56:30.657095  5682 status_update_manager.cpp:177] Pausing sending status updates
I0527 00:56:30.658530  5688 state.cpp:62] Recovering state from '/tmp/Endpoint_SlaveEndpointTest_AuthorizedRequest_2_dEHsyb/meta'
I0527 00:56:30.659086  5677 status_update_manager.cpp:203] Recovering status update manager
I0527 00:56:30.659417  5684 containerizer.cpp:582] Recovering containerizer
I0527 00:56:30.661077  5684 provisioner.cpp:416] Provisioner recovery complete
I0527 00:56:30.661586  5681 slave.cpp:6083] Finished recovery
I0527 00:56:30.662142  5681 slave.cpp:6265] Querying resource estimator for oversubscribable
resources
I0527 00:56:30.662457  5684 slave.cpp:6279] Received oversubscribable resources {} from the
resource estimator
I0527 00:56:30.664901  5682 process.cpp:3730] Handling HTTP event for process 'slave(744)'
with path: '/slave(744)/containers'
I0527 00:56:30.666412  5677 http.cpp:1115] HTTP GET for /slave(744)/containers from 172.17.0.3:39704
I0527 00:56:30.666550  5677 http.cpp:936] Authorizing principal 'test-principal' to GET the
'/containers' endpoint
I0527 00:56:30.670229  5654 slave.cpp:801] Agent terminating
[       OK ] Endpoint/SlaveEndpointTest.AuthorizedRequest/2 (30 ms)
[ RUN      ] Endpoint/SlaveEndpointTest.UnauthorizedRequest/0
I0527 00:56:30.683070  5654 containerizer.cpp:230] Using isolation: posix/cpu,posix/mem,filesystem/posix,network/cni,environment_secret
W0527 00:56:30.683629  5654 backend.cpp:76] Failed to create 'aufs' backend: AufsBackend requires
root privileges
W0527 00:56:30.683746  5654 backend.cpp:76] Failed to create 'bind' backend: BindBackend requires
root privileges
I0527 00:56:30.683789  5654 provisioner.cpp:255] Using default backend 'copy'
I0527 00:56:30.687463  5688 slave.cpp:232] Mesos agent started on (745)@172.17.0.3:58204
I0527 00:56:30.687486  5688 slave.cpp:233] Flags at startup: --acls="" --appc_simple_discovery_uri_prefix="http://"
--appc_store_dir="/tmp/mesos/store/appc" --authenticate_http_readonly="true" --authenticate_http_readwrite="true"
--authenticatee="crammd5" --authentication_backoff_factor="1secs" --authorizer="local" --cgroups_cpu_enable_pids_and_tids_count="false"
--cgroups_enable_cfs="false" --cgroups_hierarchy="/sys/fs/cgroup" --cgroups_limit_swap="false"
--cgroups_root="mesos" --container_disk_watch_interval="15secs" --containerizers="mesos" --credential="/tmp/Endpoint_SlaveEndpointTest_UnauthorizedRequest_0_mlr2Dj/credential"
--default_role="*" --disk_watch_interval="1mins" --docker="docker" --docker_kill_orphans="true"
--docker_registry="https://registry-1.docker.io" --docker_remove_delay="6hrs" --docker_socket="/var/run/docker.sock"
--docker_stop_timeout="0ns" --docker_store_dir="/tmp/mesos/store/docker" --docker_volume_checkpoint_dir="/var/run/mesos/isolators/docker/volume"
--enforce_container_disk_quota="false" --executor_registration_timeout="1mins" --executor_reregistration_timeout="2secs"
--executor_shutdown_grace_period="5secs" --fetcher_cache_dir="/tmp/Endpoint_SlaveEndpointTest_UnauthorizedRequest_0_mlr2Dj/fetch"
--fetcher_cache_size="2GB" --frameworks_home="" --gc_delay="1weeks" --gc_disk_headroom="0.1"
--hadoop_home="" --help="false" --hostname_lookup="true" --http_command_executor="false" --http_credentials="/tmp/Endpoint_SlaveEndpointTest_UnauthorizedRequest_0_mlr2Dj/http_credentials"
--http_heartbeat_interval="30secs" --initialize_driver_logging="true" --isolation="posix/cpu,posix/mem"
--launcher="posix" --launcher_dir="/mesos/mesos-1.4.0/_build/src" --logbufsecs="0" --logging_level="INFO"
--max_completed_executors_per_framework="150" --oversubscribed_resources_interval="15secs"
--perf_duration="10secs" --perf_interval="1mins" --port="5051" --qos_correction_interval_min="0ns"
--quiet="false" --recover="reconnect" --recovery_timeout="15mins" --registration_backoff_factor="10ms"
--resources="cpus:2;gpus:0;mem:1024;disk:1024;ports:[31000-32000]" --revocable_cpu_low_priority="true"
--runtime_dir="/tmp/Endpoint_SlaveEndpointTest_UnauthorizedRequest_0_mlr2Dj" --sandbox_directory="/mnt/mesos/sandbox"
--strict="true" --switch_user="true" --systemd_enable_support="true" --systemd_runtime_directory="/run/systemd/system"
--version="false" --work_dir="/tmp/Endpoint_SlaveEndpointTest_UnauthorizedRequest_0_SDReB5"
I0527 00:56:30.687971  5688 credentials.hpp:86] Loading credential for authentication from
'/tmp/Endpoint_SlaveEndpointTest_UnauthorizedRequest_0_mlr2Dj/credential'
I0527 00:56:30.688113  5688 slave.cpp:265] Agent using credential for: test-principal
I0527 00:56:30.688143  5688 credentials.hpp:37] Loading credentials for authentication from
'/tmp/Endpoint_SlaveEndpointTest_UnauthorizedRequest_0_mlr2Dj/http_credentials'
I0527 00:56:30.688393  5688 http.cpp:975] Creating default 'basic' HTTP authenticator for
realm 'mesos-agent-readonly'
I0527 00:56:30.688541  5688 http.cpp:975] Creating default 'basic' HTTP authenticator for
realm 'mesos-agent-readwrite'
I0527 00:56:30.689656  5688 slave.cpp:536] Agent resources: cpus(*):2; mem(*):1024; disk(*):1024;
ports(*):[31000-32000]
I0527 00:56:30.689725  5688 slave.cpp:544] Agent attributes: [  ]
I0527 00:56:30.689743  5688 slave.cpp:549] Agent hostname: e1a6274cbb83
I0527 00:56:30.689884  5679 status_update_manager.cpp:177] Pausing sending status updates
I0527 00:56:30.691318  5674 state.cpp:62] Recovering state from '/tmp/Endpoint_SlaveEndpointTest_UnauthorizedRequest_0_SDReB5/meta'
I0527 00:56:30.691579  5680 status_update_manager.cpp:203] Recovering status update manager
I0527 00:56:30.691841  5676 containerizer.cpp:582] Recovering containerizer
I0527 00:56:30.693275  5677 provisioner.cpp:416] Provisioner recovery complete
I0527 00:56:30.693648  5674 slave.cpp:6083] Finished recovery
I0527 00:56:30.694236  5674 slave.cpp:6265] Querying resource estimator for oversubscribable
resources
I0527 00:56:30.694631  5682 slave.cpp:6279] Received oversubscribable resources {} from the
resource estimator
I0527 00:56:30.697158  5686 process.cpp:3730] Handling HTTP event for process 'slave(745)'
with path: '/slave(745)/monitor/statistics'
I0527 00:56:30.698580  5686 http.cpp:1115] HTTP GET for /slave(745)/monitor/statistics from
172.17.0.3:39705
I0527 00:56:30.698686  5686 http.cpp:936] Authorizing principal 'test-principal' to GET the
'/monitor/statistics' endpoint
I0527 00:56:30.701272  5682 slave.cpp:801] Agent terminating
[       OK ] Endpoint/SlaveEndpointTest.UnauthorizedRequest/0 (30 ms)
[ RUN      ] Endpoint/SlaveEndpointTest.UnauthorizedRequest/1
I0527 00:56:30.713584  5654 containerizer.cpp:230] Using isolation: posix/cpu,posix/mem,filesystem/posix,network/cni,environment_secret
W0527 00:56:30.714195  5654 backend.cpp:76] Failed to create 'aufs' backend: AufsBackend requires
root privileges
W0527 00:56:30.714323  5654 backend.cpp:76] Failed to create 'bind' backend: BindBackend requires
root privileges
I0527 00:56:30.714371  5654 provisioner.cpp:255] Using default backend 'copy'
I0527 00:56:30.718477  5673 slave.cpp:232] Mesos agent started on (746)@172.17.0.3:58204
I0527 00:56:30.718508  5673 slave.cpp:233] Flags at startup: --acls="" --appc_simple_discovery_uri_prefix="http://"
--appc_store_dir="/tmp/mesos/store/appc" --authenticate_http_readonly="true" --authenticate_http_readwrite="true"
--authenticatee="crammd5" --authentication_backoff_factor="1secs" --authorizer="local" --cgroups_cpu_enable_pids_and_tids_count="false"
--cgroups_enable_cfs="false" --cgroups_hierarchy="/sys/fs/cgroup" --cgroups_limit_swap="false"
--cgroups_root="mesos" --container_disk_watch_interval="15secs" --containerizers="mesos" --credential="/tmp/Endpoint_SlaveEndpointTest_UnauthorizedRequest_1_mdWT5d/credential"
--default_role="*" --disk_watch_interval="1mins" --docker="docker" --docker_kill_orphans="true"
--docker_registry="https://registry-1.docker.io" --docker_remove_delay="6hrs" --docker_socket="/var/run/docker.sock"
--docker_stop_timeout="0ns" --docker_store_dir="/tmp/mesos/store/docker" --docker_volume_checkpoint_dir="/var/run/mesos/isolators/docker/volume"
--enforce_container_disk_quota="false" --executor_registration_timeout="1mins" --executor_reregistration_timeout="2secs"
--executor_shutdown_grace_period="5secs" --fetcher_cache_dir="/tmp/Endpoint_SlaveEndpointTest_UnauthorizedRequest_1_mdWT5d/fetch"
--fetcher_cache_size="2GB" --frameworks_home="" --gc_delay="1weeks" --gc_disk_headroom="0.1"
--hadoop_home="" --help="false" --hostname_lookup="true" --http_command_executor="false" --http_credentials="/tmp/Endpoint_SlaveEndpointTest_UnauthorizedRequest_1_mdWT5d/http_credentials"
--http_heartbeat_interval="30secs" --initialize_driver_logging="true" --isolation="posix/cpu,posix/mem"
--launcher="posix" --launcher_dir="/mesos/mesos-1.4.0/_build/src" --logbufsecs="0" --logging_level="INFO"
--max_completed_executors_per_framework="150" --oversubscribed_resources_interval="15secs"
--perf_duration="10secs" --perf_interval="1mins" --port="5051" --qos_correction_interval_min="0ns"
--quiet="false" --recover="reconnect" --recovery_timeout="15mins" --registration_backoff_factor="10ms"
--resources="cpus:2;gpus:0;mem:1024;disk:1024;ports:[31000-32000]" --revocable_cpu_low_priority="true"
--runtime_dir="/tmp/Endpoint_SlaveEndpointTest_UnauthorizedRequest_1_mdWT5d" --sandbox_directory="/mnt/mesos/sandbox"
--strict="true" --switch_user="true" --systemd_enable_support="true" --systemd_runtime_directory="/run/systemd/system"
--version="false" --work_dir="/tmp/Endpoint_SlaveEndpointTest_UnauthorizedRequest_1_qjAaYZ"
I0527 00:56:30.719106  5673 credentials.hpp:86] Loading credential for authentication from
'/tmp/Endpoint_SlaveEndpointTest_UnauthorizedRequest_1_mdWT5d/credential'
I0527 00:56:30.719306  5673 slave.cpp:265] Agent using credential for: test-principal
I0527 00:56:30.719337  5673 credentials.hpp:37] Loading credentials for authentication from
'/tmp/Endpoint_SlaveEndpointTest_UnauthorizedRequest_1_mdWT5d/http_credentials'
I0527 00:56:30.719739  5673 http.cpp:975] Creating default 'basic' HTTP authenticator for
realm 'mesos-agent-readonly'
I0527 00:56:30.719964  5673 http.cpp:975] Creating default 'basic' HTTP authenticator for
realm 'mesos-agent-readwrite'
I0527 00:56:30.721662  5673 slave.cpp:536] Agent resources: cpus(*):2; mem(*):1024; disk(*):1024;
ports(*):[31000-32000]
I0527 00:56:30.721765  5673 slave.cpp:544] Agent attributes: [  ]
I0527 00:56:30.721791  5673 slave.cpp:549] Agent hostname: e1a6274cbb83
I0527 00:56:30.721977  5684 status_update_manager.cpp:177] Pausing sending status updates
I0527 00:56:30.723551  5682 state.cpp:62] Recovering state from '/tmp/Endpoint_SlaveEndpointTest_UnauthorizedRequest_1_qjAaYZ/meta'
I0527 00:56:30.723820  5680 status_update_manager.cpp:203] Recovering status update manager
I0527 00:56:30.724048  5682 containerizer.cpp:582] Recovering containerizer
I0527 00:56:30.725525  5681 provisioner.cpp:416] Provisioner recovery complete
I0527 00:56:30.725982  5682 slave.cpp:6083] Finished recovery
I0527 00:56:30.726424  5682 slave.cpp:6265] Querying resource estimator for oversubscribable
resources
I0527 00:56:30.726691  5677 slave.cpp:6279] Received oversubscribable resources {} from the
resource estimator
I0527 00:56:30.729444  5685 process.cpp:3730] Handling HTTP event for process 'slave(746)'
with path: '/slave(746)/monitor/statistics.json'
I0527 00:56:30.730998  5687 http.cpp:1115] HTTP GET for /slave(746)/monitor/statistics.json
from 172.17.0.3:39708
I0527 00:56:30.731086  5687 http.cpp:936] Authorizing principal 'test-principal' to GET the
'/monitor/statistics.json' endpoint
I0527 00:56:30.733901  5684 slave.cpp:801] Agent terminating
[       OK ] Endpoint/SlaveEndpointTest.UnauthorizedRequest/1 (32 ms)
[ RUN      ] Endpoint/SlaveEndpointTest.UnauthorizedRequest/2
I0527 00:56:30.746464  5654 containerizer.cpp:230] Using isolation: posix/cpu,posix/mem,filesystem/posix,network/cni,environment_secret
W0527 00:56:30.747071  5654 backend.cpp:76] Failed to create 'aufs' backend: AufsBackend requires
root privileges
W0527 00:56:30.747187  5654 backend.cpp:76] Failed to create 'bind' backend: BindBackend requires
root privileges
I0527 00:56:30.747228  5654 provisioner.cpp:255] Using default backend 'copy'
I0527 00:56:30.751118  5675 slave.cpp:232] Mesos agent started on (747)@172.17.0.3:58204
I0527 00:56:30.751140  5675 slave.cpp:233] Flags at startup: --acls="" --appc_simple_discovery_uri_prefix="http://"
--appc_store_dir="/tmp/mesos/store/appc" --authenticate_http_readonly="true" --authenticate_http_readwrite="true"
--authenticatee="crammd5" --authentication_backoff_factor="1secs" --authorizer="local" --cgroups_cpu_enable_pids_and_tids_count="false"
--cgroups_enable_cfs="false" --cgroups_hierarchy="/sys/fs/cgroup" --cgroups_limit_swap="false"
--cgroups_root="mesos" --container_disk_watch_interval="15secs" --containerizers="mesos" --credential="/tmp/Endpoint_SlaveEndpointTest_UnauthorizedRequest_2_MKG1S8/credential"
--default_role="*" --disk_watch_interval="1mins" --docker="docker" --docker_kill_orphans="true"
--docker_registry="https://registry-1.docker.io" --docker_remove_delay="6hrs" --docker_socket="/var/run/docker.sock"
--docker_stop_timeout="0ns" --docker_store_dir="/tmp/mesos/store/docker" --docker_volume_checkpoint_dir="/var/run/mesos/isolators/docker/volume"
--enforce_container_disk_quota="false" --executor_registration_timeout="1mins" --executor_reregistration_timeout="2secs"
--executor_shutdown_grace_period="5secs" --fetcher_cache_dir="/tmp/Endpoint_SlaveEndpointTest_UnauthorizedRequest_2_MKG1S8/fetch"
--fetcher_cache_size="2GB" --frameworks_home="" --gc_delay="1weeks" --gc_disk_headroom="0.1"
--hadoop_home="" --help="false" --hostname_lookup="true" --http_command_executor="false" --http_credentials="/tmp/Endpoint_SlaveEndpointTest_UnauthorizedRequest_2_MKG1S8/http_credentials"
--http_heartbeat_interval="30secs" --initialize_driver_logging="true" --isolation="posix/cpu,posix/mem"
--launcher="posix" --launcher_dir="/mesos/mesos-1.4.0/_build/src" --logbufsecs="0" --logging_level="INFO"
--max_completed_executors_per_framework="150" --oversubscribed_resources_interval="15secs"
--perf_duration="10secs" --perf_interval="1mins" --port="5051" --qos_correction_interval_min="0ns"
--quiet="false" --recover="reconnect" --recovery_timeout="15mins" --registration_backoff_factor="10ms"
--resources="cpus:2;gpus:0;mem:1024;disk:1024;ports:[31000-32000]" --revocable_cpu_low_priority="true"
--runtime_dir="/tmp/Endpoint_SlaveEndpointTest_UnauthorizedRequest_2_MKG1S8" --sandbox_directory="/mnt/mesos/sandbox"
--strict="true" --switch_user="true" --systemd_enable_support="true" --systemd_runtime_directory="/run/systemd/system"
--version="false" --work_dir="/tmp/Endpoint_SlaveEndpointTest_UnauthorizedRequest_2_iC8WFU"
I0527 00:56:30.751551  5675 credentials.hpp:86] Loading credential for authentication from
'/tmp/Endpoint_SlaveEndpointTest_UnauthorizedRequest_2_MKG1S8/credential'
I0527 00:56:30.751684  5675 slave.cpp:265] Agent using credential for: test-principal
I0527 00:56:30.751704  5675 credentials.hpp:37] Loading credentials for authentication from
'/tmp/Endpoint_SlaveEndpointTest_UnauthorizedRequest_2_MKG1S8/http_credentials'
I0527 00:56:30.751911  5675 http.cpp:975] Creating default 'basic' HTTP authenticator for
realm 'mesos-agent-readonly'
I0527 00:56:30.752029  5675 http.cpp:975] Creating default 'basic' HTTP authenticator for
realm 'mesos-agent-readwrite'
I0527 00:56:30.753118  5675 slave.cpp:536] Agent resources: cpus(*):2; mem(*):1024; disk(*):1024;
ports(*):[31000-32000]
I0527 00:56:30.753212  5675 slave.cpp:544] Agent attributes: [  ]
I0527 00:56:30.753229  5675 slave.cpp:549] Agent hostname: e1a6274cbb83
I0527 00:56:30.753437  5681 status_update_manager.cpp:177] Pausing sending status updates
I0527 00:56:30.754778  5685 state.cpp:62] Recovering state from '/tmp/Endpoint_SlaveEndpointTest_UnauthorizedRequest_2_iC8WFU/meta'
I0527 00:56:30.755142  5679 status_update_manager.cpp:203] Recovering status update manager
I0527 00:56:30.755388  5687 containerizer.cpp:582] Recovering containerizer
I0527 00:56:30.757138  5678 provisioner.cpp:416] Provisioner recovery complete
I0527 00:56:30.757593  5684 slave.cpp:6083] Finished recovery
I0527 00:56:30.758028  5684 slave.cpp:6265] Querying resource estimator for oversubscribable
resources
I0527 00:56:30.758287  5680 slave.cpp:6279] Received oversubscribable resources {} from the
resource estimator
I0527 00:56:30.760550  5680 process.cpp:3730] Handling HTTP event for process 'slave(747)'
with path: '/slave(747)/containers'
I0527 00:56:30.761898  5675 http.cpp:1115] HTTP GET for /slave(747)/containers from 172.17.0.3:39711
I0527 00:56:30.761993  5675 http.cpp:936] Authorizing principal 'test-principal' to GET the
'/containers' endpoint
I0527 00:56:30.764899  5679 slave.cpp:801] Agent terminating
[       OK ] Endpoint/SlaveEndpointTest.UnauthorizedRequest/2 (30 ms)
[ RUN      ] Endpoint/SlaveEndpointTest.NoAuthorizer/0
I0527 00:56:30.776907  5654 containerizer.cpp:230] Using isolation: posix/cpu,posix/mem,filesystem/posix,network/cni,environment_secret
W0527 00:56:30.777514  5654 backend.cpp:76] Failed to create 'aufs' backend: AufsBackend requires
root privileges
W0527 00:56:30.777628  5654 backend.cpp:76] Failed to create 'bind' backend: BindBackend requires
root privileges
I0527 00:56:30.777668  5654 provisioner.cpp:255] Using default backend 'copy'
I0527 00:56:30.779973  5654 cluster.cpp:448] Creating default 'local' authorizer
I0527 00:56:30.781565  5679 slave.cpp:232] Mesos agent started on (748)@172.17.0.3:58204
I0527 00:56:30.781590  5679 slave.cpp:233] Flags at startup: --acls="" --appc_simple_discovery_uri_prefix="http://"
--appc_store_dir="/tmp/mesos/store/appc" --authenticate_http_readonly="true" --authenticate_http_readwrite="true"
--authenticatee="crammd5" --authentication_backoff_factor="1secs" --authorizer="local" --cgroups_cpu_enable_pids_and_tids_count="false"
--cgroups_enable_cfs="false" --cgroups_hierarchy="/sys/fs/cgroup" --cgroups_limit_swap="false"
--cgroups_root="mesos" --container_disk_watch_interval="15secs" --containerizers="mesos" --credential="/tmp/Endpoint_SlaveEndpointTest_NoAuthorizer_0_6cl0Z3/credential"
--default_role="*" --disk_watch_interval="1mins" --docker="docker" --docker_kill_orphans="true"
--docker_registry="https://registry-1.docker.io" --docker_remove_delay="6hrs" --docker_socket="/var/run/docker.sock"
--docker_stop_timeout="0ns" --docker_store_dir="/tmp/mesos/store/docker" --docker_volume_checkpoint_dir="/var/run/mesos/isolators/docker/volume"
--enforce_container_disk_quota="false" --executor_registration_timeout="1mins" --executor_reregistration_timeout="2secs"
--executor_shutdown_grace_period="5secs" --fetcher_cache_dir="/tmp/Endpoint_SlaveEndpointTest_NoAuthorizer_0_6cl0Z3/fetch"
--fetcher_cache_size="2GB" --frameworks_home="" --gc_delay="1weeks" --gc_disk_headroom="0.1"
--hadoop_home="" --help="false" --hostname_lookup="true" --http_command_executor="false" --http_credentials="/tmp/Endpoint_SlaveEndpointTest_NoAuthorizer_0_6cl0Z3/http_credentials"
--http_heartbeat_interval="30secs" --initialize_driver_logging="true" --isolation="posix/cpu,posix/mem"
--launcher="posix" --launcher_dir="/mesos/mesos-1.4.0/_build/src" --logbufsecs="0" --logging_level="INFO"
--max_completed_executors_per_framework="150" --oversubscribed_resources_interval="15secs"
--perf_duration="10secs" --perf_interval="1mins" --port="5051" --qos_correction_interval_min="0ns"
--quiet="false" --recover="reconnect" --recovery_timeout="15mins" --registration_backoff_factor="10ms"
--resources="cpus:2;gpus:0;mem:1024;disk:1024;ports:[31000-32000]" --revocable_cpu_low_priority="true"
--runtime_dir="/tmp/Endpoint_SlaveEndpointTest_NoAuthorizer_0_6cl0Z3" --sandbox_directory="/mnt/mesos/sandbox"
--strict="true" --switch_user="true" --systemd_enable_support="true" --systemd_runtime_directory="/run/systemd/system"
--version="false" --work_dir="/tmp/Endpoint_SlaveEndpointTest_NoAuthorizer_0_8Hc2HP"
I0527 00:56:30.782107  5679 credentials.hpp:86] Loading credential for authentication from
'/tmp/Endpoint_SlaveEndpointTest_NoAuthorizer_0_6cl0Z3/credential'
I0527 00:56:30.782310  5679 slave.cpp:265] Agent using credential for: test-principal
I0527 00:56:30.782341  5679 credentials.hpp:37] Loading credentials for authentication from
'/tmp/Endpoint_SlaveEndpointTest_NoAuthorizer_0_6cl0Z3/http_credentials'
I0527 00:56:30.782654  5679 http.cpp:975] Creating default 'basic' HTTP authenticator for
realm 'mesos-agent-readonly'
I0527 00:56:30.782824  5679 http.cpp:975] Creating default 'basic' HTTP authenticator for
realm 'mesos-agent-readwrite'
I0527 00:56:30.784395  5679 slave.cpp:536] Agent resources: cpus(*):2; mem(*):1024; disk(*):1024;
ports(*):[31000-32000]
I0527 00:56:30.784493  5679 slave.cpp:544] Agent attributes: [  ]
I0527 00:56:30.784509  5679 slave.cpp:549] Agent hostname: e1a6274cbb83
I0527 00:56:30.784696  5677 status_update_manager.cpp:177] Pausing sending status updates
I0527 00:56:30.786365  5676 state.cpp:62] Recovering state from '/tmp/Endpoint_SlaveEndpointTest_NoAuthorizer_0_8Hc2HP/meta'
I0527 00:56:30.786718  5678 status_update_manager.cpp:203] Recovering status update manager
I0527 00:56:30.787009  5674 containerizer.cpp:582] Recovering containerizer
I0527 00:56:30.789072  5674 provisioner.cpp:416] Provisioner recovery complete
I0527 00:56:30.789569  5688 slave.cpp:6083] Finished recovery
I0527 00:56:30.790272  5688 slave.cpp:6265] Querying resource estimator for oversubscribable
resources
I0527 00:56:30.790632  5676 slave.cpp:6279] Received oversubscribable resources {} from the
resource estimator
I0527 00:56:30.793081  5686 process.cpp:3730] Handling HTTP event for process 'slave(748)'
with path: '/slave(748)/monitor/statistics'
I0527 00:56:30.794397  5679 http.cpp:1115] HTTP GET for /slave(748)/monitor/statistics from
172.17.0.3:39714
I0527 00:56:30.794509  5679 http.cpp:936] Authorizing principal 'test-principal' to GET the
'/monitor/statistics' endpoint
I0527 00:56:30.798413  5678 slave.cpp:801] Agent terminating
[       OK ] Endpoint/SlaveEndpointTest.NoAuthorizer/0 (33 ms)
[ RUN      ] Endpoint/SlaveEndpointTest.NoAuthorizer/1
I0527 00:56:30.809031  5654 containerizer.cpp:230] Using isolation: posix/cpu,posix/mem,filesystem/posix,network/cni,environment_secret
W0527 00:56:30.809491  5654 backend.cpp:76] Failed to create 'aufs' backend: AufsBackend requires
root privileges
W0527 00:56:30.809586  5654 backend.cpp:76] Failed to create 'bind' backend: BindBackend requires
root privileges
I0527 00:56:30.809617  5654 provisioner.cpp:255] Using default backend 'copy'
I0527 00:56:30.811553  5654 cluster.cpp:448] Creating default 'local' authorizer
I0527 00:56:30.813066  5684 slave.cpp:232] Mesos agent started on (749)@172.17.0.3:58204
I0527 00:56:30.813097  5684 slave.cpp:233] Flags at startup: --acls="" --appc_simple_discovery_uri_prefix="http://"
--appc_store_dir="/tmp/mesos/store/appc" --authenticate_http_readonly="true" --authenticate_http_readwrite="true"
--authenticatee="crammd5" --authentication_backoff_factor="1secs" --authorizer="local" --cgroups_cpu_enable_pids_and_tids_count="false"
--cgroups_enable_cfs="false" --cgroups_hierarchy="/sys/fs/cgroup" --cgroups_limit_swap="false"
--cgroups_root="mesos" --container_disk_watch_interval="15secs" --containerizers="mesos" --credential="/tmp/Endpoint_SlaveEndpointTest_NoAuthorizer_1_anPpsZ/credential"
--default_role="*" --disk_watch_interval="1mins" --docker="docker" --docker_kill_orphans="true"
--docker_registry="https://registry-1.docker.io" --docker_remove_delay="6hrs" --docker_socket="/var/run/docker.sock"
--docker_stop_timeout="0ns" --docker_store_dir="/tmp/mesos/store/docker" --docker_volume_checkpoint_dir="/var/run/mesos/isolators/docker/volume"
--enforce_container_disk_quota="false" --executor_registration_timeout="1mins" --executor_reregistration_timeout="2secs"
--executor_shutdown_grace_period="5secs" --fetcher_cache_dir="/tmp/Endpoint_SlaveEndpointTest_NoAuthorizer_1_anPpsZ/fetch"
--fetcher_cache_size="2GB" --frameworks_home="" --gc_delay="1weeks" --gc_disk_headroom="0.1"
--hadoop_home="" --help="false" --hostname_lookup="true" --http_command_executor="false" --http_credentials="/tmp/Endpoint_SlaveEndpointTest_NoAuthorizer_1_anPpsZ/http_credentials"
--http_heartbeat_interval="30secs" --initialize_driver_logging="true" --isolation="posix/cpu,posix/mem"
--launcher="posix" --launcher_dir="/mesos/mesos-1.4.0/_build/src" --logbufsecs="0" --logging_level="INFO"
--max_completed_executors_per_framework="150" --oversubscribed_resources_interval="15secs"
--perf_duration="10secs" --perf_interval="1mins" --port="5051" --qos_correction_interval_min="0ns"
--quiet="false" --recover="reconnect" --recovery_timeout="15mins" --registration_backoff_factor="10ms"
--resources="cpus:2;gpus:0;mem:1024;disk:1024;ports:[31000-32000]" --revocable_cpu_low_priority="true"
--runtime_dir="/tmp/Endpoint_SlaveEndpointTest_NoAuthorizer_1_anPpsZ" --sandbox_directory="/mnt/mesos/sandbox"
--strict="true" --switch_user="true" --systemd_enable_support="true" --systemd_runtime_directory="/run/systemd/system"
--version="false" --work_dir="/tmp/Endpoint_SlaveEndpointTest_NoAuthorizer_1_QYL34K"
I0527 00:56:30.813644  5684 credentials.hpp:86] Loading credential for authentication from
'/tmp/Endpoint_SlaveEndpointTest_NoAuthorizer_1_anPpsZ/credential'
I0527 00:56:30.813822  5684 slave.cpp:265] Agent using credential for: test-principal
I0527 00:56:30.813849  5684 credentials.hpp:37] Loading credentials for authentication from
'/tmp/Endpoint_SlaveEndpointTest_NoAuthorizer_1_anPpsZ/http_credentials'
I0527 00:56:30.814131  5684 http.cpp:975] Creating default 'basic' HTTP authenticator for
realm 'mesos-agent-readonly'
I0527 00:56:30.814329  5684 http.cpp:975] Creating default 'basic' HTTP authenticator for
realm 'mesos-agent-readwrite'
I0527 00:56:30.815951  5684 slave.cpp:536] Agent resources: cpus(*):2; mem(*):1024; disk(*):1024;
ports(*):[31000-32000]
I0527 00:56:30.816049  5684 slave.cpp:544] Agent attributes: [  ]
I0527 00:56:30.816067  5684 slave.cpp:549] Agent hostname: e1a6274cbb83
I0527 00:56:30.816257  5676 status_update_manager.cpp:177] Pausing sending status updates
I0527 00:56:30.817742  5673 state.cpp:62] Recovering state from '/tmp/Endpoint_SlaveEndpointTest_NoAuthorizer_1_QYL34K/meta'
I0527 00:56:30.818189  5685 status_update_manager.cpp:203] Recovering status update manager
I0527 00:56:30.818416  5678 containerizer.cpp:582] Recovering containerizer
I0527 00:56:30.819931  5685 provisioner.cpp:416] Provisioner recovery complete
I0527 00:56:30.820422  5677 slave.cpp:6083] Finished recovery
I0527 00:56:30.820847  5677 slave.cpp:6265] Querying resource estimator for oversubscribable
resources
I0527 00:56:30.821076  5687 slave.cpp:6279] Received oversubscribable resources {} from the
resource estimator
I0527 00:56:30.823494  5676 process.cpp:3730] Handling HTTP event for process 'slave(749)'
with path: '/slave(749)/monitor/statistics.json'
I0527 00:56:30.824874  5678 http.cpp:1115] HTTP GET for /slave(749)/monitor/statistics.json
from 172.17.0.3:39716
I0527 00:56:30.824965  5678 http.cpp:936] Authorizing principal 'test-principal' to GET the
'/monitor/statistics.json' endpoint
I0527 00:56:30.828801  5678 slave.cpp:801] Agent terminating
[       OK ] Endpoint/SlaveEndpointTest.NoAuthorizer/1 (30 ms)
[ RUN      ] Endpoint/SlaveEndpointTest.NoAuthorizer/2
I0527 00:56:30.841604  5654 containerizer.cpp:230] Using isolation: posix/cpu,posix/mem,filesystem/posix,network/cni,environment_secret
W0527 00:56:30.842255  5654 backend.cpp:76] Failed to create 'aufs' backend: AufsBackend requires
root privileges
W0527 00:56:30.842386  5654 backend.cpp:76] Failed to create 'bind' backend: BindBackend requires
root privileges
I0527 00:56:30.842437  5654 provisioner.cpp:255] Using default backend 'copy'
I0527 00:56:30.844579  5654 cluster.cpp:448] Creating default 'local' authorizer
I0527 00:56:30.846488  5683 slave.cpp:232] Mesos agent started on (750)@172.17.0.3:58204
I0527 00:56:30.846513  5683 slave.cpp:233] Flags at startup: --acls="" --appc_simple_discovery_uri_prefix="http://"
--appc_store_dir="/tmp/mesos/store/appc" --authenticate_http_readonly="true" --authenticate_http_readwrite="true"
--authenticatee="crammd5" --authentication_backoff_factor="1secs" --authorizer="local" --cgroups_cpu_enable_pids_and_tids_count="false"
--cgroups_enable_cfs="false" --cgroups_hierarchy="/sys/fs/cgroup" --cgroups_limit_swap="false"
--cgroups_root="mesos" --container_disk_watch_interval="15secs" --containerizers="mesos" --credential="/tmp/Endpoint_SlaveEndpointTest_NoAuthorizer_2_0cc8eV/credential"
--default_role="*" --disk_watch_interval="1mins" --docker="docker" --docker_kill_orphans="true"
--docker_registry="https://registry-1.docker.io" --docker_remove_delay="6hrs" --docker_socket="/var/run/docker.sock"
--docker_stop_timeout="0ns" --docker_store_dir="/tmp/mesos/store/docker" --docker_volume_checkpoint_dir="/var/run/mesos/isolators/docker/volume"
--enforce_container_disk_quota="false" --executor_registration_timeout="1mins" --executor_reregistration_timeout="2secs"
--executor_shutdown_grace_period="5secs" --fetcher_cache_dir="/tmp/Endpoint_SlaveEndpointTest_NoAuthorizer_2_0cc8eV/fetch"
--fetcher_cache_size="2GB" --frameworks_home="" --gc_delay="1weeks" --gc_disk_headroom="0.1"
--hadoop_home="" --help="false" --hostname_lookup="true" --http_command_executor="false" --http_credentials="/tmp/Endpoint_SlaveEndpointTest_NoAuthorizer_2_0cc8eV/http_credentials"
--http_heartbeat_interval="30secs" --initialize_driver_logging="true" --isolation="posix/cpu,posix/mem"
--launcher="posix" --launcher_dir="/mesos/mesos-1.4.0/_build/src" --logbufsecs="0" --logging_level="INFO"
--max_completed_executors_per_framework="150" --oversubscribed_resources_interval="15secs"
--perf_duration="10secs" --perf_interval="1mins" --port="5051" --qos_correction_interval_min="0ns"
--quiet="false" --recover="reconnect" --recovery_timeout="15mins" --registration_backoff_factor="10ms"
--resources="cpus:2;gpus:0;mem:1024;disk:1024;ports:[31000-32000]" --revocable_cpu_low_priority="true"
--runtime_dir="/tmp/Endpoint_SlaveEndpointTest_NoAuthorizer_2_0cc8eV" --sandbox_directory="/mnt/mesos/sandbox"
--strict="true" --switch_user="true" --systemd_enable_support="true" --systemd_runtime_directory="/run/systemd/system"
--version="false" --work_dir="/tmp/Endpoint_SlaveEndpointTest_NoAuthorizer_2_OS5DMG"
I0527 00:56:30.846863  5683 credentials.hpp:86] Loading credential for authentication from
'/tmp/Endpoint_SlaveEndpointTest_NoAuthorizer_2_0cc8eV/credential'
I0527 00:56:30.846999  5683 slave.cpp:265] Agent using credential for: test-principal
I0527 00:56:30.847020  5683 credentials.hpp:37] Loading credentials for authentication from
'/tmp/Endpoint_SlaveEndpointTest_NoAuthorizer_2_0cc8eV/http_credentials'
I0527 00:56:30.847219  5683 http.cpp:975] Creating default 'basic' HTTP authenticator for
realm 'mesos-agent-readonly'
I0527 00:56:30.847417  5683 http.cpp:975] Creating default 'basic' HTTP authenticator for
realm 'mesos-agent-readwrite'
I0527 00:56:30.848475  5683 slave.cpp:536] Agent resources: cpus(*):2; mem(*):1024; disk(*):1024;
ports(*):[31000-32000]
I0527 00:56:30.848542  5683 slave.cpp:544] Agent attributes: [  ]
I0527 00:56:30.848554  5683 slave.cpp:549] Agent hostname: e1a6274cbb83
I0527 00:56:30.848668  5680 status_update_manager.cpp:177] Pausing sending status updates
I0527 00:56:30.849985  5681 state.cpp:62] Recovering state from '/tmp/Endpoint_SlaveEndpointTest_NoAuthorizer_2_OS5DMG/meta'
I0527 00:56:30.850396  5680 status_update_manager.cpp:203] Recovering status update manager
I0527 00:56:30.850738  5683 containerizer.cpp:582] Recovering containerizer
I0527 00:56:30.852325  5681 provisioner.cpp:416] Provisioner recovery complete
I0527 00:56:30.852892  5683 slave.cpp:6083] Finished recovery
I0527 00:56:30.853418  5683 slave.cpp:6265] Querying resource estimator for oversubscribable
resources
I0527 00:56:30.853642  5677 slave.cpp:6279] Received oversubscribable resources {} from the
resource estimator
I0527 00:56:30.855607  5680 process.cpp:3730] Handling HTTP event for process 'slave(750)'
with path: '/slave(750)/containers'
I0527 00:56:30.856879  5688 http.cpp:1115] HTTP GET for /slave(750)/containers from 172.17.0.3:39719
I0527 00:56:30.856946  5688 http.cpp:936] Authorizing principal 'test-principal' to GET the
'/containers' endpoint
I0527 00:56:30.861055  5677 slave.cpp:801] Agent terminating
[       OK ] Endpoint/SlaveEndpointTest.NoAuthorizer/2 (32 ms)
[----------] 9 tests from Endpoint/SlaveEndpointTest (285 ms total)

[----------] Global test environment tear-down
[==========] 1573 tests from 175 test cases ran. (468227 ms total)
[  PASSED  ] 1572 tests.
[  FAILED  ] 1 test, listed below:
[  FAILED  ] ExamplesTest.PythonFramework

 1 FAILED TEST
  YOU HAVE 22 DISABLED TESTS

E0527 00:56:30.924795  5689 process.cpp:950] Failed to accept socket: future discarded
make[4]: *** [check-local] Error 1
make[4]: Leaving directory `/mesos/mesos-1.4.0/_build/src'
make[3]: *** [check-am] Error 2
make[3]: Leaving directory `/mesos/mesos-1.4.0/_build/src'
make[2]: *** [check] Error 2
make[2]: Leaving directory `/mesos/mesos-1.4.0/_build/src'
make[1]: *** [check-recursive] Error 1
make[1]: Leaving directory `/mesos/mesos-1.4.0/_build'
make: *** [distcheck] Error 1
+ docker rmi mesos-1495843815-12756
Untagged: mesos-1495843815-12756:latest
Deleted: sha256:f7ae5debb34efa12335f82913dbe25b4a3dc1bce90302e01c2a44e3a1c45f5d3
Deleted: sha256:49f678aad941d2b3f5202ef16b51ef1c71198dfd0817026869cfc5493175cfe7
Deleted: sha256:c34a1fa571a189fc1c9936b9db48285a12c4dfb8a5139af1e35084977fca6d09
Deleted: sha256:b758d9193137b56c250676f52660026fbf92bcad4c3bbd697561a6c93d239566
Deleted: sha256:ddfb1bae752504109b6596fbf5fd9c436a37513ac3e9728994ae07ef4f130774
Deleted: sha256:593e75f4f5b7aafe340f824a196cc4d44093bc0d6a6b734c72eec0bc81fb16cc
Deleted: sha256:5b24d2c1b8a0619c8a3ed4494a2c4a94ca9a4c4c104e512601584b457c367569
Deleted: sha256:59757ff9a6e0f5015702fc51564a83961477796a08c59fbf778d4febde5c09d3
Deleted: sha256:afc165f58b86e2e60952d4ea8712a9a098a36564b9664ab9aa6cd691e22ed4db
Deleted: sha256:94f25da1930211d3f24c678c5a645a09a4562a88898136d6e2f6fd0fd98ac601
Deleted: sha256:6e61abd949053ddbbbaac6a65ca0c9bf8d0f6e0afa9159dd4343585197179de2
Deleted: sha256:606c23feca78b4ee8aee4dff353663e18cc9a2a3e14f7d65317877b99eb57e25
Deleted: sha256:505b2f2133da7f80ac1bb82cf0a17bdb6d5f1c98d46cddb5aed0295089fa9c8f
Deleted: sha256:22c59625a3cfa083136cde23c033eebd91bea62299289fa18ff8399bf72a8cc4
Deleted: sha256:d42ff0cc2ec05a25c6c90121931fdedb9249215df41623508255c86b9045bd76
Deleted: sha256:dcd26a6ed72a2edef683d8fb42a4fee5397ce15e319539d47d00224a0784c5bc
Deleted: sha256:1ea169f450a85db48c9b867f92e18c1022c99b0c87dedabe4fd38ccf5891e119
Deleted: sha256:85bc10a56da26c7ab8dbb29a075f637b476395a4ea546c75bf22dd2f61bb6ae2
Deleted: sha256:ca1be8907a702f724c91ab8dcc43b1d327c8fe3bc4087677404eb15019a0ffed
Deleted: sha256:402ba30c88fb94e815345ee7bc7fb3c186e3698a70c86c5472ef4eb172e8a48e
Deleted: sha256:644a9dd40ca14e93fa9cd34e73017fd4494ded52e2a20ed23dbba20c2f16bc5a
Deleted: sha256:2e87dfef78ca66614edf998c21294e1431439cea2c569ea8cc939df4b89956c9
Deleted: sha256:02b0a1792077ec8c9c470fcaa2e4f667f23160722f929711f4b586d13279291b
Deleted: sha256:8d3a3e71d31db324d22ae45c4f4508ff0d6ed9e60de487d472b1382fe924bcbd
Deleted: sha256:4fa9d61d8cf8a1206e20e8fb5873ac8a9d6e7ac75ae75caff1702df30c41b7a5
Build step 'Execute shell' marked build as failure
Not sending mail to unregistered user neil.conway@gmail.com

Mime
View raw message