mesos-builds mailing list archives

Site index · List index
Message view « Date » · « Thread »
Top « Date » · « Thread »
From Apache Jenkins Server <jenk...@builds.apache.org>
Subject Build failed in Jenkins: Mesos-Buildbot » autotools,gcc,--verbose,GLOG_v=1 MESOS_VERBOSE=1,ubuntu:14.04,(docker||Hadoop)&&(!ubuntu-us1)&&(!ubuntu-eu2) #3716
Date Wed, 24 May 2017 03:05:21 GMT
See <https://builds.apache.org/job/Mesos-Buildbot/BUILDTOOL=autotools,COMPILER=gcc,CONFIGURATION=--verbose,ENVIRONMENT=GLOG_v=1%20MESOS_VERBOSE=1,OS=ubuntu%3A14.04,label_exp=(docker%7C%7CHadoop)&&(!ubuntu-us1)&&(!ubuntu-eu2)/3716/display/redirect?page=changes>

Changes:

[xujyan] Consistently use EXIT() in agent startup.

[xujyan] Added a few master log lines.

------------------------------------------
[...truncated 27.43 MB...]
[ RUN      ] Endpoint/SlaveEndpointTest.AuthorizedRequest/2
I0524 03:05:16.780681 31135 containerizer.cpp:230] Using isolation: posix/cpu,posix/mem,filesystem/posix,network/cni,environment_secret
W0524 03:05:16.781137 31135 backend.cpp:76] Failed to create 'aufs' backend: AufsBackend requires
root privileges
W0524 03:05:16.781234 31135 backend.cpp:76] Failed to create 'bind' backend: BindBackend requires
root privileges
I0524 03:05:16.781265 31135 provisioner.cpp:249] Using default backend 'copy'
I0524 03:05:16.784310 31158 slave.cpp:225] Mesos agent started on (747)@172.17.0.2:37529
I0524 03:05:16.784328 31158 slave.cpp:226] Flags at startup: --acls="" --appc_simple_discovery_uri_prefix="http://"
--appc_store_dir="/tmp/mesos/store/appc" --authenticate_http_readonly="true" --authenticate_http_readwrite="true"
--authenticatee="crammd5" --authentication_backoff_factor="1secs" --authorizer="local" --cgroups_cpu_enable_pids_and_tids_count="false"
--cgroups_enable_cfs="false" --cgroups_hierarchy="/sys/fs/cgroup" --cgroups_limit_swap="false"
--cgroups_root="mesos" --container_disk_watch_interval="15secs" --containerizers="mesos" --credential="/tmp/Endpoint_SlaveEndpointTest_AuthorizedRequest_2_cRspkd/credential"
--default_role="*" --disk_watch_interval="1mins" --docker="docker" --docker_kill_orphans="true"
--docker_registry="https://registry-1.docker.io" --docker_remove_delay="6hrs" --docker_socket="/var/run/docker.sock"
--docker_stop_timeout="0ns" --docker_store_dir="/tmp/mesos/store/docker" --docker_volume_checkpoint_dir="/var/run/mesos/isolators/docker/volume"
--enforce_container_disk_quota="false" --executor_registration_timeout="1mins" --executor_reregistration_timeout="2secs"
--executor_shutdown_grace_period="5secs" --fetcher_cache_dir="/tmp/Endpoint_SlaveEndpointTest_AuthorizedRequest_2_cRspkd/fetch"
--fetcher_cache_size="2GB" --frameworks_home="" --gc_delay="1weeks" --gc_disk_headroom="0.1"
--hadoop_home="" --help="false" --hostname_lookup="true" --http_command_executor="false" --http_credentials="/tmp/Endpoint_SlaveEndpointTest_AuthorizedRequest_2_cRspkd/http_credentials"
--http_heartbeat_interval="30secs" --initialize_driver_logging="true" --isolation="posix/cpu,posix/mem"
--launcher="posix" --launcher_dir="/mesos/mesos-1.4.0/_build/src" --logbufsecs="0" --logging_level="INFO"
--max_completed_executors_per_framework="150" --oversubscribed_resources_interval="15secs"
--perf_duration="10secs" --perf_interval="1mins" --port="5051" --qos_correction_interval_min="0ns"
--quiet="false" --recover="reconnect" --recovery_timeout="15mins" --registration_backoff_factor="10ms"
--resources="cpus:2;gpus:0;mem:1024;disk:1024;ports:[31000-32000]" --revocable_cpu_low_priority="true"
--runtime_dir="/tmp/Endpoint_SlaveEndpointTest_AuthorizedRequest_2_cRspkd" --sandbox_directory="/mnt/mesos/sandbox"
--strict="true" --switch_user="true" --systemd_enable_support="true" --systemd_runtime_directory="/run/systemd/system"
--version="false" --work_dir="/tmp/Endpoint_SlaveEndpointTest_AuthorizedRequest_2_QATBRU"
I0524 03:05:16.784690 31158 credentials.hpp:86] Loading credential for authentication from
'/tmp/Endpoint_SlaveEndpointTest_AuthorizedRequest_2_cRspkd/credential'
I0524 03:05:16.784828 31158 slave.cpp:258] Agent using credential for: test-principal
I0524 03:05:16.784847 31158 credentials.hpp:37] Loading credentials for authentication from
'/tmp/Endpoint_SlaveEndpointTest_AuthorizedRequest_2_cRspkd/http_credentials'
I0524 03:05:16.785066 31158 http.cpp:975] Creating default 'basic' HTTP authenticator for
realm 'mesos-agent-readonly'
I0524 03:05:16.785287 31158 http.cpp:975] Creating default 'basic' HTTP authenticator for
realm 'mesos-agent-readwrite'
I0524 03:05:16.786640 31158 slave.cpp:529] Agent resources: cpus(*):2; mem(*):1024; disk(*):1024;
ports(*):[31000-32000]
I0524 03:05:16.786717 31158 slave.cpp:537] Agent attributes: [  ]
I0524 03:05:16.786731 31158 slave.cpp:542] Agent hostname: 0e6b8de4be3f
I0524 03:05:16.786862 31162 status_update_manager.cpp:177] Pausing sending status updates
I0524 03:05:16.788204 31159 state.cpp:62] Recovering state from '/tmp/Endpoint_SlaveEndpointTest_AuthorizedRequest_2_QATBRU/meta'
I0524 03:05:16.788632 31169 status_update_manager.cpp:203] Recovering status update manager
I0524 03:05:16.788844 31165 containerizer.cpp:627] Recovering containerizer
I0524 03:05:16.790226 31172 provisioner.cpp:410] Provisioner recovery complete
I0524 03:05:16.790762 31157 slave.cpp:5976] Finished recovery
I0524 03:05:16.791252 31157 slave.cpp:6158] Querying resource estimator for oversubscribable
resources
I0524 03:05:16.791535 31162 slave.cpp:6172] Received oversubscribable resources {} from the
resource estimator
I0524 03:05:16.794031 31164 process.cpp:3730] Handling HTTP event for process 'slave(747)'
with path: '/slave(747)/containers'
I0524 03:05:16.795295 31171 http.cpp:1115] HTTP GET for /slave(747)/containers from 172.17.0.2:45270
I0524 03:05:16.795373 31171 http.cpp:936] Authorizing principal 'test-principal' to GET the
'/containers' endpoint
I0524 03:05:16.798436 31165 slave.cpp:794] Agent terminating
[       OK ] Endpoint/SlaveEndpointTest.AuthorizedRequest/2 (27 ms)
[ RUN      ] Endpoint/SlaveEndpointTest.UnauthorizedRequest/0
I0524 03:05:16.808184 31135 containerizer.cpp:230] Using isolation: posix/cpu,posix/mem,filesystem/posix,network/cni,environment_secret
W0524 03:05:16.808634 31135 backend.cpp:76] Failed to create 'aufs' backend: AufsBackend requires
root privileges
W0524 03:05:16.808727 31135 backend.cpp:76] Failed to create 'bind' backend: BindBackend requires
root privileges
I0524 03:05:16.808765 31135 provisioner.cpp:249] Using default backend 'copy'
I0524 03:05:16.811764 31163 slave.cpp:225] Mesos agent started on (748)@172.17.0.2:37529
I0524 03:05:16.811785 31163 slave.cpp:226] Flags at startup: --acls="" --appc_simple_discovery_uri_prefix="http://"
--appc_store_dir="/tmp/mesos/store/appc" --authenticate_http_readonly="true" --authenticate_http_readwrite="true"
--authenticatee="crammd5" --authentication_backoff_factor="1secs" --authorizer="local" --cgroups_cpu_enable_pids_and_tids_count="false"
--cgroups_enable_cfs="false" --cgroups_hierarchy="/sys/fs/cgroup" --cgroups_limit_swap="false"
--cgroups_root="mesos" --container_disk_watch_interval="15secs" --containerizers="mesos" --credential="/tmp/Endpoint_SlaveEndpointTest_UnauthorizedRequest_0_njnopp/credential"
--default_role="*" --disk_watch_interval="1mins" --docker="docker" --docker_kill_orphans="true"
--docker_registry="https://registry-1.docker.io" --docker_remove_delay="6hrs" --docker_socket="/var/run/docker.sock"
--docker_stop_timeout="0ns" --docker_store_dir="/tmp/mesos/store/docker" --docker_volume_checkpoint_dir="/var/run/mesos/isolators/docker/volume"
--enforce_container_disk_quota="false" --executor_registration_timeout="1mins" --executor_reregistration_timeout="2secs"
--executor_shutdown_grace_period="5secs" --fetcher_cache_dir="/tmp/Endpoint_SlaveEndpointTest_UnauthorizedRequest_0_njnopp/fetch"
--fetcher_cache_size="2GB" --frameworks_home="" --gc_delay="1weeks" --gc_disk_headroom="0.1"
--hadoop_home="" --help="false" --hostname_lookup="true" --http_command_executor="false" --http_credentials="/tmp/Endpoint_SlaveEndpointTest_UnauthorizedRequest_0_njnopp/http_credentials"
--http_heartbeat_interval="30secs" --initialize_driver_logging="true" --isolation="posix/cpu,posix/mem"
--launcher="posix" --launcher_dir="/mesos/mesos-1.4.0/_build/src" --logbufsecs="0" --logging_level="INFO"
--max_completed_executors_per_framework="150" --oversubscribed_resources_interval="15secs"
--perf_duration="10secs" --perf_interval="1mins" --port="5051" --qos_correction_interval_min="0ns"
--quiet="false" --recover="reconnect" --recovery_timeout="15mins" --registration_backoff_factor="10ms"
--resources="cpus:2;gpus:0;mem:1024;disk:1024;ports:[31000-32000]" --revocable_cpu_low_priority="true"
--runtime_dir="/tmp/Endpoint_SlaveEndpointTest_UnauthorizedRequest_0_njnopp" --sandbox_directory="/mnt/mesos/sandbox"
--strict="true" --switch_user="true" --systemd_enable_support="true" --systemd_runtime_directory="/run/systemd/system"
--version="false" --work_dir="/tmp/Endpoint_SlaveEndpointTest_UnauthorizedRequest_0_yWlwS6"
I0524 03:05:16.812124 31163 credentials.hpp:86] Loading credential for authentication from
'/tmp/Endpoint_SlaveEndpointTest_UnauthorizedRequest_0_njnopp/credential'
I0524 03:05:16.812266 31163 slave.cpp:258] Agent using credential for: test-principal
I0524 03:05:16.812285 31163 credentials.hpp:37] Loading credentials for authentication from
'/tmp/Endpoint_SlaveEndpointTest_UnauthorizedRequest_0_njnopp/http_credentials'
I0524 03:05:16.812487 31163 http.cpp:975] Creating default 'basic' HTTP authenticator for
realm 'mesos-agent-readonly'
I0524 03:05:16.812628 31163 http.cpp:975] Creating default 'basic' HTTP authenticator for
realm 'mesos-agent-readwrite'
I0524 03:05:16.813850 31163 slave.cpp:529] Agent resources: cpus(*):2; mem(*):1024; disk(*):1024;
ports(*):[31000-32000]
I0524 03:05:16.813918 31163 slave.cpp:537] Agent attributes: [  ]
I0524 03:05:16.813930 31163 slave.cpp:542] Agent hostname: 0e6b8de4be3f
I0524 03:05:16.814054 31169 status_update_manager.cpp:177] Pausing sending status updates
I0524 03:05:16.815287 31177 state.cpp:62] Recovering state from '/tmp/Endpoint_SlaveEndpointTest_UnauthorizedRequest_0_yWlwS6/meta'
I0524 03:05:16.815625 31165 status_update_manager.cpp:203] Recovering status update manager
I0524 03:05:16.815867 31170 containerizer.cpp:627] Recovering containerizer
I0524 03:05:16.817361 31175 provisioner.cpp:410] Provisioner recovery complete
I0524 03:05:16.817749 31176 slave.cpp:5976] Finished recovery
I0524 03:05:16.818274 31176 slave.cpp:6158] Querying resource estimator for oversubscribable
resources
I0524 03:05:16.818644 31165 slave.cpp:6172] Received oversubscribable resources {} from the
resource estimator
I0524 03:05:16.820899 31176 process.cpp:3730] Handling HTTP event for process 'slave(748)'
with path: '/slave(748)/monitor/statistics'
I0524 03:05:16.822171 31163 http.cpp:1115] HTTP GET for /slave(748)/monitor/statistics from
172.17.0.2:45272
I0524 03:05:16.822244 31163 http.cpp:936] Authorizing principal 'test-principal' to GET the
'/monitor/statistics' endpoint
I0524 03:05:16.824443 31177 slave.cpp:794] Agent terminating
[       OK ] Endpoint/SlaveEndpointTest.UnauthorizedRequest/0 (26 ms)
[ RUN      ] Endpoint/SlaveEndpointTest.UnauthorizedRequest/1
I0524 03:05:16.834386 31135 containerizer.cpp:230] Using isolation: posix/cpu,posix/mem,filesystem/posix,network/cni,environment_secret
W0524 03:05:16.834846 31135 backend.cpp:76] Failed to create 'aufs' backend: AufsBackend requires
root privileges
W0524 03:05:16.834941 31135 backend.cpp:76] Failed to create 'bind' backend: BindBackend requires
root privileges
I0524 03:05:16.834974 31135 provisioner.cpp:249] Using default backend 'copy'
I0524 03:05:16.838402 31166 slave.cpp:225] Mesos agent started on (749)@172.17.0.2:37529
I0524 03:05:16.838428 31166 slave.cpp:226] Flags at startup: --acls="" --appc_simple_discovery_uri_prefix="http://"
--appc_store_dir="/tmp/mesos/store/appc" --authenticate_http_readonly="true" --authenticate_http_readwrite="true"
--authenticatee="crammd5" --authentication_backoff_factor="1secs" --authorizer="local" --cgroups_cpu_enable_pids_and_tids_count="false"
--cgroups_enable_cfs="false" --cgroups_hierarchy="/sys/fs/cgroup" --cgroups_limit_swap="false"
--cgroups_root="mesos" --container_disk_watch_interval="15secs" --containerizers="mesos" --credential="/tmp/Endpoint_SlaveEndpointTest_UnauthorizedRequest_1_JcmcKB/credential"
--default_role="*" --disk_watch_interval="1mins" --docker="docker" --docker_kill_orphans="true"
--docker_registry="https://registry-1.docker.io" --docker_remove_delay="6hrs" --docker_socket="/var/run/docker.sock"
--docker_stop_timeout="0ns" --docker_store_dir="/tmp/mesos/store/docker" --docker_volume_checkpoint_dir="/var/run/mesos/isolators/docker/volume"
--enforce_container_disk_quota="false" --executor_registration_timeout="1mins" --executor_reregistration_timeout="2secs"
--executor_shutdown_grace_period="5secs" --fetcher_cache_dir="/tmp/Endpoint_SlaveEndpointTest_UnauthorizedRequest_1_JcmcKB/fetch"
--fetcher_cache_size="2GB" --frameworks_home="" --gc_delay="1weeks" --gc_disk_headroom="0.1"
--hadoop_home="" --help="false" --hostname_lookup="true" --http_command_executor="false" --http_credentials="/tmp/Endpoint_SlaveEndpointTest_UnauthorizedRequest_1_JcmcKB/http_credentials"
--http_heartbeat_interval="30secs" --initialize_driver_logging="true" --isolation="posix/cpu,posix/mem"
--launcher="posix" --launcher_dir="/mesos/mesos-1.4.0/_build/src" --logbufsecs="0" --logging_level="INFO"
--max_completed_executors_per_framework="150" --oversubscribed_resources_interval="15secs"
--perf_duration="10secs" --perf_interval="1mins" --port="5051" --qos_correction_interval_min="0ns"
--quiet="false" --recover="reconnect" --recovery_timeout="15mins" --registration_backoff_factor="10ms"
--resources="cpus:2;gpus:0;mem:1024;disk:1024;ports:[31000-32000]" --revocable_cpu_low_priority="true"
--runtime_dir="/tmp/Endpoint_SlaveEndpointTest_UnauthorizedRequest_1_JcmcKB" --sandbox_directory="/mnt/mesos/sandbox"
--strict="true" --switch_user="true" --systemd_enable_support="true" --systemd_runtime_directory="/run/systemd/system"
--version="false" --work_dir="/tmp/Endpoint_SlaveEndpointTest_UnauthorizedRequest_1_K7io9i"
I0524 03:05:16.838852 31166 credentials.hpp:86] Loading credential for authentication from
'/tmp/Endpoint_SlaveEndpointTest_UnauthorizedRequest_1_JcmcKB/credential'
I0524 03:05:16.839006 31166 slave.cpp:258] Agent using credential for: test-principal
I0524 03:05:16.839025 31166 credentials.hpp:37] Loading credentials for authentication from
'/tmp/Endpoint_SlaveEndpointTest_UnauthorizedRequest_1_JcmcKB/http_credentials'
I0524 03:05:16.839221 31166 http.cpp:975] Creating default 'basic' HTTP authenticator for
realm 'mesos-agent-readonly'
I0524 03:05:16.839356 31166 http.cpp:975] Creating default 'basic' HTTP authenticator for
realm 'mesos-agent-readwrite'
I0524 03:05:16.840462 31166 slave.cpp:529] Agent resources: cpus(*):2; mem(*):1024; disk(*):1024;
ports(*):[31000-32000]
I0524 03:05:16.840533 31166 slave.cpp:537] Agent attributes: [  ]
I0524 03:05:16.840550 31166 slave.cpp:542] Agent hostname: 0e6b8de4be3f
I0524 03:05:16.840694 31175 status_update_manager.cpp:177] Pausing sending status updates
I0524 03:05:16.841789 31176 state.cpp:62] Recovering state from '/tmp/Endpoint_SlaveEndpointTest_UnauthorizedRequest_1_K7io9i/meta'
I0524 03:05:16.842227 31176 status_update_manager.cpp:203] Recovering status update manager
I0524 03:05:16.842617 31167 containerizer.cpp:627] Recovering containerizer
I0524 03:05:16.844146 31170 provisioner.cpp:410] Provisioner recovery complete
I0524 03:05:16.844449 31160 slave.cpp:5976] Finished recovery
I0524 03:05:16.844945 31160 slave.cpp:6158] Querying resource estimator for oversubscribable
resources
I0524 03:05:16.845186 31176 slave.cpp:6172] Received oversubscribable resources {} from the
resource estimator
I0524 03:05:16.847730 31172 process.cpp:3730] Handling HTTP event for process 'slave(749)'
with path: '/slave(749)/monitor/statistics.json'
I0524 03:05:16.848953 31177 http.cpp:1115] HTTP GET for /slave(749)/monitor/statistics.json
from 172.17.0.2:45274
I0524 03:05:16.849036 31177 http.cpp:936] Authorizing principal 'test-principal' to GET the
'/monitor/statistics.json' endpoint
I0524 03:05:16.851315 31177 slave.cpp:794] Agent terminating
[       OK ] Endpoint/SlaveEndpointTest.UnauthorizedRequest/1 (26 ms)
[ RUN      ] Endpoint/SlaveEndpointTest.UnauthorizedRequest/2
I0524 03:05:16.860971 31135 containerizer.cpp:230] Using isolation: posix/cpu,posix/mem,filesystem/posix,network/cni,environment_secret
W0524 03:05:16.861459 31135 backend.cpp:76] Failed to create 'aufs' backend: AufsBackend requires
root privileges
W0524 03:05:16.861564 31135 backend.cpp:76] Failed to create 'bind' backend: BindBackend requires
root privileges
I0524 03:05:16.861599 31135 provisioner.cpp:249] Using default backend 'copy'
I0524 03:05:16.864537 31174 slave.cpp:225] Mesos agent started on (750)@172.17.0.2:37529
I0524 03:05:16.864553 31174 slave.cpp:226] Flags at startup: --acls="" --appc_simple_discovery_uri_prefix="http://"
--appc_store_dir="/tmp/mesos/store/appc" --authenticate_http_readonly="true" --authenticate_http_readwrite="true"
--authenticatee="crammd5" --authentication_backoff_factor="1secs" --authorizer="local" --cgroups_cpu_enable_pids_and_tids_count="false"
--cgroups_enable_cfs="false" --cgroups_hierarchy="/sys/fs/cgroup" --cgroups_limit_swap="false"
--cgroups_root="mesos" --container_disk_watch_interval="15secs" --containerizers="mesos" --credential="/tmp/Endpoint_SlaveEndpointTest_UnauthorizedRequest_2_rpvNkO/credential"
--default_role="*" --disk_watch_interval="1mins" --docker="docker" --docker_kill_orphans="true"
--docker_registry="https://registry-1.docker.io" --docker_remove_delay="6hrs" --docker_socket="/var/run/docker.sock"
--docker_stop_timeout="0ns" --docker_store_dir="/tmp/mesos/store/docker" --docker_volume_checkpoint_dir="/var/run/mesos/isolators/docker/volume"
--enforce_container_disk_quota="false" --executor_registration_timeout="1mins" --executor_reregistration_timeout="2secs"
--executor_shutdown_grace_period="5secs" --fetcher_cache_dir="/tmp/Endpoint_SlaveEndpointTest_UnauthorizedRequest_2_rpvNkO/fetch"
--fetcher_cache_size="2GB" --frameworks_home="" --gc_delay="1weeks" --gc_disk_headroom="0.1"
--hadoop_home="" --help="false" --hostname_lookup="true" --http_command_executor="false" --http_credentials="/tmp/Endpoint_SlaveEndpointTest_UnauthorizedRequest_2_rpvNkO/http_credentials"
--http_heartbeat_interval="30secs" --initialize_driver_logging="true" --isolation="posix/cpu,posix/mem"
--launcher="posix" --launcher_dir="/mesos/mesos-1.4.0/_build/src" --logbufsecs="0" --logging_level="INFO"
--max_completed_executors_per_framework="150" --oversubscribed_resources_interval="15secs"
--perf_duration="10secs" --perf_interval="1mins" --port="5051" --qos_correction_interval_min="0ns"
--quiet="false" --recover="reconnect" --recovery_timeout="15mins" --registration_backoff_factor="10ms"
--resources="cpus:2;gpus:0;mem:1024;disk:1024;ports:[31000-32000]" --revocable_cpu_low_priority="true"
--runtime_dir="/tmp/Endpoint_SlaveEndpointTest_UnauthorizedRequest_2_rpvNkO" --sandbox_directory="/mnt/mesos/sandbox"
--strict="true" --switch_user="true" --systemd_enable_support="true" --systemd_runtime_directory="/run/systemd/system"
--version="false" --work_dir="/tmp/Endpoint_SlaveEndpointTest_UnauthorizedRequest_2_R4b3Fv"
I0524 03:05:16.864969 31174 credentials.hpp:86] Loading credential for authentication from
'/tmp/Endpoint_SlaveEndpointTest_UnauthorizedRequest_2_rpvNkO/credential'
I0524 03:05:16.865131 31174 slave.cpp:258] Agent using credential for: test-principal
I0524 03:05:16.865151 31174 credentials.hpp:37] Loading credentials for authentication from
'/tmp/Endpoint_SlaveEndpointTest_UnauthorizedRequest_2_rpvNkO/http_credentials'
I0524 03:05:16.865387 31174 http.cpp:975] Creating default 'basic' HTTP authenticator for
realm 'mesos-agent-readonly'
I0524 03:05:16.865631 31174 http.cpp:975] Creating default 'basic' HTTP authenticator for
realm 'mesos-agent-readwrite'
I0524 03:05:16.866958 31174 slave.cpp:529] Agent resources: cpus(*):2; mem(*):1024; disk(*):1024;
ports(*):[31000-32000]
I0524 03:05:16.867033 31174 slave.cpp:537] Agent attributes: [  ]
I0524 03:05:16.867050 31174 slave.cpp:542] Agent hostname: 0e6b8de4be3f
I0524 03:05:16.867193 31154 status_update_manager.cpp:177] Pausing sending status updates
I0524 03:05:16.868566 31155 state.cpp:62] Recovering state from '/tmp/Endpoint_SlaveEndpointTest_UnauthorizedRequest_2_R4b3Fv/meta'
I0524 03:05:16.868932 31169 status_update_manager.cpp:203] Recovering status update manager
I0524 03:05:16.869124 31175 containerizer.cpp:627] Recovering containerizer
I0524 03:05:16.870653 31171 provisioner.cpp:410] Provisioner recovery complete
I0524 03:05:16.871037 31175 slave.cpp:5976] Finished recovery
I0524 03:05:16.871598 31175 slave.cpp:6158] Querying resource estimator for oversubscribable
resources
I0524 03:05:16.871865 31157 slave.cpp:6172] Received oversubscribable resources {} from the
resource estimator
I0524 03:05:16.874044 31173 process.cpp:3730] Handling HTTP event for process 'slave(750)'
with path: '/slave(750)/containers'
I0524 03:05:16.875449 31165 http.cpp:1115] HTTP GET for /slave(750)/containers from 172.17.0.2:45276
I0524 03:05:16.875529 31165 http.cpp:936] Authorizing principal 'test-principal' to GET the
'/containers' endpoint
I0524 03:05:16.877802 31162 slave.cpp:794] Agent terminating
[       OK ] Endpoint/SlaveEndpointTest.UnauthorizedRequest/2 (27 ms)
[ RUN      ] Endpoint/SlaveEndpointTest.NoAuthorizer/0
I0524 03:05:16.888123 31135 containerizer.cpp:230] Using isolation: posix/cpu,posix/mem,filesystem/posix,network/cni,environment_secret
W0524 03:05:16.888595 31135 backend.cpp:76] Failed to create 'aufs' backend: AufsBackend requires
root privileges
W0524 03:05:16.888701 31135 backend.cpp:76] Failed to create 'bind' backend: BindBackend requires
root privileges
I0524 03:05:16.888741 31135 provisioner.cpp:249] Using default backend 'copy'
I0524 03:05:16.890439 31135 cluster.cpp:448] Creating default 'local' authorizer
I0524 03:05:16.892010 31172 slave.cpp:225] Mesos agent started on (751)@172.17.0.2:37529
I0524 03:05:16.892033 31172 slave.cpp:226] Flags at startup: --acls="" --appc_simple_discovery_uri_prefix="http://"
--appc_store_dir="/tmp/mesos/store/appc" --authenticate_http_readonly="true" --authenticate_http_readwrite="true"
--authenticatee="crammd5" --authentication_backoff_factor="1secs" --authorizer="local" --cgroups_cpu_enable_pids_and_tids_count="false"
--cgroups_enable_cfs="false" --cgroups_hierarchy="/sys/fs/cgroup" --cgroups_limit_swap="false"
--cgroups_root="mesos" --container_disk_watch_interval="15secs" --containerizers="mesos" --credential="/tmp/Endpoint_SlaveEndpointTest_NoAuthorizer_0_CdKpb1/credential"
--default_role="*" --disk_watch_interval="1mins" --docker="docker" --docker_kill_orphans="true"
--docker_registry="https://registry-1.docker.io" --docker_remove_delay="6hrs" --docker_socket="/var/run/docker.sock"
--docker_stop_timeout="0ns" --docker_store_dir="/tmp/mesos/store/docker" --docker_volume_checkpoint_dir="/var/run/mesos/isolators/docker/volume"
--enforce_container_disk_quota="false" --executor_registration_timeout="1mins" --executor_reregistration_timeout="2secs"
--executor_shutdown_grace_period="5secs" --fetcher_cache_dir="/tmp/Endpoint_SlaveEndpointTest_NoAuthorizer_0_CdKpb1/fetch"
--fetcher_cache_size="2GB" --frameworks_home="" --gc_delay="1weeks" --gc_disk_headroom="0.1"
--hadoop_home="" --help="false" --hostname_lookup="true" --http_command_executor="false" --http_credentials="/tmp/Endpoint_SlaveEndpointTest_NoAuthorizer_0_CdKpb1/http_credentials"
--http_heartbeat_interval="30secs" --initialize_driver_logging="true" --isolation="posix/cpu,posix/mem"
--launcher="posix" --launcher_dir="/mesos/mesos-1.4.0/_build/src" --logbufsecs="0" --logging_level="INFO"
--max_completed_executors_per_framework="150" --oversubscribed_resources_interval="15secs"
--perf_duration="10secs" --perf_interval="1mins" --port="5051" --qos_correction_interval_min="0ns"
--quiet="false" --recover="reconnect" --recovery_timeout="15mins" --registration_backoff_factor="10ms"
--resources="cpus:2;gpus:0;mem:1024;disk:1024;ports:[31000-32000]" --revocable_cpu_low_priority="true"
--runtime_dir="/tmp/Endpoint_SlaveEndpointTest_NoAuthorizer_0_CdKpb1" --sandbox_directory="/mnt/mesos/sandbox"
--strict="true" --switch_user="true" --systemd_enable_support="true" --systemd_runtime_directory="/run/systemd/system"
--version="false" --work_dir="/tmp/Endpoint_SlaveEndpointTest_NoAuthorizer_0_uCvEsI"
I0524 03:05:16.892379 31172 credentials.hpp:86] Loading credential for authentication from
'/tmp/Endpoint_SlaveEndpointTest_NoAuthorizer_0_CdKpb1/credential'
I0524 03:05:16.892549 31172 slave.cpp:258] Agent using credential for: test-principal
I0524 03:05:16.892575 31172 credentials.hpp:37] Loading credentials for authentication from
'/tmp/Endpoint_SlaveEndpointTest_NoAuthorizer_0_CdKpb1/http_credentials'
I0524 03:05:16.892827 31172 http.cpp:975] Creating default 'basic' HTTP authenticator for
realm 'mesos-agent-readonly'
I0524 03:05:16.892990 31172 http.cpp:975] Creating default 'basic' HTTP authenticator for
realm 'mesos-agent-readwrite'
I0524 03:05:16.894206 31172 slave.cpp:529] Agent resources: cpus(*):2; mem(*):1024; disk(*):1024;
ports(*):[31000-32000]
I0524 03:05:16.894276 31172 slave.cpp:537] Agent attributes: [  ]
I0524 03:05:16.894289 31172 slave.cpp:542] Agent hostname: 0e6b8de4be3f
I0524 03:05:16.894423 31170 status_update_manager.cpp:177] Pausing sending status updates
I0524 03:05:16.895833 31162 state.cpp:62] Recovering state from '/tmp/Endpoint_SlaveEndpointTest_NoAuthorizer_0_uCvEsI/meta'
I0524 03:05:16.896091 31156 status_update_manager.cpp:203] Recovering status update manager
I0524 03:05:16.896464 31172 containerizer.cpp:627] Recovering containerizer
I0524 03:05:16.898192 31162 provisioner.cpp:410] Provisioner recovery complete
I0524 03:05:16.898609 31155 slave.cpp:5976] Finished recovery
I0524 03:05:16.899032 31155 slave.cpp:6158] Querying resource estimator for oversubscribable
resources
I0524 03:05:16.899307 31168 slave.cpp:6172] Received oversubscribable resources {} from the
resource estimator
I0524 03:05:16.901475 31154 process.cpp:3730] Handling HTTP event for process 'slave(751)'
with path: '/slave(751)/monitor/statistics'
I0524 03:05:16.902747 31176 http.cpp:1115] HTTP GET for /slave(751)/monitor/statistics from
172.17.0.2:45278
I0524 03:05:16.902842 31176 http.cpp:936] Authorizing principal 'test-principal' to GET the
'/monitor/statistics' endpoint
I0524 03:05:16.906363 31173 slave.cpp:794] Agent terminating
[       OK ] Endpoint/SlaveEndpointTest.NoAuthorizer/0 (28 ms)
[ RUN      ] Endpoint/SlaveEndpointTest.NoAuthorizer/1
I0524 03:05:16.916398 31135 containerizer.cpp:230] Using isolation: posix/cpu,posix/mem,filesystem/posix,network/cni,environment_secret
W0524 03:05:16.916857 31135 backend.cpp:76] Failed to create 'aufs' backend: AufsBackend requires
root privileges
W0524 03:05:16.916960 31135 backend.cpp:76] Failed to create 'bind' backend: BindBackend requires
root privileges
I0524 03:05:16.916990 31135 provisioner.cpp:249] Using default backend 'copy'
I0524 03:05:16.918656 31135 cluster.cpp:448] Creating default 'local' authorizer
I0524 03:05:16.920239 31155 slave.cpp:225] Mesos agent started on (752)@172.17.0.2:37529
I0524 03:05:16.920258 31155 slave.cpp:226] Flags at startup: --acls="" --appc_simple_discovery_uri_prefix="http://"
--appc_store_dir="/tmp/mesos/store/appc" --authenticate_http_readonly="true" --authenticate_http_readwrite="true"
--authenticatee="crammd5" --authentication_backoff_factor="1secs" --authorizer="local" --cgroups_cpu_enable_pids_and_tids_count="false"
--cgroups_enable_cfs="false" --cgroups_hierarchy="/sys/fs/cgroup" --cgroups_limit_swap="false"
--cgroups_root="mesos" --container_disk_watch_interval="15secs" --containerizers="mesos" --credential="/tmp/Endpoint_SlaveEndpointTest_NoAuthorizer_1_1vrJie/credential"
--default_role="*" --disk_watch_interval="1mins" --docker="docker" --docker_kill_orphans="true"
--docker_registry="https://registry-1.docker.io" --docker_remove_delay="6hrs" --docker_socket="/var/run/docker.sock"
--docker_stop_timeout="0ns" --docker_store_dir="/tmp/mesos/store/docker" --docker_volume_checkpoint_dir="/var/run/mesos/isolators/docker/volume"
--enforce_container_disk_quota="false" --executor_registration_timeout="1mins" --executor_reregistration_timeout="2secs"
--executor_shutdown_grace_period="5secs" --fetcher_cache_dir="/tmp/Endpoint_SlaveEndpointTest_NoAuthorizer_1_1vrJie/fetch"
--fetcher_cache_size="2GB" --frameworks_home="" --gc_delay="1weeks" --gc_disk_headroom="0.1"
--hadoop_home="" --help="false" --hostname_lookup="true" --http_command_executor="false" --http_credentials="/tmp/Endpoint_SlaveEndpointTest_NoAuthorizer_1_1vrJie/http_credentials"
--http_heartbeat_interval="30secs" --initialize_driver_logging="true" --isolation="posix/cpu,posix/mem"
--launcher="posix" --launcher_dir="/mesos/mesos-1.4.0/_build/src" --logbufsecs="0" --logging_level="INFO"
--max_completed_executors_per_framework="150" --oversubscribed_resources_interval="15secs"
--perf_duration="10secs" --perf_interval="1mins" --port="5051" --qos_correction_interval_min="0ns"
--quiet="false" --recover="reconnect" --recovery_timeout="15mins" --registration_backoff_factor="10ms"
--resources="cpus:2;gpus:0;mem:1024;disk:1024;ports:[31000-32000]" --revocable_cpu_low_priority="true"
--runtime_dir="/tmp/Endpoint_SlaveEndpointTest_NoAuthorizer_1_1vrJie" --sandbox_directory="/mnt/mesos/sandbox"
--strict="true" --switch_user="true" --systemd_enable_support="true" --systemd_runtime_directory="/run/systemd/system"
--version="false" --work_dir="/tmp/Endpoint_SlaveEndpointTest_NoAuthorizer_1_tHyLvV"
I0524 03:05:16.920614 31155 credentials.hpp:86] Loading credential for authentication from
'/tmp/Endpoint_SlaveEndpointTest_NoAuthorizer_1_1vrJie/credential'
I0524 03:05:16.920763 31155 slave.cpp:258] Agent using credential for: test-principal
I0524 03:05:16.920783 31155 credentials.hpp:37] Loading credentials for authentication from
'/tmp/Endpoint_SlaveEndpointTest_NoAuthorizer_1_1vrJie/http_credentials'
I0524 03:05:16.921005 31155 http.cpp:975] Creating default 'basic' HTTP authenticator for
realm 'mesos-agent-readonly'
I0524 03:05:16.921169 31155 http.cpp:975] Creating default 'basic' HTTP authenticator for
realm 'mesos-agent-readwrite'
I0524 03:05:16.922400 31155 slave.cpp:529] Agent resources: cpus(*):2; mem(*):1024; disk(*):1024;
ports(*):[31000-32000]
I0524 03:05:16.922472 31155 slave.cpp:537] Agent attributes: [  ]
I0524 03:05:16.922530 31155 slave.cpp:542] Agent hostname: 0e6b8de4be3f
I0524 03:05:16.922677 31162 status_update_manager.cpp:177] Pausing sending status updates
I0524 03:05:16.923902 31167 state.cpp:62] Recovering state from '/tmp/Endpoint_SlaveEndpointTest_NoAuthorizer_1_tHyLvV/meta'
I0524 03:05:16.924137 31168 status_update_manager.cpp:203] Recovering status update manager
I0524 03:05:16.924336 31158 containerizer.cpp:627] Recovering containerizer
I0524 03:05:16.926232 31165 provisioner.cpp:410] Provisioner recovery complete
I0524 03:05:16.926703 31164 slave.cpp:5976] Finished recovery
I0524 03:05:16.927167 31164 slave.cpp:6158] Querying resource estimator for oversubscribable
resources
I0524 03:05:16.927428 31155 slave.cpp:6172] Received oversubscribable resources {} from the
resource estimator
I0524 03:05:16.929425 31162 process.cpp:3730] Handling HTTP event for process 'slave(752)'
with path: '/slave(752)/monitor/statistics.json'
I0524 03:05:16.930773 31158 http.cpp:1115] HTTP GET for /slave(752)/monitor/statistics.json
from 172.17.0.2:45280
I0524 03:05:16.930850 31158 http.cpp:936] Authorizing principal 'test-principal' to GET the
'/monitor/statistics.json' endpoint
I0524 03:05:16.933796 31177 slave.cpp:794] Agent terminating
[       OK ] Endpoint/SlaveEndpointTest.NoAuthorizer/1 (27 ms)
[ RUN      ] Endpoint/SlaveEndpointTest.NoAuthorizer/2
I0524 03:05:16.944121 31135 containerizer.cpp:230] Using isolation: posix/cpu,posix/mem,filesystem/posix,network/cni,environment_secret
W0524 03:05:16.944574 31135 backend.cpp:76] Failed to create 'aufs' backend: AufsBackend requires
root privileges
W0524 03:05:16.944676 31135 backend.cpp:76] Failed to create 'bind' backend: BindBackend requires
root privileges
I0524 03:05:16.944715 31135 provisioner.cpp:249] Using default backend 'copy'
I0524 03:05:16.946931 31135 cluster.cpp:448] Creating default 'local' authorizer
I0524 03:05:16.948654 31168 slave.cpp:225] Mesos agent started on (753)@172.17.0.2:37529
I0524 03:05:16.948674 31168 slave.cpp:226] Flags at startup: --acls="" --appc_simple_discovery_uri_prefix="http://"
--appc_store_dir="/tmp/mesos/store/appc" --authenticate_http_readonly="true" --authenticate_http_readwrite="true"
--authenticatee="crammd5" --authentication_backoff_factor="1secs" --authorizer="local" --cgroups_cpu_enable_pids_and_tids_count="false"
--cgroups_enable_cfs="false" --cgroups_hierarchy="/sys/fs/cgroup" --cgroups_limit_swap="false"
--cgroups_root="mesos" --container_disk_watch_interval="15secs" --containerizers="mesos" --credential="/tmp/Endpoint_SlaveEndpointTest_NoAuthorizer_2_LMLDGr/credential"
--default_role="*" --disk_watch_interval="1mins" --docker="docker" --docker_kill_orphans="true"
--docker_registry="https://registry-1.docker.io" --docker_remove_delay="6hrs" --docker_socket="/var/run/docker.sock"
--docker_stop_timeout="0ns" --docker_store_dir="/tmp/mesos/store/docker" --docker_volume_checkpoint_dir="/var/run/mesos/isolators/docker/volume"
--enforce_container_disk_quota="false" --executor_registration_timeout="1mins" --executor_reregistration_timeout="2secs"
--executor_shutdown_grace_period="5secs" --fetcher_cache_dir="/tmp/Endpoint_SlaveEndpointTest_NoAuthorizer_2_LMLDGr/fetch"
--fetcher_cache_size="2GB" --frameworks_home="" --gc_delay="1weeks" --gc_disk_headroom="0.1"
--hadoop_home="" --help="false" --hostname_lookup="true" --http_command_executor="false" --http_credentials="/tmp/Endpoint_SlaveEndpointTest_NoAuthorizer_2_LMLDGr/http_credentials"
--http_heartbeat_interval="30secs" --initialize_driver_logging="true" --isolation="posix/cpu,posix/mem"
--launcher="posix" --launcher_dir="/mesos/mesos-1.4.0/_build/src" --logbufsecs="0" --logging_level="INFO"
--max_completed_executors_per_framework="150" --oversubscribed_resources_interval="15secs"
--perf_duration="10secs" --perf_interval="1mins" --port="5051" --qos_correction_interval_min="0ns"
--quiet="false" --recover="reconnect" --recovery_timeout="15mins" --registration_backoff_factor="10ms"
--resources="cpus:2;gpus:0;mem:1024;disk:1024;ports:[31000-32000]" --revocable_cpu_low_priority="true"
--runtime_dir="/tmp/Endpoint_SlaveEndpointTest_NoAuthorizer_2_LMLDGr" --sandbox_directory="/mnt/mesos/sandbox"
--strict="true" --switch_user="true" --systemd_enable_support="true" --systemd_runtime_directory="/run/systemd/system"
--version="false" --work_dir="/tmp/Endpoint_SlaveEndpointTest_NoAuthorizer_2_EwKxP8"
I0524 03:05:16.949025 31168 credentials.hpp:86] Loading credential for authentication from
'/tmp/Endpoint_SlaveEndpointTest_NoAuthorizer_2_LMLDGr/credential'
I0524 03:05:16.949198 31168 slave.cpp:258] Agent using credential for: test-principal
I0524 03:05:16.949220 31168 credentials.hpp:37] Loading credentials for authentication from
'/tmp/Endpoint_SlaveEndpointTest_NoAuthorizer_2_LMLDGr/http_credentials'
I0524 03:05:16.949434 31168 http.cpp:975] Creating default 'basic' HTTP authenticator for
realm 'mesos-agent-readonly'
I0524 03:05:16.949573 31168 http.cpp:975] Creating default 'basic' HTTP authenticator for
realm 'mesos-agent-readwrite'
I0524 03:05:16.950903 31168 slave.cpp:529] Agent resources: cpus(*):2; mem(*):1024; disk(*):1024;
ports(*):[31000-32000]
I0524 03:05:16.950976 31168 slave.cpp:537] Agent attributes: [  ]
I0524 03:05:16.950992 31168 slave.cpp:542] Agent hostname: 0e6b8de4be3f
I0524 03:05:16.951114 31176 status_update_manager.cpp:177] Pausing sending status updates
I0524 03:05:16.952353 31174 state.cpp:62] Recovering state from '/tmp/Endpoint_SlaveEndpointTest_NoAuthorizer_2_EwKxP8/meta'
I0524 03:05:16.952580 31167 status_update_manager.cpp:203] Recovering status update manager
I0524 03:05:16.952850 31154 containerizer.cpp:627] Recovering containerizer
I0524 03:05:16.954289 31157 provisioner.cpp:410] Provisioner recovery complete
I0524 03:05:16.954671 31175 slave.cpp:5976] Finished recovery
I0524 03:05:16.955121 31175 slave.cpp:6158] Querying resource estimator for oversubscribable
resources
I0524 03:05:16.955376 31173 slave.cpp:6172] Received oversubscribable resources {} from the
resource estimator
I0524 03:05:16.957685 31162 process.cpp:3730] Handling HTTP event for process 'slave(753)'
with path: '/slave(753)/containers'
I0524 03:05:16.958866 31163 http.cpp:1115] HTTP GET for /slave(753)/containers from 172.17.0.2:45282
I0524 03:05:16.958947 31163 http.cpp:936] Authorizing principal 'test-principal' to GET the
'/containers' endpoint
I0524 03:05:16.962085 31176 slave.cpp:794] Agent terminating
[       OK ] Endpoint/SlaveEndpointTest.NoAuthorizer/2 (28 ms)
[----------] 9 tests from Endpoint/SlaveEndpointTest (247 ms total)

[----------] Global test environment tear-down
[==========] 1577 tests from 176 test cases ran. (507770 ms total)
[  PASSED  ] 1576 tests.
[  FAILED  ] 1 test, listed below:
[  FAILED  ] MasterTest.IgnoreOldAgentReregistration

 1 FAILED TEST
  YOU HAVE 22 DISABLED TESTS

E0524 03:05:17.017619 31178 process.cpp:950] Failed to accept socket: future discarded
make[4]: *** [check-local] Error 1
make[4]: Leaving directory `/mesos/mesos-1.4.0/_build/src'
make[3]: *** [check-am] Error 2
make[3]: Leaving directory `/mesos/mesos-1.4.0/_build/src'
make[2]: *** [check] Error 2
make[2]: Leaving directory `/mesos/mesos-1.4.0/_build/src'
make[1]: *** [check-recursive] Error 1
make[1]: Leaving directory `/mesos/mesos-1.4.0/_build'
make: *** [distcheck] Error 1
+ docker rmi mesos-1495592394-14148
Untagged: mesos-1495592394-14148:latest
Deleted: sha256:9ae94cca432427a8e5beb04a9967ce9da5f180c534e9255967ee5ca0fdfb7865
Deleted: sha256:1f735f58a5bdc6fc38bf539bbe8ba628da834039cd9cc76e04ec6ae701f31d90
Deleted: sha256:270fb289f6384ff500ca2cfcdbaa50929b801de15ccbd6031bccca47c6a77a0d
Deleted: sha256:6310b935fe342649c8dea944ddf79261bbcdcfff663d0ee3353cd4e52627c774
Deleted: sha256:298c16614c3e3b104e7306dc15bfe279d70b710d9d3f9c58ca93842b25fdf534
Deleted: sha256:7e84f6a1aecae593bc85a8a72ec40728a56f64cf5225eb47e2d5aae34168c85a
Deleted: sha256:cac90ffdba94988b5de713b77b64e07fc35db0eb7f3f73009ffc5cbc818ac418
Deleted: sha256:ac7e8b9b852233faf41ee8070f7d479bc9a50164655c7ed7802d477def144be0
Deleted: sha256:57ea6cf93cbc9ff43c079cf28576aaba0f083af0ea3bd3eddb2817b75b5f8cf1
Deleted: sha256:825a63b681e85459aa79357659441312ba9ac7c0438eb576aec37b707c46206a
Deleted: sha256:f955b51f087e8412c5f2f2544b6c0790eeff7990bef17aba54322ddf5e0cc6c4
Deleted: sha256:173196f14827b8bb395ddfa17b729096252e294e40520ef8a718585e9cc05bcc
Deleted: sha256:1999c23d10efd3185e2c64359443cda28eead68bea04a4c8668366e762710638
Deleted: sha256:b84bf295cf809415d2883f4baac39054bdc37d10ac57bb23d6f17d107882066c
Deleted: sha256:22149c11773211fc80ae45c5f1aef2f87bbaed7a4cc1719490aa1e547a078a5c
Deleted: sha256:1b50c28718e7932e94aac6f445456498dab9d51473902f9007473060116f6374
Deleted: sha256:c33a8d08f25d5e5c722726d753b8148863736761e3781fcf066abf3174e7867d
Deleted: sha256:f15e658f1f6ed28e691639a92404ce13563015f225ef4296e352f28b9df4fc82
Deleted: sha256:c7d3ebf2bd96c6017a0030754c7616719770ce6a4889425946ea38c43052a1b9
Deleted: sha256:e4fa9c5438490ef6246de7fd75009d4b35cc7f29e484bfeb65f14e11d18192b2
Deleted: sha256:98b80cb90fb80d02d91c07fe7b1345e622875f02051cfca7f14598202e317ba9
Deleted: sha256:fbb72937bea73c19529ca4b13e7655f9628c34e7b006bf111002cafb02fa6cfb
Deleted: sha256:39f5ed878bf8a47b014153c8253a3a2723dd6fbc7b2bdab421ab0feae4b4e87b
Deleted: sha256:668d452c38aad17bb17b0496b174110ef2880eabd6f4cd5cc371c0931c105dfa
Build step 'Execute shell' marked build as failure
Not sending mail to unregistered user xujyan@apple.com
Not sending mail to unregistered user neil.conway@gmail.com

Mime
View raw message