mesos-builds mailing list archives

Site index · List index
Message view « Date » · « Thread »
Top « Date » · « Thread »
From Apache Jenkins Server <jenk...@builds.apache.org>
Subject Build failed in Jenkins: Mesos-Buildbot » autotools,gcc,--verbose --enable-libevent --enable-ssl,GLOG_v=1 MESOS_VERBOSE=1,ubuntu:14.04,(docker||Hadoop)&&(!ubuntu-us1)&&(!ubuntu-eu2) #3693
Date Thu, 18 May 2017 20:21:15 GMT
See <https://builds.apache.org/job/Mesos-Buildbot/BUILDTOOL=autotools,COMPILER=gcc,CONFIGURATION=--verbose%20--enable-libevent%20--enable-ssl,ENVIRONMENT=GLOG_v=1%20MESOS_VERBOSE=1,OS=ubuntu%3A14.04,label_exp=(docker%7C%7CHadoop)&&(!ubuntu-us1)&&(!ubuntu-eu2)/3693/display/redirect?page=changes>

Changes:

[kapil] Disable port-mapping isolator by default.

------------------------------------------
[...truncated 28.50 MB...]
I0518 20:21:07.038166 21780 slave.cpp:794] Agent terminating
[       OK ] Endpoint/SlaveEndpointTest.AuthorizedRequest/2 (29 ms)
[ RUN      ] Endpoint/SlaveEndpointTest.UnauthorizedRequest/0
I0518 20:21:07.048472  1321 containerizer.cpp:221] Using isolation: posix/cpu,posix/mem,filesystem/posix,network/cni
W0518 20:21:07.048962  1321 backend.cpp:76] Failed to create 'aufs' backend: AufsBackend requires
root privileges
W0518 20:21:07.049060  1321 backend.cpp:76] Failed to create 'bind' backend: BindBackend requires
root privileges
I0518 20:21:07.049093  1321 provisioner.cpp:249] Using default backend 'copy'
I0518 20:21:07.052494 21767 slave.cpp:225] Mesos agent started on (753)@172.17.0.3:35507
I0518 20:21:07.052521 21767 slave.cpp:226] Flags at startup: --acls="" --appc_simple_discovery_uri_prefix="http://"
--appc_store_dir="/tmp/mesos/store/appc" --authenticate_http_executors="true" --authenticate_http_readonly="true"
--authenticate_http_readwrite="true" --authenticatee="crammd5" --authentication_backoff_factor="1secs"
--authorizer="local" --cgroups_cpu_enable_pids_and_tids_count="false" --cgroups_enable_cfs="false"
--cgroups_hierarchy="/sys/fs/cgroup" --cgroups_limit_swap="false" --cgroups_root="mesos" --container_disk_watch_interval="15secs"
--containerizers="mesos" --credential="/tmp/Endpoint_SlaveEndpointTest_UnauthorizedRequest_0_ny10iK/credential"
--default_role="*" --disk_watch_interval="1mins" --docker="docker" --docker_kill_orphans="true"
--docker_registry="https://registry-1.docker.io" --docker_remove_delay="6hrs" --docker_socket="/var/run/docker.sock"
--docker_stop_timeout="0ns" --docker_store_dir="/tmp/mesos/store/docker" --docker_volume_checkpoint_dir="/var/run/mesos/isolators/docker/volume"
--enforce_container_disk_quota="false" --executor_registration_timeout="1mins" --executor_secret_key="/tmp/Endpoint_SlaveEndpointTest_UnauthorizedRequest_0_ny10iK/executor_secret_key"
--executor_shutdown_grace_period="5secs" --fetcher_cache_dir="/tmp/Endpoint_SlaveEndpointTest_UnauthorizedRequest_0_ny10iK/fetch"
--fetcher_cache_size="2GB" --frameworks_home="" --gc_delay="1weeks" --gc_disk_headroom="0.1"
--hadoop_home="" --help="false" --hostname_lookup="true" --http_command_executor="false" --http_credentials="/tmp/Endpoint_SlaveEndpointTest_UnauthorizedRequest_0_ny10iK/http_credentials"
--http_heartbeat_interval="30secs" --initialize_driver_logging="true" --isolation="posix/cpu,posix/mem"
--launcher="posix" --launcher_dir="/mesos/mesos-1.4.0/_build/src" --logbufsecs="0" --logging_level="INFO"
--max_completed_executors_per_framework="150" --oversubscribed_resources_interval="15secs"
--perf_duration="10secs" --perf_interval="1mins" --port="5051" --qos_correction_interval_min="0ns"
--quiet="false" --recover="reconnect" --recovery_timeout="15mins" --registration_backoff_factor="10ms"
--resources="cpus:2;gpus:0;mem:1024;disk:1024;ports:[31000-32000]" --revocable_cpu_low_priority="true"
--runtime_dir="/tmp/Endpoint_SlaveEndpointTest_UnauthorizedRequest_0_ny10iK" --sandbox_directory="/mnt/mesos/sandbox"
--strict="true" --switch_user="true" --systemd_enable_support="true" --systemd_runtime_directory="/run/systemd/system"
--version="false" --work_dir="/tmp/Endpoint_SlaveEndpointTest_UnauthorizedRequest_0_q8TubF"
I0518 20:21:07.052994 21767 credentials.hpp:86] Loading credential for authentication from
'/tmp/Endpoint_SlaveEndpointTest_UnauthorizedRequest_0_ny10iK/credential'
I0518 20:21:07.053231 21767 slave.cpp:258] Agent using credential for: test-principal
I0518 20:21:07.053279 21767 credentials.hpp:37] Loading credentials for authentication from
'/tmp/Endpoint_SlaveEndpointTest_UnauthorizedRequest_0_ny10iK/http_credentials'
I0518 20:21:07.053735 21767 http.cpp:975] Creating default 'basic' HTTP authenticator for
realm 'mesos-agent-executor'
I0518 20:21:07.053908 21767 http.cpp:996] Creating default 'jwt' HTTP authenticator for realm
'mesos-agent-executor'
I0518 20:21:07.054165 21767 http.cpp:975] Creating default 'basic' HTTP authenticator for
realm 'mesos-agent-readonly'
I0518 20:21:07.054262 21767 http.cpp:996] Creating default 'jwt' HTTP authenticator for realm
'mesos-agent-readonly'
I0518 20:21:07.054586 21767 http.cpp:975] Creating default 'basic' HTTP authenticator for
realm 'mesos-agent-readwrite'
I0518 20:21:07.054690 21767 http.cpp:996] Creating default 'jwt' HTTP authenticator for realm
'mesos-agent-readwrite'
I0518 20:21:07.056051 21767 slave.cpp:529] Agent resources: cpus(*):2; mem(*):1024; disk(*):1024;
ports(*):[31000-32000]
I0518 20:21:07.056126 21767 slave.cpp:537] Agent attributes: [  ]
I0518 20:21:07.056139 21767 slave.cpp:542] Agent hostname: 4a0f06f590e8
I0518 20:21:07.056264 21789 status_update_manager.cpp:177] Pausing sending status updates
I0518 20:21:07.057389 21785 state.cpp:62] Recovering state from '/tmp/Endpoint_SlaveEndpointTest_UnauthorizedRequest_0_q8TubF/meta'
I0518 20:21:07.057651 21779 status_update_manager.cpp:203] Recovering status update manager
I0518 20:21:07.057955 21783 containerizer.cpp:608] Recovering containerizer
I0518 20:21:07.059510 21769 provisioner.cpp:410] Provisioner recovery complete
I0518 20:21:07.059979 21777 slave.cpp:5974] Finished recovery
I0518 20:21:07.060488 21777 slave.cpp:6156] Querying resource estimator for oversubscribable
resources
I0518 20:21:07.060832 21776 slave.cpp:6170] Received oversubscribable resources {} from the
resource estimator
I0518 20:21:07.062602 21775 process.cpp:3730] Handling HTTP event for process 'slave(753)'
with path: '/slave(753)/monitor/statistics'
I0518 20:21:07.064405 21774 http.cpp:1115] HTTP GET for /slave(753)/monitor/statistics from
172.17.0.3:54110
I0518 20:21:07.064486 21774 http.cpp:936] Authorizing principal 'test-principal' to GET the
'/monitor/statistics' endpoint
I0518 20:21:07.066463 21786 slave.cpp:794] Agent terminating
[       OK ] Endpoint/SlaveEndpointTest.UnauthorizedRequest/0 (28 ms)
[ RUN      ] Endpoint/SlaveEndpointTest.UnauthorizedRequest/1
I0518 20:21:07.077028  1321 containerizer.cpp:221] Using isolation: posix/cpu,posix/mem,filesystem/posix,network/cni
W0518 20:21:07.077512  1321 backend.cpp:76] Failed to create 'aufs' backend: AufsBackend requires
root privileges
W0518 20:21:07.077610  1321 backend.cpp:76] Failed to create 'bind' backend: BindBackend requires
root privileges
I0518 20:21:07.077637  1321 provisioner.cpp:249] Using default backend 'copy'
I0518 20:21:07.081202 21789 slave.cpp:225] Mesos agent started on (754)@172.17.0.3:35507
I0518 20:21:07.081231 21789 slave.cpp:226] Flags at startup: --acls="" --appc_simple_discovery_uri_prefix="http://"
--appc_store_dir="/tmp/mesos/store/appc" --authenticate_http_executors="true" --authenticate_http_readonly="true"
--authenticate_http_readwrite="true" --authenticatee="crammd5" --authentication_backoff_factor="1secs"
--authorizer="local" --cgroups_cpu_enable_pids_and_tids_count="false" --cgroups_enable_cfs="false"
--cgroups_hierarchy="/sys/fs/cgroup" --cgroups_limit_swap="false" --cgroups_root="mesos" --container_disk_watch_interval="15secs"
--containerizers="mesos" --credential="/tmp/Endpoint_SlaveEndpointTest_UnauthorizedRequest_1_jyLq14/credential"
--default_role="*" --disk_watch_interval="1mins" --docker="docker" --docker_kill_orphans="true"
--docker_registry="https://registry-1.docker.io" --docker_remove_delay="6hrs" --docker_socket="/var/run/docker.sock"
--docker_stop_timeout="0ns" --docker_store_dir="/tmp/mesos/store/docker" --docker_volume_checkpoint_dir="/var/run/mesos/isolators/docker/volume"
--enforce_container_disk_quota="false" --executor_registration_timeout="1mins" --executor_secret_key="/tmp/Endpoint_SlaveEndpointTest_UnauthorizedRequest_1_jyLq14/executor_secret_key"
--executor_shutdown_grace_period="5secs" --fetcher_cache_dir="/tmp/Endpoint_SlaveEndpointTest_UnauthorizedRequest_1_jyLq14/fetch"
--fetcher_cache_size="2GB" --frameworks_home="" --gc_delay="1weeks" --gc_disk_headroom="0.1"
--hadoop_home="" --help="false" --hostname_lookup="true" --http_command_executor="false" --http_credentials="/tmp/Endpoint_SlaveEndpointTest_UnauthorizedRequest_1_jyLq14/http_credentials"
--http_heartbeat_interval="30secs" --initialize_driver_logging="true" --isolation="posix/cpu,posix/mem"
--launcher="posix" --launcher_dir="/mesos/mesos-1.4.0/_build/src" --logbufsecs="0" --logging_level="INFO"
--max_completed_executors_per_framework="150" --oversubscribed_resources_interval="15secs"
--perf_duration="10secs" --perf_interval="1mins" --port="5051" --qos_correction_interval_min="0ns"
--quiet="false" --recover="reconnect" --recovery_timeout="15mins" --registration_backoff_factor="10ms"
--resources="cpus:2;gpus:0;mem:1024;disk:1024;ports:[31000-32000]" --revocable_cpu_low_priority="true"
--runtime_dir="/tmp/Endpoint_SlaveEndpointTest_UnauthorizedRequest_1_jyLq14" --sandbox_directory="/mnt/mesos/sandbox"
--strict="true" --switch_user="true" --systemd_enable_support="true" --systemd_runtime_directory="/run/systemd/system"
--version="false" --work_dir="/tmp/Endpoint_SlaveEndpointTest_UnauthorizedRequest_1_AEhKPZ"
I0518 20:21:07.081643 21789 credentials.hpp:86] Loading credential for authentication from
'/tmp/Endpoint_SlaveEndpointTest_UnauthorizedRequest_1_jyLq14/credential'
I0518 20:21:07.081782 21789 slave.cpp:258] Agent using credential for: test-principal
I0518 20:21:07.081802 21789 credentials.hpp:37] Loading credentials for authentication from
'/tmp/Endpoint_SlaveEndpointTest_UnauthorizedRequest_1_jyLq14/http_credentials'
I0518 20:21:07.082065 21789 http.cpp:975] Creating default 'basic' HTTP authenticator for
realm 'mesos-agent-executor'
I0518 20:21:07.082166 21789 http.cpp:996] Creating default 'jwt' HTTP authenticator for realm
'mesos-agent-executor'
I0518 20:21:07.082515 21789 http.cpp:975] Creating default 'basic' HTTP authenticator for
realm 'mesos-agent-readonly'
I0518 20:21:07.082628 21789 http.cpp:996] Creating default 'jwt' HTTP authenticator for realm
'mesos-agent-readonly'
I0518 20:21:07.082964 21789 http.cpp:975] Creating default 'basic' HTTP authenticator for
realm 'mesos-agent-readwrite'
I0518 20:21:07.083073 21789 http.cpp:996] Creating default 'jwt' HTTP authenticator for realm
'mesos-agent-readwrite'
I0518 20:21:07.084336 21789 slave.cpp:529] Agent resources: cpus(*):2; mem(*):1024; disk(*):1024;
ports(*):[31000-32000]
I0518 20:21:07.084412 21789 slave.cpp:537] Agent attributes: [  ]
I0518 20:21:07.084425 21789 slave.cpp:542] Agent hostname: 4a0f06f590e8
I0518 20:21:07.084576 21787 status_update_manager.cpp:177] Pausing sending status updates
I0518 20:21:07.085712 21775 state.cpp:62] Recovering state from '/tmp/Endpoint_SlaveEndpointTest_UnauthorizedRequest_1_AEhKPZ/meta'
I0518 20:21:07.085976 21767 status_update_manager.cpp:203] Recovering status update manager
I0518 20:21:07.086208 21787 containerizer.cpp:608] Recovering containerizer
I0518 20:21:07.087641 21782 provisioner.cpp:410] Provisioner recovery complete
I0518 20:21:07.088150 21784 slave.cpp:5974] Finished recovery
I0518 20:21:07.088585 21784 slave.cpp:6156] Querying resource estimator for oversubscribable
resources
I0518 20:21:07.088824 21767 slave.cpp:6170] Received oversubscribable resources {} from the
resource estimator
I0518 20:21:07.090503 21771 process.cpp:3730] Handling HTTP event for process 'slave(754)'
with path: '/slave(754)/monitor/statistics.json'
I0518 20:21:07.092073 21784 http.cpp:1115] HTTP GET for /slave(754)/monitor/statistics.json
from 172.17.0.3:54112
I0518 20:21:07.092135 21784 http.cpp:936] Authorizing principal 'test-principal' to GET the
'/monitor/statistics.json' endpoint
I0518 20:21:07.094070 21770 slave.cpp:794] Agent terminating
[       OK ] Endpoint/SlaveEndpointTest.UnauthorizedRequest/1 (27 ms)
[ RUN      ] Endpoint/SlaveEndpointTest.UnauthorizedRequest/2
I0518 20:21:07.104005  1321 containerizer.cpp:221] Using isolation: posix/cpu,posix/mem,filesystem/posix,network/cni
W0518 20:21:07.104478  1321 backend.cpp:76] Failed to create 'aufs' backend: AufsBackend requires
root privileges
W0518 20:21:07.104569  1321 backend.cpp:76] Failed to create 'bind' backend: BindBackend requires
root privileges
I0518 20:21:07.104598  1321 provisioner.cpp:249] Using default backend 'copy'
I0518 20:21:07.108120 21767 slave.cpp:225] Mesos agent started on (755)@172.17.0.3:35507
I0518 20:21:07.108151 21767 slave.cpp:226] Flags at startup: --acls="" --appc_simple_discovery_uri_prefix="http://"
--appc_store_dir="/tmp/mesos/store/appc" --authenticate_http_executors="true" --authenticate_http_readonly="true"
--authenticate_http_readwrite="true" --authenticatee="crammd5" --authentication_backoff_factor="1secs"
--authorizer="local" --cgroups_cpu_enable_pids_and_tids_count="false" --cgroups_enable_cfs="false"
--cgroups_hierarchy="/sys/fs/cgroup" --cgroups_limit_swap="false" --cgroups_root="mesos" --container_disk_watch_interval="15secs"
--containerizers="mesos" --credential="/tmp/Endpoint_SlaveEndpointTest_UnauthorizedRequest_2_jTEq0p/credential"
--default_role="*" --disk_watch_interval="1mins" --docker="docker" --docker_kill_orphans="true"
--docker_registry="https://registry-1.docker.io" --docker_remove_delay="6hrs" --docker_socket="/var/run/docker.sock"
--docker_stop_timeout="0ns" --docker_store_dir="/tmp/mesos/store/docker" --docker_volume_checkpoint_dir="/var/run/mesos/isolators/docker/volume"
--enforce_container_disk_quota="false" --executor_registration_timeout="1mins" --executor_secret_key="/tmp/Endpoint_SlaveEndpointTest_UnauthorizedRequest_2_jTEq0p/executor_secret_key"
--executor_shutdown_grace_period="5secs" --fetcher_cache_dir="/tmp/Endpoint_SlaveEndpointTest_UnauthorizedRequest_2_jTEq0p/fetch"
--fetcher_cache_size="2GB" --frameworks_home="" --gc_delay="1weeks" --gc_disk_headroom="0.1"
--hadoop_home="" --help="false" --hostname_lookup="true" --http_command_executor="false" --http_credentials="/tmp/Endpoint_SlaveEndpointTest_UnauthorizedRequest_2_jTEq0p/http_credentials"
--http_heartbeat_interval="30secs" --initialize_driver_logging="true" --isolation="posix/cpu,posix/mem"
--launcher="posix" --launcher_dir="/mesos/mesos-1.4.0/_build/src" --logbufsecs="0" --logging_level="INFO"
--max_completed_executors_per_framework="150" --oversubscribed_resources_interval="15secs"
--perf_duration="10secs" --perf_interval="1mins" --port="5051" --qos_correction_interval_min="0ns"
--quiet="false" --recover="reconnect" --recovery_timeout="15mins" --registration_backoff_factor="10ms"
--resources="cpus:2;gpus:0;mem:1024;disk:1024;ports:[31000-32000]" --revocable_cpu_low_priority="true"
--runtime_dir="/tmp/Endpoint_SlaveEndpointTest_UnauthorizedRequest_2_jTEq0p" --sandbox_directory="/mnt/mesos/sandbox"
--strict="true" --switch_user="true" --systemd_enable_support="true" --systemd_runtime_directory="/run/systemd/system"
--version="false" --work_dir="/tmp/Endpoint_SlaveEndpointTest_UnauthorizedRequest_2_CB5BKk"
I0518 20:21:07.108523 21767 credentials.hpp:86] Loading credential for authentication from
'/tmp/Endpoint_SlaveEndpointTest_UnauthorizedRequest_2_jTEq0p/credential'
I0518 20:21:07.108687 21767 slave.cpp:258] Agent using credential for: test-principal
I0518 20:21:07.108707 21767 credentials.hpp:37] Loading credentials for authentication from
'/tmp/Endpoint_SlaveEndpointTest_UnauthorizedRequest_2_jTEq0p/http_credentials'
I0518 20:21:07.108965 21767 http.cpp:975] Creating default 'basic' HTTP authenticator for
realm 'mesos-agent-executor'
I0518 20:21:07.109072 21767 http.cpp:996] Creating default 'jwt' HTTP authenticator for realm
'mesos-agent-executor'
I0518 20:21:07.109246 21767 http.cpp:975] Creating default 'basic' HTTP authenticator for
realm 'mesos-agent-readonly'
I0518 20:21:07.109344 21767 http.cpp:996] Creating default 'jwt' HTTP authenticator for realm
'mesos-agent-readonly'
I0518 20:21:07.109513 21767 http.cpp:975] Creating default 'basic' HTTP authenticator for
realm 'mesos-agent-readwrite'
I0518 20:21:07.109643 21767 http.cpp:996] Creating default 'jwt' HTTP authenticator for realm
'mesos-agent-readwrite'
I0518 20:21:07.111169 21767 slave.cpp:529] Agent resources: cpus(*):2; mem(*):1024; disk(*):1024;
ports(*):[31000-32000]
I0518 20:21:07.111306 21767 slave.cpp:537] Agent attributes: [  ]
I0518 20:21:07.111327 21767 slave.cpp:542] Agent hostname: 4a0f06f590e8
I0518 20:21:07.111500 21777 status_update_manager.cpp:177] Pausing sending status updates
I0518 20:21:07.113039 21785 state.cpp:62] Recovering state from '/tmp/Endpoint_SlaveEndpointTest_UnauthorizedRequest_2_CB5BKk/meta'
I0518 20:21:07.113680 21785 status_update_manager.cpp:203] Recovering status update manager
I0518 20:21:07.113864 21772 containerizer.cpp:608] Recovering containerizer
I0518 20:21:07.115541 21779 provisioner.cpp:410] Provisioner recovery complete
I0518 20:21:07.116093 21784 slave.cpp:5974] Finished recovery
I0518 20:21:07.116555 21784 slave.cpp:6156] Querying resource estimator for oversubscribable
resources
I0518 20:21:07.116921 21788 slave.cpp:6170] Received oversubscribable resources {} from the
resource estimator
I0518 20:21:07.118566 21778 process.cpp:3730] Handling HTTP event for process 'slave(755)'
with path: '/slave(755)/containers'
I0518 20:21:07.120357 21777 http.cpp:1115] HTTP GET for /slave(755)/containers from 172.17.0.3:54114
I0518 20:21:07.120434 21777 http.cpp:936] Authorizing principal 'test-principal' to GET the
'/containers' endpoint
I0518 20:21:07.122793 21790 slave.cpp:794] Agent terminating
[       OK ] Endpoint/SlaveEndpointTest.UnauthorizedRequest/2 (29 ms)
[ RUN      ] Endpoint/SlaveEndpointTest.NoAuthorizer/0
I0518 20:21:07.133141  1321 containerizer.cpp:221] Using isolation: posix/cpu,posix/mem,filesystem/posix,network/cni
W0518 20:21:07.133641  1321 backend.cpp:76] Failed to create 'aufs' backend: AufsBackend requires
root privileges
W0518 20:21:07.133734  1321 backend.cpp:76] Failed to create 'bind' backend: BindBackend requires
root privileges
I0518 20:21:07.133771  1321 provisioner.cpp:249] Using default backend 'copy'
I0518 20:21:07.135741  1321 cluster.cpp:448] Creating default 'local' authorizer
I0518 20:21:07.137490 21790 slave.cpp:225] Mesos agent started on (756)@172.17.0.3:35507
I0518 20:21:07.137509 21790 slave.cpp:226] Flags at startup: --acls="" --appc_simple_discovery_uri_prefix="http://"
--appc_store_dir="/tmp/mesos/store/appc" --authenticate_http_executors="true" --authenticate_http_readonly="true"
--authenticate_http_readwrite="true" --authenticatee="crammd5" --authentication_backoff_factor="1secs"
--authorizer="local" --cgroups_cpu_enable_pids_and_tids_count="false" --cgroups_enable_cfs="false"
--cgroups_hierarchy="/sys/fs/cgroup" --cgroups_limit_swap="false" --cgroups_root="mesos" --container_disk_watch_interval="15secs"
--containerizers="mesos" --credential="/tmp/Endpoint_SlaveEndpointTest_NoAuthorizer_0_nbJtgL/credential"
--default_role="*" --disk_watch_interval="1mins" --docker="docker" --docker_kill_orphans="true"
--docker_registry="https://registry-1.docker.io" --docker_remove_delay="6hrs" --docker_socket="/var/run/docker.sock"
--docker_stop_timeout="0ns" --docker_store_dir="/tmp/mesos/store/docker" --docker_volume_checkpoint_dir="/var/run/mesos/isolators/docker/volume"
--enforce_container_disk_quota="false" --executor_registration_timeout="1mins" --executor_secret_key="/tmp/Endpoint_SlaveEndpointTest_NoAuthorizer_0_nbJtgL/executor_secret_key"
--executor_shutdown_grace_period="5secs" --fetcher_cache_dir="/tmp/Endpoint_SlaveEndpointTest_NoAuthorizer_0_nbJtgL/fetch"
--fetcher_cache_size="2GB" --frameworks_home="" --gc_delay="1weeks" --gc_disk_headroom="0.1"
--hadoop_home="" --help="false" --hostname_lookup="true" --http_command_executor="false" --http_credentials="/tmp/Endpoint_SlaveEndpointTest_NoAuthorizer_0_nbJtgL/http_credentials"
--http_heartbeat_interval="30secs" --initialize_driver_logging="true" --isolation="posix/cpu,posix/mem"
--launcher="posix" --launcher_dir="/mesos/mesos-1.4.0/_build/src" --logbufsecs="0" --logging_level="INFO"
--max_completed_executors_per_framework="150" --oversubscribed_resources_interval="15secs"
--perf_duration="10secs" --perf_interval="1mins" --port="5051" --qos_correction_interval_min="0ns"
--quiet="false" --recover="reconnect" --recovery_timeout="15mins" --registration_backoff_factor="10ms"
--resources="cpus:2;gpus:0;mem:1024;disk:1024;ports:[31000-32000]" --revocable_cpu_low_priority="true"
--runtime_dir="/tmp/Endpoint_SlaveEndpointTest_NoAuthorizer_0_nbJtgL" --sandbox_directory="/mnt/mesos/sandbox"
--strict="true" --switch_user="true" --systemd_enable_support="true" --systemd_runtime_directory="/run/systemd/system"
--version="false" --work_dir="/tmp/Endpoint_SlaveEndpointTest_NoAuthorizer_0_omOmWF"
I0518 20:21:07.137859 21790 credentials.hpp:86] Loading credential for authentication from
'/tmp/Endpoint_SlaveEndpointTest_NoAuthorizer_0_nbJtgL/credential'
I0518 20:21:07.138012 21790 slave.cpp:258] Agent using credential for: test-principal
I0518 20:21:07.138034 21790 credentials.hpp:37] Loading credentials for authentication from
'/tmp/Endpoint_SlaveEndpointTest_NoAuthorizer_0_nbJtgL/http_credentials'
I0518 20:21:07.138317 21790 http.cpp:975] Creating default 'basic' HTTP authenticator for
realm 'mesos-agent-executor'
I0518 20:21:07.138424 21790 http.cpp:996] Creating default 'jwt' HTTP authenticator for realm
'mesos-agent-executor'
I0518 20:21:07.138630 21790 http.cpp:975] Creating default 'basic' HTTP authenticator for
realm 'mesos-agent-readonly'
I0518 20:21:07.138764 21790 http.cpp:996] Creating default 'jwt' HTTP authenticator for realm
'mesos-agent-readonly'
I0518 20:21:07.139106 21790 http.cpp:975] Creating default 'basic' HTTP authenticator for
realm 'mesos-agent-readwrite'
I0518 20:21:07.139226 21790 http.cpp:996] Creating default 'jwt' HTTP authenticator for realm
'mesos-agent-readwrite'
I0518 20:21:07.140758 21790 slave.cpp:529] Agent resources: cpus(*):2; mem(*):1024; disk(*):1024;
ports(*):[31000-32000]
I0518 20:21:07.140835 21790 slave.cpp:537] Agent attributes: [  ]
I0518 20:21:07.140847 21790 slave.cpp:542] Agent hostname: 4a0f06f590e8
I0518 20:21:07.140990 21783 status_update_manager.cpp:177] Pausing sending status updates
I0518 20:21:07.142168 21781 state.cpp:62] Recovering state from '/tmp/Endpoint_SlaveEndpointTest_NoAuthorizer_0_omOmWF/meta'
I0518 20:21:07.142462 21783 status_update_manager.cpp:203] Recovering status update manager
I0518 20:21:07.142807 21779 containerizer.cpp:608] Recovering containerizer
I0518 20:21:07.144351 21767 provisioner.cpp:410] Provisioner recovery complete
I0518 20:21:07.144783 21786 slave.cpp:5974] Finished recovery
I0518 20:21:07.145273 21786 slave.cpp:6156] Querying resource estimator for oversubscribable
resources
I0518 20:21:07.145522 21784 slave.cpp:6170] Received oversubscribable resources {} from the
resource estimator
I0518 20:21:07.147164 21776 process.cpp:3730] Handling HTTP event for process 'slave(756)'
with path: '/slave(756)/monitor/statistics'
I0518 20:21:07.148910 21769 http.cpp:1115] HTTP GET for /slave(756)/monitor/statistics from
172.17.0.3:54116
I0518 20:21:07.148994 21769 http.cpp:936] Authorizing principal 'test-principal' to GET the
'/monitor/statistics' endpoint
I0518 20:21:07.152185 21790 slave.cpp:794] Agent terminating
[       OK ] Endpoint/SlaveEndpointTest.NoAuthorizer/0 (29 ms)
[ RUN      ] Endpoint/SlaveEndpointTest.NoAuthorizer/1
I0518 20:21:07.162256  1321 containerizer.cpp:221] Using isolation: posix/cpu,posix/mem,filesystem/posix,network/cni
W0518 20:21:07.162773  1321 backend.cpp:76] Failed to create 'aufs' backend: AufsBackend requires
root privileges
W0518 20:21:07.162894  1321 backend.cpp:76] Failed to create 'bind' backend: BindBackend requires
root privileges
I0518 20:21:07.162943  1321 provisioner.cpp:249] Using default backend 'copy'
I0518 20:21:07.165000  1321 cluster.cpp:448] Creating default 'local' authorizer
I0518 20:21:07.166782 21774 slave.cpp:225] Mesos agent started on (757)@172.17.0.3:35507
I0518 20:21:07.166805 21774 slave.cpp:226] Flags at startup: --acls="" --appc_simple_discovery_uri_prefix="http://"
--appc_store_dir="/tmp/mesos/store/appc" --authenticate_http_executors="true" --authenticate_http_readonly="true"
--authenticate_http_readwrite="true" --authenticatee="crammd5" --authentication_backoff_factor="1secs"
--authorizer="local" --cgroups_cpu_enable_pids_and_tids_count="false" --cgroups_enable_cfs="false"
--cgroups_hierarchy="/sys/fs/cgroup" --cgroups_limit_swap="false" --cgroups_root="mesos" --container_disk_watch_interval="15secs"
--containerizers="mesos" --credential="/tmp/Endpoint_SlaveEndpointTest_NoAuthorizer_1_TDUMN6/credential"
--default_role="*" --disk_watch_interval="1mins" --docker="docker" --docker_kill_orphans="true"
--docker_registry="https://registry-1.docker.io" --docker_remove_delay="6hrs" --docker_socket="/var/run/docker.sock"
--docker_stop_timeout="0ns" --docker_store_dir="/tmp/mesos/store/docker" --docker_volume_checkpoint_dir="/var/run/mesos/isolators/docker/volume"
--enforce_container_disk_quota="false" --executor_registration_timeout="1mins" --executor_secret_key="/tmp/Endpoint_SlaveEndpointTest_NoAuthorizer_1_TDUMN6/executor_secret_key"
--executor_shutdown_grace_period="5secs" --fetcher_cache_dir="/tmp/Endpoint_SlaveEndpointTest_NoAuthorizer_1_TDUMN6/fetch"
--fetcher_cache_size="2GB" --frameworks_home="" --gc_delay="1weeks" --gc_disk_headroom="0.1"
--hadoop_home="" --help="false" --hostname_lookup="true" --http_command_executor="false" --http_credentials="/tmp/Endpoint_SlaveEndpointTest_NoAuthorizer_1_TDUMN6/http_credentials"
--http_heartbeat_interval="30secs" --initialize_driver_logging="true" --isolation="posix/cpu,posix/mem"
--launcher="posix" --launcher_dir="/mesos/mesos-1.4.0/_build/src" --logbufsecs="0" --logging_level="INFO"
--max_completed_executors_per_framework="150" --oversubscribed_resources_interval="15secs"
--perf_duration="10secs" --perf_interval="1mins" --port="5051" --qos_correction_interval_min="0ns"
--quiet="false" --recover="reconnect" --recovery_timeout="15mins" --registration_backoff_factor="10ms"
--resources="cpus:2;gpus:0;mem:1024;disk:1024;ports:[31000-32000]" --revocable_cpu_low_priority="true"
--runtime_dir="/tmp/Endpoint_SlaveEndpointTest_NoAuthorizer_1_TDUMN6" --sandbox_directory="/mnt/mesos/sandbox"
--strict="true" --switch_user="true" --systemd_enable_support="true" --systemd_runtime_directory="/run/systemd/system"
--version="false" --work_dir="/tmp/Endpoint_SlaveEndpointTest_NoAuthorizer_1_cmplp1"
I0518 20:21:07.167148 21774 credentials.hpp:86] Loading credential for authentication from
'/tmp/Endpoint_SlaveEndpointTest_NoAuthorizer_1_TDUMN6/credential'
I0518 20:21:07.167291 21774 slave.cpp:258] Agent using credential for: test-principal
I0518 20:21:07.167313 21774 credentials.hpp:37] Loading credentials for authentication from
'/tmp/Endpoint_SlaveEndpointTest_NoAuthorizer_1_TDUMN6/http_credentials'
I0518 20:21:07.167563 21774 http.cpp:975] Creating default 'basic' HTTP authenticator for
realm 'mesos-agent-executor'
I0518 20:21:07.167662 21774 http.cpp:996] Creating default 'jwt' HTTP authenticator for realm
'mesos-agent-executor'
I0518 20:21:07.167845 21774 http.cpp:975] Creating default 'basic' HTTP authenticator for
realm 'mesos-agent-readonly'
I0518 20:21:07.167943 21774 http.cpp:996] Creating default 'jwt' HTTP authenticator for realm
'mesos-agent-readonly'
I0518 20:21:07.168210 21774 http.cpp:975] Creating default 'basic' HTTP authenticator for
realm 'mesos-agent-readwrite'
I0518 20:21:07.168341 21774 http.cpp:996] Creating default 'jwt' HTTP authenticator for realm
'mesos-agent-readwrite'
I0518 20:21:07.169708 21774 slave.cpp:529] Agent resources: cpus(*):2; mem(*):1024; disk(*):1024;
ports(*):[31000-32000]
I0518 20:21:07.169785 21774 slave.cpp:537] Agent attributes: [  ]
I0518 20:21:07.169797 21774 slave.cpp:542] Agent hostname: 4a0f06f590e8
I0518 20:21:07.169914 21778 status_update_manager.cpp:177] Pausing sending status updates
I0518 20:21:07.171051 21781 state.cpp:62] Recovering state from '/tmp/Endpoint_SlaveEndpointTest_NoAuthorizer_1_cmplp1/meta'
I0518 20:21:07.171386 21774 status_update_manager.cpp:203] Recovering status update manager
I0518 20:21:07.171730 21779 containerizer.cpp:608] Recovering containerizer
I0518 20:21:07.173130 21773 provisioner.cpp:410] Provisioner recovery complete
I0518 20:21:07.173575 21777 slave.cpp:5974] Finished recovery
I0518 20:21:07.174046 21777 slave.cpp:6156] Querying resource estimator for oversubscribable
resources
I0518 20:21:07.174353 21788 slave.cpp:6170] Received oversubscribable resources {} from the
resource estimator
I0518 20:21:07.175976 21777 process.cpp:3730] Handling HTTP event for process 'slave(757)'
with path: '/slave(757)/monitor/statistics.json'
I0518 20:21:07.177577 21770 http.cpp:1115] HTTP GET for /slave(757)/monitor/statistics.json
from 172.17.0.3:54118
I0518 20:21:07.177640 21770 http.cpp:936] Authorizing principal 'test-principal' to GET the
'/monitor/statistics.json' endpoint
I0518 20:21:07.180723 21767 slave.cpp:794] Agent terminating
[       OK ] Endpoint/SlaveEndpointTest.NoAuthorizer/1 (29 ms)
[ RUN      ] Endpoint/SlaveEndpointTest.NoAuthorizer/2
I0518 20:21:07.191752  1321 containerizer.cpp:221] Using isolation: posix/cpu,posix/mem,filesystem/posix,network/cni
W0518 20:21:07.192253  1321 backend.cpp:76] Failed to create 'aufs' backend: AufsBackend requires
root privileges
W0518 20:21:07.192358  1321 backend.cpp:76] Failed to create 'bind' backend: BindBackend requires
root privileges
I0518 20:21:07.192389  1321 provisioner.cpp:249] Using default backend 'copy'
I0518 20:21:07.194142  1321 cluster.cpp:448] Creating default 'local' authorizer
I0518 20:21:07.195752 21781 slave.cpp:225] Mesos agent started on (758)@172.17.0.3:35507
I0518 20:21:07.195780 21781 slave.cpp:226] Flags at startup: --acls="" --appc_simple_discovery_uri_prefix="http://"
--appc_store_dir="/tmp/mesos/store/appc" --authenticate_http_executors="true" --authenticate_http_readonly="true"
--authenticate_http_readwrite="true" --authenticatee="crammd5" --authentication_backoff_factor="1secs"
--authorizer="local" --cgroups_cpu_enable_pids_and_tids_count="false" --cgroups_enable_cfs="false"
--cgroups_hierarchy="/sys/fs/cgroup" --cgroups_limit_swap="false" --cgroups_root="mesos" --container_disk_watch_interval="15secs"
--containerizers="mesos" --credential="/tmp/Endpoint_SlaveEndpointTest_NoAuthorizer_2_pWvwCs/credential"
--default_role="*" --disk_watch_interval="1mins" --docker="docker" --docker_kill_orphans="true"
--docker_registry="https://registry-1.docker.io" --docker_remove_delay="6hrs" --docker_socket="/var/run/docker.sock"
--docker_stop_timeout="0ns" --docker_store_dir="/tmp/mesos/store/docker" --docker_volume_checkpoint_dir="/var/run/mesos/isolators/docker/volume"
--enforce_container_disk_quota="false" --executor_registration_timeout="1mins" --executor_secret_key="/tmp/Endpoint_SlaveEndpointTest_NoAuthorizer_2_pWvwCs/executor_secret_key"
--executor_shutdown_grace_period="5secs" --fetcher_cache_dir="/tmp/Endpoint_SlaveEndpointTest_NoAuthorizer_2_pWvwCs/fetch"
--fetcher_cache_size="2GB" --frameworks_home="" --gc_delay="1weeks" --gc_disk_headroom="0.1"
--hadoop_home="" --help="false" --hostname_lookup="true" --http_command_executor="false" --http_credentials="/tmp/Endpoint_SlaveEndpointTest_NoAuthorizer_2_pWvwCs/http_credentials"
--http_heartbeat_interval="30secs" --initialize_driver_logging="true" --isolation="posix/cpu,posix/mem"
--launcher="posix" --launcher_dir="/mesos/mesos-1.4.0/_build/src" --logbufsecs="0" --logging_level="INFO"
--max_completed_executors_per_framework="150" --oversubscribed_resources_interval="15secs"
--perf_duration="10secs" --perf_interval="1mins" --port="5051" --qos_correction_interval_min="0ns"
--quiet="false" --recover="reconnect" --recovery_timeout="15mins" --registration_backoff_factor="10ms"
--resources="cpus:2;gpus:0;mem:1024;disk:1024;ports:[31000-32000]" --revocable_cpu_low_priority="true"
--runtime_dir="/tmp/Endpoint_SlaveEndpointTest_NoAuthorizer_2_pWvwCs" --sandbox_directory="/mnt/mesos/sandbox"
--strict="true" --switch_user="true" --systemd_enable_support="true" --systemd_runtime_directory="/run/systemd/system"
--version="false" --work_dir="/tmp/Endpoint_SlaveEndpointTest_NoAuthorizer_2_EN0G9m"
I0518 20:21:07.196166 21781 credentials.hpp:86] Loading credential for authentication from
'/tmp/Endpoint_SlaveEndpointTest_NoAuthorizer_2_pWvwCs/credential'
I0518 20:21:07.196300 21781 slave.cpp:258] Agent using credential for: test-principal
I0518 20:21:07.196319 21781 credentials.hpp:37] Loading credentials for authentication from
'/tmp/Endpoint_SlaveEndpointTest_NoAuthorizer_2_pWvwCs/http_credentials'
I0518 20:21:07.196624 21781 http.cpp:975] Creating default 'basic' HTTP authenticator for
realm 'mesos-agent-executor'
I0518 20:21:07.196724 21781 http.cpp:996] Creating default 'jwt' HTTP authenticator for realm
'mesos-agent-executor'
I0518 20:21:07.196982 21781 http.cpp:975] Creating default 'basic' HTTP authenticator for
realm 'mesos-agent-readonly'
I0518 20:21:07.197118 21781 http.cpp:996] Creating default 'jwt' HTTP authenticator for realm
'mesos-agent-readonly'
I0518 20:21:07.197516 21781 http.cpp:975] Creating default 'basic' HTTP authenticator for
realm 'mesos-agent-readwrite'
I0518 20:21:07.197620 21781 http.cpp:996] Creating default 'jwt' HTTP authenticator for realm
'mesos-agent-readwrite'
I0518 20:21:07.199141 21781 slave.cpp:529] Agent resources: cpus(*):2; mem(*):1024; disk(*):1024;
ports(*):[31000-32000]
I0518 20:21:07.199219 21781 slave.cpp:537] Agent attributes: [  ]
I0518 20:21:07.199231 21781 slave.cpp:542] Agent hostname: 4a0f06f590e8
I0518 20:21:07.199357 21772 status_update_manager.cpp:177] Pausing sending status updates
I0518 20:21:07.200835 21767 state.cpp:62] Recovering state from '/tmp/Endpoint_SlaveEndpointTest_NoAuthorizer_2_EN0G9m/meta'
I0518 20:21:07.201076 21777 status_update_manager.cpp:203] Recovering status update manager
I0518 20:21:07.201273 21769 containerizer.cpp:608] Recovering containerizer
I0518 20:21:07.202853 21788 provisioner.cpp:410] Provisioner recovery complete
I0518 20:21:07.203416 21786 slave.cpp:5974] Finished recovery
I0518 20:21:07.203893 21786 slave.cpp:6156] Querying resource estimator for oversubscribable
resources
I0518 20:21:07.204125 21783 slave.cpp:6170] Received oversubscribable resources {} from the
resource estimator
I0518 20:21:07.206151 21771 process.cpp:3730] Handling HTTP event for process 'slave(758)'
with path: '/slave(758)/containers'
I0518 20:21:07.207942 21767 http.cpp:1115] HTTP GET for /slave(758)/containers from 172.17.0.3:54120
I0518 20:21:07.208014 21767 http.cpp:936] Authorizing principal 'test-principal' to GET the
'/containers' endpoint
I0518 20:21:07.211218 21782 slave.cpp:794] Agent terminating
[       OK ] Endpoint/SlaveEndpointTest.NoAuthorizer/2 (29 ms)
[----------] 9 tests from Endpoint/SlaveEndpointTest (263 ms total)

[----------] Global test environment tear-down
[==========] 1583 tests from 177 test cases ran. (580893 ms total)
[  PASSED  ] 1579 tests.
[  FAILED  ] 4 tests, listed below:
[  FAILED  ] DefaultExecutorCheckTest.CommandCheckDeliveredAndReconciled
[  FAILED  ] DefaultExecutorCheckTest.CommandCheckStatusChange
[  FAILED  ] DefaultExecutorCheckTest.CommandCheckSeesParentsEnv
[  FAILED  ] DefaultExecutorCheckTest.CommandCheckSharesWorkDirWithTask

 4 FAILED TESTS
  YOU HAVE 22 DISABLED TESTS

E0518 20:21:07.274199 21791 process.cpp:950] Failed to accept socket: future discarded
make[4]: *** [check-local] Error 1
make[4]: Leaving directory `/mesos/mesos-1.4.0/_build/src'
make[3]: *** [check-am] Error 2
make[3]: Leaving directory `/mesos/mesos-1.4.0/_build/src'
make[2]: *** [check] Error 2
make[2]: Leaving directory `/mesos/mesos-1.4.0/_build/src'
make[1]: *** [check-recursive] Error 1
make[1]: Leaving directory `/mesos/mesos-1.4.0/_build'
make: *** [distcheck] Error 1
+ docker rmi mesos-1495135906-24147
Untagged: mesos-1495135906-24147:latest
Deleted: sha256:9dc93125d6f289b4be7f2df31a6fbe1c6996fca996d7a64c9220c105a8356486
Deleted: sha256:4741216e38bdafde8eff9c58d6500b640bfa2d19617b2ba6aa4bf29979ca9aaf
Deleted: sha256:bb34cc502903fdae39778b6efebb1aa0113fa5025fa2bdf8388684b6efe53160
Deleted: sha256:3be0cbe793037388baeed87b601c193c6def95c8ea083c63de9d30b25527fefe
Deleted: sha256:a227efebd9a688e6426c1a39a997f277fe1a9d78ac92eac73704b8e965ab023f
Deleted: sha256:e7314923b39d341b6516a548e7c73de1ee94578eac9e0514ac635b086fc969a7
Deleted: sha256:ef586edbc46d1fa05d78490d902eed8588e9a630b65cd3151ae2acddd93176f3
Deleted: sha256:9e606ab99415c25b7c3c9aee4613af62b15b9e856ec1b94690b60737300d2a2e
Deleted: sha256:abb1eeeac66c243ac524e1a711aef145593be9c5f56b2f0b72f830d60d628a36
Deleted: sha256:fdb477bc063ed900ee4c057eee5d9d239d6225fb0c4464bed2b29dfe31201d11
Deleted: sha256:1d848eff065c103f24c07a92704088e0c6a46d69a48ebb4686aec303ea496eaa
Deleted: sha256:5d0f1650f6b33ed0085bd39bd2c6721e03c550280ade46db26646562505fe147
Deleted: sha256:ce8a02abd3d583a4009ad2240cfc1a62d06247d308b03767710de5b65890f0bd
Deleted: sha256:22f448029da7a3b21afed5b330ba6da154d1c5864eaee941b75fb4b23879e38b
Deleted: sha256:16461d08c9f376532568f6b7ecf5464980a3f2b3a38ffdd8fae050eab4888665
Deleted: sha256:97e5f3c46840d8f788a1e55eb63c6a455cfa277b5462ecd89be835e7b7045593
Deleted: sha256:070696fd1097b37956463d64bb6d3ecc11e38d685ae69f3ec0e8bd115def995c
Deleted: sha256:19875fa434fac3d667352360d2301ed983ccd274960328ca1d834e2616450503
Deleted: sha256:d4285b6c5161768095a48d15f9941cfc4239b8f7384477113c7f913ec8b1d4bb
Deleted: sha256:0acf7c386fc98d912087a1e88c5c7393b856acaa7557bab536bb32af3aa20099
Deleted: sha256:d524aabbf2ee9d304b2e407597daa1b05cd0a163df650135038630f4d2953b41
Deleted: sha256:42613758e8449bf846fb08cfaa70dbeee5f05bd48206aab6c6010d0ad2eb2636
Deleted: sha256:d478ff3b5980849cc3920f70bb5c8b2d9d2b7627ae102e54c5ef551e20953165
Deleted: sha256:d0bff1e19dbc32e1e3e5440236d48d27139db7bc71dff300743c0233a8ad9fd9
Build step 'Execute shell' marked build as failure
Not sending mail to unregistered user yujie.jay@gmail.com

Mime
View raw message