mesos-builds mailing list archives

Site index · List index
Message view « Date » · « Thread »
Top « Date » · « Thread »
From Apache Jenkins Server <jenk...@builds.apache.org>
Subject Build failed in Jenkins: Mesos-Buildbot » autotools,gcc,--verbose --enable-libevent --enable-ssl,GLOG_v=1 MESOS_VERBOSE=1,ubuntu:14.04,(docker||Hadoop)&&(!ubuntu-us1)&&(!ubuntu-eu2) #3603
Date Wed, 03 May 2017 22:55:04 GMT
See <https://builds.apache.org/job/Mesos-Buildbot/BUILDTOOL=autotools,COMPILER=gcc,CONFIGURATION=--verbose%20--enable-libevent%20--enable-ssl,ENVIRONMENT=GLOG_v=1%20MESOS_VERBOSE=1,OS=ubuntu%3A14.04,label_exp=(docker%7C%7CHadoop)&&(!ubuntu-us1)&&(!ubuntu-eu2)/3603/display/redirect?page=changes>

Changes:

[neil.conway] Removed workaround for lack of `thread_local` on OS X.

[neil.conway] Updated "getting started" instructions for XCode 8.0 dependency.

[neil.conway] Replaced `THREAD_LOCAL` with `thread_local` in libprocess.

[neil.conway] Replaced `THREAD_LOCAL` with `thread_local` in stout.

[neil.conway] Removed `thread_local.hpp` from stout.

------------------------------------------
[...truncated 28.35 MB...]
I0503 22:54:55.805126 18373 process.cpp:3730] Handling HTTP event for process 'slave(751)'
with path: '/slave(751)/containers'
I0503 22:54:55.807292 18373 http.cpp:1115] HTTP GET for /slave(751)/containers from 172.17.0.2:37777
I0503 22:54:55.807386 18373 http.cpp:936] Authorizing principal 'test-principal' to GET the
'/containers' endpoint
I0503 22:54:55.810992 18362 slave.cpp:790] Agent terminating
[       OK ] Endpoint/SlaveEndpointTest.AuthorizedRequest/2 (41 ms)
[ RUN      ] Endpoint/SlaveEndpointTest.UnauthorizedRequest/0
I0503 22:54:55.829452   438 containerizer.cpp:221] Using isolation: posix/cpu,posix/mem,filesystem/posix,network/cni
W0503 22:54:55.829989   438 backend.cpp:76] Failed to create 'aufs' backend: AufsBackend requires
root privileges
W0503 22:54:55.830114   438 backend.cpp:76] Failed to create 'bind' backend: BindBackend requires
root privileges
I0503 22:54:55.830160   438 provisioner.cpp:249] Using default backend 'copy'
I0503 22:54:55.833184 18365 slave.cpp:225] Mesos agent started on (752)@172.17.0.2:43403
I0503 22:54:55.833423 18365 slave.cpp:226] Flags at startup: --acls="" --appc_simple_discovery_uri_prefix="http://"
--appc_store_dir="/tmp/mesos/store/appc" --authenticate_http_executors="true" --authenticate_http_readonly="true"
--authenticate_http_readwrite="true" --authenticatee="crammd5" --authentication_backoff_factor="1secs"
--authorizer="local" --cgroups_cpu_enable_pids_and_tids_count="false" --cgroups_enable_cfs="false"
--cgroups_hierarchy="/sys/fs/cgroup" --cgroups_limit_swap="false" --cgroups_root="mesos" --container_disk_watch_interval="15secs"
--containerizers="mesos" --credential="/tmp/Endpoint_SlaveEndpointTest_UnauthorizedRequest_0_rWahF9/credential"
--default_role="*" --disk_watch_interval="1mins" --docker="docker" --docker_kill_orphans="true"
--docker_registry="https://registry-1.docker.io" --docker_remove_delay="6hrs" --docker_socket="/var/run/docker.sock"
--docker_stop_timeout="0ns" --docker_store_dir="/tmp/mesos/store/docker" --docker_volume_checkpoint_dir="/var/run/mesos/isolators/docker/volume"
--enforce_container_disk_quota="false" --executor_registration_timeout="1mins" --executor_secret_key="/tmp/Endpoint_SlaveEndpointTest_UnauthorizedRequest_0_rWahF9/executor_secret_key"
--executor_shutdown_grace_period="5secs" --fetcher_cache_dir="/tmp/Endpoint_SlaveEndpointTest_UnauthorizedRequest_0_rWahF9/fetch"
--fetcher_cache_size="2GB" --frameworks_home="" --gc_delay="1weeks" --gc_disk_headroom="0.1"
--hadoop_home="" --help="false" --hostname_lookup="true" --http_command_executor="false" --http_credentials="/tmp/Endpoint_SlaveEndpointTest_UnauthorizedRequest_0_rWahF9/http_credentials"
--http_heartbeat_interval="30secs" --initialize_driver_logging="true" --isolation="posix/cpu,posix/mem"
--launcher="posix" --launcher_dir="/mesos/mesos-1.4.0/_build/src" --logbufsecs="0" --logging_level="INFO"
--max_completed_executors_per_framework="150" --oversubscribed_resources_interval="15secs"
--perf_duration="10secs" --perf_interval="1mins" --port="5051" --qos_correction_interval_min="0ns"
--quiet="false" --recover="reconnect" --recovery_timeout="15mins" --registration_backoff_factor="10ms"
--resources="cpus:2;gpus:0;mem:1024;disk:1024;ports:[31000-32000]" --revocable_cpu_low_priority="true"
--runtime_dir="/tmp/Endpoint_SlaveEndpointTest_UnauthorizedRequest_0_rWahF9" --sandbox_directory="/mnt/mesos/sandbox"
--strict="true" --switch_user="true" --systemd_enable_support="true" --systemd_runtime_directory="/run/systemd/system"
--version="false" --work_dir="/tmp/Endpoint_SlaveEndpointTest_UnauthorizedRequest_0_m2g68I"
I0503 22:54:55.833817 18365 credentials.hpp:86] Loading credential for authentication from
'/tmp/Endpoint_SlaveEndpointTest_UnauthorizedRequest_0_rWahF9/credential'
I0503 22:54:55.834167 18365 slave.cpp:258] Agent using credential for: test-principal
I0503 22:54:55.834192 18365 credentials.hpp:37] Loading credentials for authentication from
'/tmp/Endpoint_SlaveEndpointTest_UnauthorizedRequest_0_rWahF9/http_credentials'
I0503 22:54:55.834528 18365 http.cpp:975] Creating default 'basic' HTTP authenticator for
realm 'mesos-agent-executor'
I0503 22:54:55.834674 18365 http.cpp:996] Creating default 'jwt' HTTP authenticator for realm
'mesos-agent-executor'
I0503 22:54:55.834913 18365 http.cpp:975] Creating default 'basic' HTTP authenticator for
realm 'mesos-agent-readonly'
I0503 22:54:55.835017 18365 http.cpp:996] Creating default 'jwt' HTTP authenticator for realm
'mesos-agent-readonly'
I0503 22:54:55.835219 18365 http.cpp:975] Creating default 'basic' HTTP authenticator for
realm 'mesos-agent-readwrite'
I0503 22:54:55.835330 18365 http.cpp:996] Creating default 'jwt' HTTP authenticator for realm
'mesos-agent-readwrite'
I0503 22:54:55.836568 18365 slave.cpp:525] Agent resources: cpus(*):2; mem(*):1024; disk(*):1024;
ports(*):[31000-32000]
I0503 22:54:55.836649 18365 slave.cpp:533] Agent attributes: [  ]
I0503 22:54:55.836669 18365 slave.cpp:538] Agent hostname: c4815b15a0b0
I0503 22:54:55.836833 18360 status_update_manager.cpp:177] Pausing sending status updates
I0503 22:54:55.838295 18370 state.cpp:62] Recovering state from '/tmp/Endpoint_SlaveEndpointTest_UnauthorizedRequest_0_m2g68I/meta'
I0503 22:54:55.838731 18370 status_update_manager.cpp:203] Recovering status update manager
I0503 22:54:55.838927 18367 containerizer.cpp:608] Recovering containerizer
I0503 22:54:55.840926 18372 provisioner.cpp:410] Provisioner recovery complete
I0503 22:54:55.841315 18368 slave.cpp:5963] Finished recovery
I0503 22:54:55.842226 18368 slave.cpp:6145] Querying resource estimator for oversubscribable
resources
I0503 22:54:55.842762 18368 slave.cpp:6159] Received oversubscribable resources {} from the
resource estimator
I0503 22:54:55.845633 18360 process.cpp:3730] Handling HTTP event for process 'slave(752)'
with path: '/slave(752)/monitor/statistics'
I0503 22:54:55.847668 18365 http.cpp:1115] HTTP GET for /slave(752)/monitor/statistics from
172.17.0.2:37778
I0503 22:54:55.847779 18365 http.cpp:936] Authorizing principal 'test-principal' to GET the
'/monitor/statistics' endpoint
I0503 22:54:55.851351   438 slave.cpp:790] Agent terminating
[       OK ] Endpoint/SlaveEndpointTest.UnauthorizedRequest/0 (38 ms)
[ RUN      ] Endpoint/SlaveEndpointTest.UnauthorizedRequest/1
I0503 22:54:55.868299   438 containerizer.cpp:221] Using isolation: posix/cpu,posix/mem,filesystem/posix,network/cni
W0503 22:54:55.868913   438 backend.cpp:76] Failed to create 'aufs' backend: AufsBackend requires
root privileges
W0503 22:54:55.869072   438 backend.cpp:76] Failed to create 'bind' backend: BindBackend requires
root privileges
I0503 22:54:55.869115   438 provisioner.cpp:249] Using default backend 'copy'
I0503 22:54:55.873579 18368 slave.cpp:225] Mesos agent started on (753)@172.17.0.2:43403
I0503 22:54:55.873610 18368 slave.cpp:226] Flags at startup: --acls="" --appc_simple_discovery_uri_prefix="http://"
--appc_store_dir="/tmp/mesos/store/appc" --authenticate_http_executors="true" --authenticate_http_readonly="true"
--authenticate_http_readwrite="true" --authenticatee="crammd5" --authentication_backoff_factor="1secs"
--authorizer="local" --cgroups_cpu_enable_pids_and_tids_count="false" --cgroups_enable_cfs="false"
--cgroups_hierarchy="/sys/fs/cgroup" --cgroups_limit_swap="false" --cgroups_root="mesos" --container_disk_watch_interval="15secs"
--containerizers="mesos" --credential="/tmp/Endpoint_SlaveEndpointTest_UnauthorizedRequest_1_h4nR4R/credential"
--default_role="*" --disk_watch_interval="1mins" --docker="docker" --docker_kill_orphans="true"
--docker_registry="https://registry-1.docker.io" --docker_remove_delay="6hrs" --docker_socket="/var/run/docker.sock"
--docker_stop_timeout="0ns" --docker_store_dir="/tmp/mesos/store/docker" --docker_volume_checkpoint_dir="/var/run/mesos/isolators/docker/volume"
--enforce_container_disk_quota="false" --executor_registration_timeout="1mins" --executor_secret_key="/tmp/Endpoint_SlaveEndpointTest_UnauthorizedRequest_1_h4nR4R/executor_secret_key"
--executor_shutdown_grace_period="5secs" --fetcher_cache_dir="/tmp/Endpoint_SlaveEndpointTest_UnauthorizedRequest_1_h4nR4R/fetch"
--fetcher_cache_size="2GB" --frameworks_home="" --gc_delay="1weeks" --gc_disk_headroom="0.1"
--hadoop_home="" --help="false" --hostname_lookup="true" --http_command_executor="false" --http_credentials="/tmp/Endpoint_SlaveEndpointTest_UnauthorizedRequest_1_h4nR4R/http_credentials"
--http_heartbeat_interval="30secs" --initialize_driver_logging="true" --isolation="posix/cpu,posix/mem"
--launcher="posix" --launcher_dir="/mesos/mesos-1.4.0/_build/src" --logbufsecs="0" --logging_level="INFO"
--max_completed_executors_per_framework="150" --oversubscribed_resources_interval="15secs"
--perf_duration="10secs" --perf_interval="1mins" --port="5051" --qos_correction_interval_min="0ns"
--quiet="false" --recover="reconnect" --recovery_timeout="15mins" --registration_backoff_factor="10ms"
--resources="cpus:2;gpus:0;mem:1024;disk:1024;ports:[31000-32000]" --revocable_cpu_low_priority="true"
--runtime_dir="/tmp/Endpoint_SlaveEndpointTest_UnauthorizedRequest_1_h4nR4R" --sandbox_directory="/mnt/mesos/sandbox"
--strict="true" --switch_user="true" --systemd_enable_support="true" --systemd_runtime_directory="/run/systemd/system"
--version="false" --work_dir="/tmp/Endpoint_SlaveEndpointTest_UnauthorizedRequest_1_81Tosr"
I0503 22:54:55.874217 18368 credentials.hpp:86] Loading credential for authentication from
'/tmp/Endpoint_SlaveEndpointTest_UnauthorizedRequest_1_h4nR4R/credential'
I0503 22:54:55.874478 18368 slave.cpp:258] Agent using credential for: test-principal
I0503 22:54:55.874502 18368 credentials.hpp:37] Loading credentials for authentication from
'/tmp/Endpoint_SlaveEndpointTest_UnauthorizedRequest_1_h4nR4R/http_credentials'
I0503 22:54:55.874908 18368 http.cpp:975] Creating default 'basic' HTTP authenticator for
realm 'mesos-agent-executor'
I0503 22:54:55.875097 18368 http.cpp:996] Creating default 'jwt' HTTP authenticator for realm
'mesos-agent-executor'
I0503 22:54:55.875380 18368 http.cpp:975] Creating default 'basic' HTTP authenticator for
realm 'mesos-agent-readonly'
I0503 22:54:55.875636 18368 http.cpp:996] Creating default 'jwt' HTTP authenticator for realm
'mesos-agent-readonly'
I0503 22:54:55.875885 18368 http.cpp:975] Creating default 'basic' HTTP authenticator for
realm 'mesos-agent-readwrite'
I0503 22:54:55.875980 18368 http.cpp:996] Creating default 'jwt' HTTP authenticator for realm
'mesos-agent-readwrite'
I0503 22:54:55.877971 18368 slave.cpp:525] Agent resources: cpus(*):2; mem(*):1024; disk(*):1024;
ports(*):[31000-32000]
I0503 22:54:55.878084 18368 slave.cpp:533] Agent attributes: [  ]
I0503 22:54:55.878104 18368 slave.cpp:538] Agent hostname: c4815b15a0b0
I0503 22:54:55.878382 18374 status_update_manager.cpp:177] Pausing sending status updates
I0503 22:54:55.880192 18373 state.cpp:62] Recovering state from '/tmp/Endpoint_SlaveEndpointTest_UnauthorizedRequest_1_81Tosr/meta'
I0503 22:54:55.880527 18362 status_update_manager.cpp:203] Recovering status update manager
I0503 22:54:55.880740 18373 containerizer.cpp:608] Recovering containerizer
I0503 22:54:55.882400 18374 provisioner.cpp:410] Provisioner recovery complete
I0503 22:54:55.882865 18365 slave.cpp:5963] Finished recovery
I0503 22:54:55.883540 18365 slave.cpp:6145] Querying resource estimator for oversubscribable
resources
I0503 22:54:55.883836 18365 slave.cpp:6159] Received oversubscribable resources {} from the
resource estimator
I0503 22:54:55.886611 18364 process.cpp:3730] Handling HTTP event for process 'slave(753)'
with path: '/slave(753)/monitor/statistics.json'
I0503 22:54:55.888697 18371 http.cpp:1115] HTTP GET for /slave(753)/monitor/statistics.json
from 172.17.0.2:37779
I0503 22:54:55.888862 18371 http.cpp:936] Authorizing principal 'test-principal' to GET the
'/monitor/statistics.json' endpoint
I0503 22:54:55.893117 18367 slave.cpp:790] Agent terminating
[       OK ] Endpoint/SlaveEndpointTest.UnauthorizedRequest/1 (41 ms)
[ RUN      ] Endpoint/SlaveEndpointTest.UnauthorizedRequest/2
I0503 22:54:55.908980   438 containerizer.cpp:221] Using isolation: posix/cpu,posix/mem,filesystem/posix,network/cni
W0503 22:54:55.909592   438 backend.cpp:76] Failed to create 'aufs' backend: AufsBackend requires
root privileges
W0503 22:54:55.909744   438 backend.cpp:76] Failed to create 'bind' backend: BindBackend requires
root privileges
I0503 22:54:55.909793   438 provisioner.cpp:249] Using default backend 'copy'
I0503 22:54:55.913651 18374 slave.cpp:225] Mesos agent started on (754)@172.17.0.2:43403
I0503 22:54:55.913697 18374 slave.cpp:226] Flags at startup: --acls="" --appc_simple_discovery_uri_prefix="http://"
--appc_store_dir="/tmp/mesos/store/appc" --authenticate_http_executors="true" --authenticate_http_readonly="true"
--authenticate_http_readwrite="true" --authenticatee="crammd5" --authentication_backoff_factor="1secs"
--authorizer="local" --cgroups_cpu_enable_pids_and_tids_count="false" --cgroups_enable_cfs="false"
--cgroups_hierarchy="/sys/fs/cgroup" --cgroups_limit_swap="false" --cgroups_root="mesos" --container_disk_watch_interval="15secs"
--containerizers="mesos" --credential="/tmp/Endpoint_SlaveEndpointTest_UnauthorizedRequest_2_YFraVA/credential"
--default_role="*" --disk_watch_interval="1mins" --docker="docker" --docker_kill_orphans="true"
--docker_registry="https://registry-1.docker.io" --docker_remove_delay="6hrs" --docker_socket="/var/run/docker.sock"
--docker_stop_timeout="0ns" --docker_store_dir="/tmp/mesos/store/docker" --docker_volume_checkpoint_dir="/var/run/mesos/isolators/docker/volume"
--enforce_container_disk_quota="false" --executor_registration_timeout="1mins" --executor_secret_key="/tmp/Endpoint_SlaveEndpointTest_UnauthorizedRequest_2_YFraVA/executor_secret_key"
--executor_shutdown_grace_period="5secs" --fetcher_cache_dir="/tmp/Endpoint_SlaveEndpointTest_UnauthorizedRequest_2_YFraVA/fetch"
--fetcher_cache_size="2GB" --frameworks_home="" --gc_delay="1weeks" --gc_disk_headroom="0.1"
--hadoop_home="" --help="false" --hostname_lookup="true" --http_command_executor="false" --http_credentials="/tmp/Endpoint_SlaveEndpointTest_UnauthorizedRequest_2_YFraVA/http_credentials"
--http_heartbeat_interval="30secs" --initialize_driver_logging="true" --isolation="posix/cpu,posix/mem"
--launcher="posix" --launcher_dir="/mesos/mesos-1.4.0/_build/src" --logbufsecs="0" --logging_level="INFO"
--max_completed_executors_per_framework="150" --oversubscribed_resources_interval="15secs"
--perf_duration="10secs" --perf_interval="1mins" --port="5051" --qos_correction_interval_min="0ns"
--quiet="false" --recover="reconnect" --recovery_timeout="15mins" --registration_backoff_factor="10ms"
--resources="cpus:2;gpus:0;mem:1024;disk:1024;ports:[31000-32000]" --revocable_cpu_low_priority="true"
--runtime_dir="/tmp/Endpoint_SlaveEndpointTest_UnauthorizedRequest_2_YFraVA" --sandbox_directory="/mnt/mesos/sandbox"
--strict="true" --switch_user="true" --systemd_enable_support="true" --systemd_runtime_directory="/run/systemd/system"
--version="false" --work_dir="/tmp/Endpoint_SlaveEndpointTest_UnauthorizedRequest_2_tKK2ba"
I0503 22:54:55.914283 18374 credentials.hpp:86] Loading credential for authentication from
'/tmp/Endpoint_SlaveEndpointTest_UnauthorizedRequest_2_YFraVA/credential'
I0503 22:54:55.914561 18374 slave.cpp:258] Agent using credential for: test-principal
I0503 22:54:55.914583 18374 credentials.hpp:37] Loading credentials for authentication from
'/tmp/Endpoint_SlaveEndpointTest_UnauthorizedRequest_2_YFraVA/http_credentials'
I0503 22:54:55.914886 18374 http.cpp:975] Creating default 'basic' HTTP authenticator for
realm 'mesos-agent-executor'
I0503 22:54:55.915026 18374 http.cpp:996] Creating default 'jwt' HTTP authenticator for realm
'mesos-agent-executor'
I0503 22:54:55.915236 18374 http.cpp:975] Creating default 'basic' HTTP authenticator for
realm 'mesos-agent-readonly'
I0503 22:54:55.915345 18374 http.cpp:996] Creating default 'jwt' HTTP authenticator for realm
'mesos-agent-readonly'
I0503 22:54:55.915560 18374 http.cpp:975] Creating default 'basic' HTTP authenticator for
realm 'mesos-agent-readwrite'
I0503 22:54:55.915644 18374 http.cpp:996] Creating default 'jwt' HTTP authenticator for realm
'mesos-agent-readwrite'
I0503 22:54:55.917032 18374 slave.cpp:525] Agent resources: cpus(*):2; mem(*):1024; disk(*):1024;
ports(*):[31000-32000]
I0503 22:54:55.917106 18374 slave.cpp:533] Agent attributes: [  ]
I0503 22:54:55.917119 18374 slave.cpp:538] Agent hostname: c4815b15a0b0
I0503 22:54:55.917254 18371 status_update_manager.cpp:177] Pausing sending status updates
I0503 22:54:55.919447 18370 state.cpp:62] Recovering state from '/tmp/Endpoint_SlaveEndpointTest_UnauthorizedRequest_2_tKK2ba/meta'
I0503 22:54:55.919826 18370 status_update_manager.cpp:203] Recovering status update manager
I0503 22:54:55.920008 18372 containerizer.cpp:608] Recovering containerizer
I0503 22:54:55.921401 18372 provisioner.cpp:410] Provisioner recovery complete
I0503 22:54:55.921902 18365 slave.cpp:5963] Finished recovery
I0503 22:54:55.922508 18365 slave.cpp:6145] Querying resource estimator for oversubscribable
resources
I0503 22:54:55.922835 18364 slave.cpp:6159] Received oversubscribable resources {} from the
resource estimator
I0503 22:54:55.925222 18366 process.cpp:3730] Handling HTTP event for process 'slave(754)'
with path: '/slave(754)/containers'
I0503 22:54:55.926918 18370 http.cpp:1115] HTTP GET for /slave(754)/containers from 172.17.0.2:37780
I0503 22:54:55.926997 18370 http.cpp:936] Authorizing principal 'test-principal' to GET the
'/containers' endpoint
I0503 22:54:55.934203   438 slave.cpp:790] Agent terminating
[       OK ] Endpoint/SlaveEndpointTest.UnauthorizedRequest/2 (34 ms)
[ RUN      ] Endpoint/SlaveEndpointTest.NoAuthorizer/0
I0503 22:54:55.944074   438 containerizer.cpp:221] Using isolation: posix/cpu,posix/mem,filesystem/posix,network/cni
W0503 22:54:55.944672   438 backend.cpp:76] Failed to create 'aufs' backend: AufsBackend requires
root privileges
W0503 22:54:55.944798   438 backend.cpp:76] Failed to create 'bind' backend: BindBackend requires
root privileges
I0503 22:54:55.944844   438 provisioner.cpp:249] Using default backend 'copy'
I0503 22:54:55.946379   438 cluster.cpp:448] Creating default 'local' authorizer
I0503 22:54:55.947934 18359 slave.cpp:225] Mesos agent started on (755)@172.17.0.2:43403
I0503 22:54:55.948303 18359 slave.cpp:226] Flags at startup: --acls="" --appc_simple_discovery_uri_prefix="http://"
--appc_store_dir="/tmp/mesos/store/appc" --authenticate_http_executors="true" --authenticate_http_readonly="true"
--authenticate_http_readwrite="true" --authenticatee="crammd5" --authentication_backoff_factor="1secs"
--authorizer="local" --cgroups_cpu_enable_pids_and_tids_count="false" --cgroups_enable_cfs="false"
--cgroups_hierarchy="/sys/fs/cgroup" --cgroups_limit_swap="false" --cgroups_root="mesos" --container_disk_watch_interval="15secs"
--containerizers="mesos" --credential="/tmp/Endpoint_SlaveEndpointTest_NoAuthorizer_0_kWjE8j/credential"
--default_role="*" --disk_watch_interval="1mins" --docker="docker" --docker_kill_orphans="true"
--docker_registry="https://registry-1.docker.io" --docker_remove_delay="6hrs" --docker_socket="/var/run/docker.sock"
--docker_stop_timeout="0ns" --docker_store_dir="/tmp/mesos/store/docker" --docker_volume_checkpoint_dir="/var/run/mesos/isolators/docker/volume"
--enforce_container_disk_quota="false" --executor_registration_timeout="1mins" --executor_secret_key="/tmp/Endpoint_SlaveEndpointTest_NoAuthorizer_0_kWjE8j/executor_secret_key"
--executor_shutdown_grace_period="5secs" --fetcher_cache_dir="/tmp/Endpoint_SlaveEndpointTest_NoAuthorizer_0_kWjE8j/fetch"
--fetcher_cache_size="2GB" --frameworks_home="" --gc_delay="1weeks" --gc_disk_headroom="0.1"
--hadoop_home="" --help="false" --hostname_lookup="true" --http_command_executor="false" --http_credentials="/tmp/Endpoint_SlaveEndpointTest_NoAuthorizer_0_kWjE8j/http_credentials"
--http_heartbeat_interval="30secs" --initialize_driver_logging="true" --isolation="posix/cpu,posix/mem"
--launcher="posix" --launcher_dir="/mesos/mesos-1.4.0/_build/src" --logbufsecs="0" --logging_level="INFO"
--max_completed_executors_per_framework="150" --oversubscribed_resources_interval="15secs"
--perf_duration="10secs" --perf_interval="1mins" --port="5051" --qos_correction_interval_min="0ns"
--quiet="false" --recover="reconnect" --recovery_timeout="15mins" --registration_backoff_factor="10ms"
--resources="cpus:2;gpus:0;mem:1024;disk:1024;ports:[31000-32000]" --revocable_cpu_low_priority="true"
--runtime_dir="/tmp/Endpoint_SlaveEndpointTest_NoAuthorizer_0_kWjE8j" --sandbox_directory="/mnt/mesos/sandbox"
--strict="true" --switch_user="true" --systemd_enable_support="true" --systemd_runtime_directory="/run/systemd/system"
--version="false" --work_dir="/tmp/Endpoint_SlaveEndpointTest_NoAuthorizer_0_hOeUjT"
I0503 22:54:55.949008 18359 credentials.hpp:86] Loading credential for authentication from
'/tmp/Endpoint_SlaveEndpointTest_NoAuthorizer_0_kWjE8j/credential'
I0503 22:54:55.949350 18359 slave.cpp:258] Agent using credential for: test-principal
I0503 22:54:55.949374 18359 credentials.hpp:37] Loading credentials for authentication from
'/tmp/Endpoint_SlaveEndpointTest_NoAuthorizer_0_kWjE8j/http_credentials'
I0503 22:54:55.949914 18359 http.cpp:975] Creating default 'basic' HTTP authenticator for
realm 'mesos-agent-executor'
I0503 22:54:55.950100 18359 http.cpp:996] Creating default 'jwt' HTTP authenticator for realm
'mesos-agent-executor'
I0503 22:54:55.950459 18359 http.cpp:975] Creating default 'basic' HTTP authenticator for
realm 'mesos-agent-readonly'
I0503 22:54:55.950556 18359 http.cpp:996] Creating default 'jwt' HTTP authenticator for realm
'mesos-agent-readonly'
I0503 22:54:55.950749 18359 http.cpp:975] Creating default 'basic' HTTP authenticator for
realm 'mesos-agent-readwrite'
I0503 22:54:55.950837 18359 http.cpp:996] Creating default 'jwt' HTTP authenticator for realm
'mesos-agent-readwrite'
I0503 22:54:55.952080 18359 slave.cpp:525] Agent resources: cpus(*):2; mem(*):1024; disk(*):1024;
ports(*):[31000-32000]
I0503 22:54:55.952158 18359 slave.cpp:533] Agent attributes: [  ]
I0503 22:54:55.952172 18359 slave.cpp:538] Agent hostname: c4815b15a0b0
I0503 22:54:55.952314 18373 status_update_manager.cpp:177] Pausing sending status updates
I0503 22:54:55.953596 18370 state.cpp:62] Recovering state from '/tmp/Endpoint_SlaveEndpointTest_NoAuthorizer_0_hOeUjT/meta'
I0503 22:54:55.953912 18368 status_update_manager.cpp:203] Recovering status update manager
I0503 22:54:55.954128 18365 containerizer.cpp:608] Recovering containerizer
I0503 22:54:55.955549 18369 provisioner.cpp:410] Provisioner recovery complete
I0503 22:54:55.955895 18369 slave.cpp:5963] Finished recovery
I0503 22:54:55.956426 18369 slave.cpp:6145] Querying resource estimator for oversubscribable
resources
I0503 22:54:55.956713 18374 slave.cpp:6159] Received oversubscribable resources {} from the
resource estimator
I0503 22:54:55.959189 18367 process.cpp:3730] Handling HTTP event for process 'slave(755)'
with path: '/slave(755)/monitor/statistics'
I0503 22:54:55.960988 18368 http.cpp:1115] HTTP GET for /slave(755)/monitor/statistics from
172.17.0.2:37781
I0503 22:54:55.961078 18368 http.cpp:936] Authorizing principal 'test-principal' to GET the
'/monitor/statistics' endpoint
I0503 22:54:55.965184 18363 slave.cpp:790] Agent terminating
[       OK ] Endpoint/SlaveEndpointTest.NoAuthorizer/0 (38 ms)
[ RUN      ] Endpoint/SlaveEndpointTest.NoAuthorizer/1
I0503 22:54:55.984874   438 containerizer.cpp:221] Using isolation: posix/cpu,posix/mem,filesystem/posix,network/cni
W0503 22:54:55.985654   438 backend.cpp:76] Failed to create 'aufs' backend: AufsBackend requires
root privileges
W0503 22:54:55.985783   438 backend.cpp:76] Failed to create 'bind' backend: BindBackend requires
root privileges
I0503 22:54:55.985831   438 provisioner.cpp:249] Using default backend 'copy'
I0503 22:54:55.987746   438 cluster.cpp:448] Creating default 'local' authorizer
I0503 22:54:55.990118 18359 slave.cpp:225] Mesos agent started on (756)@172.17.0.2:43403
I0503 22:54:55.990156 18359 slave.cpp:226] Flags at startup: --acls="" --appc_simple_discovery_uri_prefix="http://"
--appc_store_dir="/tmp/mesos/store/appc" --authenticate_http_executors="true" --authenticate_http_readonly="true"
--authenticate_http_readwrite="true" --authenticatee="crammd5" --authentication_backoff_factor="1secs"
--authorizer="local" --cgroups_cpu_enable_pids_and_tids_count="false" --cgroups_enable_cfs="false"
--cgroups_hierarchy="/sys/fs/cgroup" --cgroups_limit_swap="false" --cgroups_root="mesos" --container_disk_watch_interval="15secs"
--containerizers="mesos" --credential="/tmp/Endpoint_SlaveEndpointTest_NoAuthorizer_1_WrwLK3/credential"
--default_role="*" --disk_watch_interval="1mins" --docker="docker" --docker_kill_orphans="true"
--docker_registry="https://registry-1.docker.io" --docker_remove_delay="6hrs" --docker_socket="/var/run/docker.sock"
--docker_stop_timeout="0ns" --docker_store_dir="/tmp/mesos/store/docker" --docker_volume_checkpoint_dir="/var/run/mesos/isolators/docker/volume"
--enforce_container_disk_quota="false" --executor_registration_timeout="1mins" --executor_secret_key="/tmp/Endpoint_SlaveEndpointTest_NoAuthorizer_1_WrwLK3/executor_secret_key"
--executor_shutdown_grace_period="5secs" --fetcher_cache_dir="/tmp/Endpoint_SlaveEndpointTest_NoAuthorizer_1_WrwLK3/fetch"
--fetcher_cache_size="2GB" --frameworks_home="" --gc_delay="1weeks" --gc_disk_headroom="0.1"
--hadoop_home="" --help="false" --hostname_lookup="true" --http_command_executor="false" --http_credentials="/tmp/Endpoint_SlaveEndpointTest_NoAuthorizer_1_WrwLK3/http_credentials"
--http_heartbeat_interval="30secs" --initialize_driver_logging="true" --isolation="posix/cpu,posix/mem"
--launcher="posix" --launcher_dir="/mesos/mesos-1.4.0/_build/src" --logbufsecs="0" --logging_level="INFO"
--max_completed_executors_per_framework="150" --oversubscribed_resources_interval="15secs"
--perf_duration="10secs" --perf_interval="1mins" --port="5051" --qos_correction_interval_min="0ns"
--quiet="false" --recover="reconnect" --recovery_timeout="15mins" --registration_backoff_factor="10ms"
--resources="cpus:2;gpus:0;mem:1024;disk:1024;ports:[31000-32000]" --revocable_cpu_low_priority="true"
--runtime_dir="/tmp/Endpoint_SlaveEndpointTest_NoAuthorizer_1_WrwLK3" --sandbox_directory="/mnt/mesos/sandbox"
--strict="true" --switch_user="true" --systemd_enable_support="true" --systemd_runtime_directory="/run/systemd/system"
--version="false" --work_dir="/tmp/Endpoint_SlaveEndpointTest_NoAuthorizer_1_q2QBPC"
I0503 22:54:55.990623 18359 credentials.hpp:86] Loading credential for authentication from
'/tmp/Endpoint_SlaveEndpointTest_NoAuthorizer_1_WrwLK3/credential'
I0503 22:54:55.990820 18359 slave.cpp:258] Agent using credential for: test-principal
I0503 22:54:55.990841 18359 credentials.hpp:37] Loading credentials for authentication from
'/tmp/Endpoint_SlaveEndpointTest_NoAuthorizer_1_WrwLK3/http_credentials'
I0503 22:54:55.991166 18359 http.cpp:975] Creating default 'basic' HTTP authenticator for
realm 'mesos-agent-executor'
I0503 22:54:55.991304 18359 http.cpp:996] Creating default 'jwt' HTTP authenticator for realm
'mesos-agent-executor'
I0503 22:54:55.991508 18359 http.cpp:975] Creating default 'basic' HTTP authenticator for
realm 'mesos-agent-readonly'
I0503 22:54:55.991585 18359 http.cpp:996] Creating default 'jwt' HTTP authenticator for realm
'mesos-agent-readonly'
I0503 22:54:55.991760 18359 http.cpp:975] Creating default 'basic' HTTP authenticator for
realm 'mesos-agent-readwrite'
I0503 22:54:55.991845 18359 http.cpp:996] Creating default 'jwt' HTTP authenticator for realm
'mesos-agent-readwrite'
I0503 22:54:55.993082 18359 slave.cpp:525] Agent resources: cpus(*):2; mem(*):1024; disk(*):1024;
ports(*):[31000-32000]
I0503 22:54:55.993157 18359 slave.cpp:533] Agent attributes: [  ]
I0503 22:54:55.993171 18359 slave.cpp:538] Agent hostname: c4815b15a0b0
I0503 22:54:55.993358 18366 status_update_manager.cpp:177] Pausing sending status updates
I0503 22:54:55.994853 18369 state.cpp:62] Recovering state from '/tmp/Endpoint_SlaveEndpointTest_NoAuthorizer_1_q2QBPC/meta'
I0503 22:54:55.995440 18359 status_update_manager.cpp:203] Recovering status update manager
I0503 22:54:55.995796 18367 containerizer.cpp:608] Recovering containerizer
I0503 22:54:55.997360 18369 provisioner.cpp:410] Provisioner recovery complete
I0503 22:54:55.997726 18372 slave.cpp:5963] Finished recovery
I0503 22:54:55.998265 18372 slave.cpp:6145] Querying resource estimator for oversubscribable
resources
I0503 22:54:55.998842 18362 slave.cpp:6159] Received oversubscribable resources {} from the
resource estimator
I0503 22:54:56.001301 18362 process.cpp:3730] Handling HTTP event for process 'slave(756)'
with path: '/slave(756)/monitor/statistics.json'
I0503 22:54:56.003443 18368 http.cpp:1115] HTTP GET for /slave(756)/monitor/statistics.json
from 172.17.0.2:37782
I0503 22:54:56.003636 18368 http.cpp:936] Authorizing principal 'test-principal' to GET the
'/monitor/statistics.json' endpoint
I0503 22:54:56.007145 18365 slave.cpp:790] Agent terminating
[       OK ] Endpoint/SlaveEndpointTest.NoAuthorizer/1 (35 ms)
[ RUN      ] Endpoint/SlaveEndpointTest.NoAuthorizer/2
I0503 22:54:56.018556   438 containerizer.cpp:221] Using isolation: posix/cpu,posix/mem,filesystem/posix,network/cni
W0503 22:54:56.019250   438 backend.cpp:76] Failed to create 'aufs' backend: AufsBackend requires
root privileges
W0503 22:54:56.019456   438 backend.cpp:76] Failed to create 'bind' backend: BindBackend requires
root privileges
I0503 22:54:56.019700   438 provisioner.cpp:249] Using default backend 'copy'
I0503 22:54:56.021340   438 cluster.cpp:448] Creating default 'local' authorizer
I0503 22:54:56.024271 18370 slave.cpp:225] Mesos agent started on (757)@172.17.0.2:43403
I0503 22:54:56.024299 18370 slave.cpp:226] Flags at startup: --acls="" --appc_simple_discovery_uri_prefix="http://"
--appc_store_dir="/tmp/mesos/store/appc" --authenticate_http_executors="true" --authenticate_http_readonly="true"
--authenticate_http_readwrite="true" --authenticatee="crammd5" --authentication_backoff_factor="1secs"
--authorizer="local" --cgroups_cpu_enable_pids_and_tids_count="false" --cgroups_enable_cfs="false"
--cgroups_hierarchy="/sys/fs/cgroup" --cgroups_limit_swap="false" --cgroups_root="mesos" --container_disk_watch_interval="15secs"
--containerizers="mesos" --credential="/tmp/Endpoint_SlaveEndpointTest_NoAuthorizer_2_5ubQKN/credential"
--default_role="*" --disk_watch_interval="1mins" --docker="docker" --docker_kill_orphans="true"
--docker_registry="https://registry-1.docker.io" --docker_remove_delay="6hrs" --docker_socket="/var/run/docker.sock"
--docker_stop_timeout="0ns" --docker_store_dir="/tmp/mesos/store/docker" --docker_volume_checkpoint_dir="/var/run/mesos/isolators/docker/volume"
--enforce_container_disk_quota="false" --executor_registration_timeout="1mins" --executor_secret_key="/tmp/Endpoint_SlaveEndpointTest_NoAuthorizer_2_5ubQKN/executor_secret_key"
--executor_shutdown_grace_period="5secs" --fetcher_cache_dir="/tmp/Endpoint_SlaveEndpointTest_NoAuthorizer_2_5ubQKN/fetch"
--fetcher_cache_size="2GB" --frameworks_home="" --gc_delay="1weeks" --gc_disk_headroom="0.1"
--hadoop_home="" --help="false" --hostname_lookup="true" --http_command_executor="false" --http_credentials="/tmp/Endpoint_SlaveEndpointTest_NoAuthorizer_2_5ubQKN/http_credentials"
--http_heartbeat_interval="30secs" --initialize_driver_logging="true" --isolation="posix/cpu,posix/mem"
--launcher="posix" --launcher_dir="/mesos/mesos-1.4.0/_build/src" --logbufsecs="0" --logging_level="INFO"
--max_completed_executors_per_framework="150" --oversubscribed_resources_interval="15secs"
--perf_duration="10secs" --perf_interval="1mins" --port="5051" --qos_correction_interval_min="0ns"
--quiet="false" --recover="reconnect" --recovery_timeout="15mins" --registration_backoff_factor="10ms"
--resources="cpus:2;gpus:0;mem:1024;disk:1024;ports:[31000-32000]" --revocable_cpu_low_priority="true"
--runtime_dir="/tmp/Endpoint_SlaveEndpointTest_NoAuthorizer_2_5ubQKN" --sandbox_directory="/mnt/mesos/sandbox"
--strict="true" --switch_user="true" --systemd_enable_support="true" --systemd_runtime_directory="/run/systemd/system"
--version="false" --work_dir="/tmp/Endpoint_SlaveEndpointTest_NoAuthorizer_2_l5p0Jm"
I0503 22:54:56.024757 18370 credentials.hpp:86] Loading credential for authentication from
'/tmp/Endpoint_SlaveEndpointTest_NoAuthorizer_2_5ubQKN/credential'
I0503 22:54:56.024986 18370 slave.cpp:258] Agent using credential for: test-principal
I0503 22:54:56.025009 18370 credentials.hpp:37] Loading credentials for authentication from
'/tmp/Endpoint_SlaveEndpointTest_NoAuthorizer_2_5ubQKN/http_credentials'
I0503 22:54:56.025341 18370 http.cpp:975] Creating default 'basic' HTTP authenticator for
realm 'mesos-agent-executor'
I0503 22:54:56.025483 18370 http.cpp:996] Creating default 'jwt' HTTP authenticator for realm
'mesos-agent-executor'
I0503 22:54:56.025732 18370 http.cpp:975] Creating default 'basic' HTTP authenticator for
realm 'mesos-agent-readonly'
I0503 22:54:56.025847 18370 http.cpp:996] Creating default 'jwt' HTTP authenticator for realm
'mesos-agent-readonly'
I0503 22:54:56.026048 18370 http.cpp:975] Creating default 'basic' HTTP authenticator for
realm 'mesos-agent-readwrite'
I0503 22:54:56.026159 18370 http.cpp:996] Creating default 'jwt' HTTP authenticator for realm
'mesos-agent-readwrite'
I0503 22:54:56.027395 18370 slave.cpp:525] Agent resources: cpus(*):2; mem(*):1024; disk(*):1024;
ports(*):[31000-32000]
I0503 22:54:56.027472 18370 slave.cpp:533] Agent attributes: [  ]
I0503 22:54:56.027513 18370 slave.cpp:538] Agent hostname: c4815b15a0b0
I0503 22:54:56.027804 18359 status_update_manager.cpp:177] Pausing sending status updates
I0503 22:54:56.029297 18359 state.cpp:62] Recovering state from '/tmp/Endpoint_SlaveEndpointTest_NoAuthorizer_2_l5p0Jm/meta'
I0503 22:54:56.029633 18362 status_update_manager.cpp:203] Recovering status update manager
I0503 22:54:56.029875 18362 containerizer.cpp:608] Recovering containerizer
I0503 22:54:56.031955 18361 provisioner.cpp:410] Provisioner recovery complete
I0503 22:54:56.032454 18374 slave.cpp:5963] Finished recovery
I0503 22:54:56.033017 18374 slave.cpp:6145] Querying resource estimator for oversubscribable
resources
I0503 22:54:56.033448 18360 slave.cpp:6159] Received oversubscribable resources {} from the
resource estimator
I0503 22:54:56.035883 18373 process.cpp:3730] Handling HTTP event for process 'slave(757)'
with path: '/slave(757)/containers'
I0503 22:54:56.037755 18366 http.cpp:1115] HTTP GET for /slave(757)/containers from 172.17.0.2:37783
I0503 22:54:56.037856 18366 http.cpp:936] Authorizing principal 'test-principal' to GET the
'/containers' endpoint
I0503 22:54:56.042407 18361 slave.cpp:790] Agent terminating
[       OK ] Endpoint/SlaveEndpointTest.NoAuthorizer/2 (35 ms)
[----------] 9 tests from Endpoint/SlaveEndpointTest (335 ms total)

[----------] Global test environment tear-down
[==========] 1579 tests from 177 test cases ran. (646276 ms total)
[  PASSED  ] 1578 tests.
[  FAILED  ] 1 test, listed below:
[  FAILED  ] HierarchicalAllocatorTest.NestedRoleQuota

 1 FAILED TEST
  YOU HAVE 19 DISABLED TESTS

E0503 22:54:56.108543 18375 process.cpp:950] Failed to accept socket: future discarded
make[4]: *** [check-local] Error 1
make[4]: Leaving directory `/mesos/mesos-1.4.0/_build/src'
make[3]: *** [check-am] Error 2
make[3]: Leaving directory `/mesos/mesos-1.4.0/_build/src'
make[2]: *** [check] Error 2
make[2]: Leaving directory `/mesos/mesos-1.4.0/_build/src'
make[1]: *** [check-recursive] Error 1
make[1]: Leaving directory `/mesos/mesos-1.4.0/_build'
make: *** [distcheck] Error 1
+ docker rmi mesos-1493848424-26577
Untagged: mesos-1493848424-26577:latest
Deleted: sha256:594d6874b87039714b360f9b11fff26bc5111628971d1f80c94768f72bd50e09
Deleted: sha256:6a6427b2a6ae666c8a5a66abab86d0c4cc3e44b7ba49bb40d89f9c8724aa229b
Deleted: sha256:c9a9072316ea3065a6359f5ffb56a5d2a5ec4db197625533d0b3c235e642dfc7
Deleted: sha256:bd47e82c93a36da7c61b58b0010e890183b7d12b8bece5c5c4b237a523156221
Deleted: sha256:1f021047eb6ff8b1c691b244ed63e420ad469317984b9326b5f730c685eb1f58
Deleted: sha256:f49b3c09372b161ff4b64fc9f9f3653252403ba3b49f6b1feee654f5fddf651a
Deleted: sha256:51c04f5df277ce59d266f30ccc9ae5828bef17b59a9757593cd56752aa300ed2
Deleted: sha256:3c4464c1a636f50f47d00c0a754b889fb2736beea817db9d0d5da41d60fd6b40
Deleted: sha256:f7967eae131d8728600993180f253aa3d0d51607931f060133f1239dc3f105d3
Deleted: sha256:e958273f3ddb71c575a71b7e53e4569fd139e89ba570f6e74193b48bb2ca20e7
Deleted: sha256:fead0dbd27a8a1d61eacb8ae1606eb9e9d1853dd316084d55bc7e7067413123a
Deleted: sha256:0d1ca99a6e7dac85140728d0e29fc256685a44e9ee227708970b3e68a402cf7e
Deleted: sha256:5633ad3acf1e555672654d9478eef85db772d2927c3013b95545ed16e0792f6e
Deleted: sha256:93eb031f6fd6c966c22205a6efb3bb7eb9f3a5d9645a57b8edb2de4e23859ee1
Deleted: sha256:df44bcc9c5a8ef5380dd3cf1ad5ecd11f9b9ad3d16a4f298a797b8e0ea5f621b
Deleted: sha256:aaa636b1822b48a6ec1d5efc3e53f40c85322648d24bff5cf9283bcac1004107
Deleted: sha256:3778dd1006bdd373631cf492f573910d9f2747a1801ae7e9489635d3a5e5e454
Deleted: sha256:2bdda93cc514a62bd6d595517565b5cd80b88ac298bd783713bb511db831f1c6
Deleted: sha256:8c89e915f247bb39c256d0d25b8fddb2a4bc645510a0066c9323a1d2f333e6c4
Deleted: sha256:5d2221c79c5d705df60e17aefa92594240dbcdb01561267f4ab309adb9708b79
Deleted: sha256:1291abafb8de3ce1453b64e9974ba6b9fd8ae8b3f0d4c6753e80e6818f98be65
Deleted: sha256:832e2579dfd0ff3b99c96e9e1dfb5c7b4d970dcb25af1ce927a0aa099196cbdd
Deleted: sha256:e3827c33cb88dadce4ec881ddec5ef679c70c2be8e802a37f769a39494d9813d
Deleted: sha256:8bf2f98d95348d85c776d3e41d454591c2f0c09327a68ed7ff54efb1b2a38e81
Build step 'Execute shell' marked build as failure
Not sending mail to unregistered user neil.conway@gmail.com

Mime
View raw message