mesos-builds mailing list archives

Site index · List index
Message view « Date » · « Thread »
Top « Date » · « Thread »
From Apache Jenkins Server <jenk...@builds.apache.org>
Subject Build failed in Jenkins: Mesos-Buildbot » autotools,gcc,--verbose --enable-libevent --enable-ssl,GLOG_v=1 MESOS_VERBOSE=1,ubuntu:14.04,(docker||Hadoop)&&(!ubuntu-us1)&&(!ubuntu-eu2) #3733
Date Sat, 27 May 2017 00:55:23 GMT
See <https://builds.apache.org/job/Mesos-Buildbot/BUILDTOOL=autotools,COMPILER=gcc,CONFIGURATION=--verbose%20--enable-libevent%20--enable-ssl,ENVIRONMENT=GLOG_v=1%20MESOS_VERBOSE=1,OS=ubuntu%3A14.04,label_exp=(docker%7C%7CHadoop)&&(!ubuntu-us1)&&(!ubuntu-eu2)/3733/display/redirect?page=changes>

Changes:

[bmahler] Don't crash when re-registering executor from an unknown framework.

[bmahler] Don't crash the agent when an unknown executor re-registers.

[bmahler] Removed a use of the 'default' switch case.

[bmahler] Added logging of executor re-registration messages.

[bmahler] Avoided use of [] operator for read only map access.

[bmahler] Minor logging cleanup to put open/close quotes on the same line.

------------------------------------------
[...truncated 28.68 MB...]
I0527 00:55:14.323786 25021 process.cpp:3730] Handling HTTP event for process 'slave(753)'
with path: '/slave(753)/containers'
I0527 00:55:14.325738 25017 http.cpp:1115] HTTP GET for /slave(753)/containers from 172.17.0.2:37180
I0527 00:55:14.325822 25017 http.cpp:936] Authorizing principal 'test-principal' to GET the
'/containers' endpoint
I0527 00:55:14.329257 25016 slave.cpp:801] Agent terminating
[       OK ] Endpoint/SlaveEndpointTest.AuthorizedRequest/2 (33 ms)
[ RUN      ] Endpoint/SlaveEndpointTest.UnauthorizedRequest/0
I0527 00:55:14.342988  6919 containerizer.cpp:230] Using isolation: posix/cpu,posix/mem,filesystem/posix,network/cni,environment_secret
W0527 00:55:14.343585  6919 backend.cpp:76] Failed to create 'aufs' backend: AufsBackend requires
root privileges
W0527 00:55:14.343706  6919 backend.cpp:76] Failed to create 'bind' backend: BindBackend requires
root privileges
I0527 00:55:14.343756  6919 provisioner.cpp:255] Using default backend 'copy'
I0527 00:55:14.347347 25011 slave.cpp:232] Mesos agent started on (754)@172.17.0.2:54672
I0527 00:55:14.347368 25011 slave.cpp:233] Flags at startup: --acls="" --appc_simple_discovery_uri_prefix="http://"
--appc_store_dir="/tmp/mesos/store/appc" --authenticate_http_executors="true" --authenticate_http_readonly="true"
--authenticate_http_readwrite="true" --authenticatee="crammd5" --authentication_backoff_factor="1secs"
--authorizer="local" --cgroups_cpu_enable_pids_and_tids_count="false" --cgroups_enable_cfs="false"
--cgroups_hierarchy="/sys/fs/cgroup" --cgroups_limit_swap="false" --cgroups_root="mesos" --container_disk_watch_interval="15secs"
--containerizers="mesos" --credential="/tmp/Endpoint_SlaveEndpointTest_UnauthorizedRequest_0_ZgYBgW/credential"
--default_role="*" --disk_watch_interval="1mins" --docker="docker" --docker_kill_orphans="true"
--docker_registry="https://registry-1.docker.io" --docker_remove_delay="6hrs" --docker_socket="/var/run/docker.sock"
--docker_stop_timeout="0ns" --docker_store_dir="/tmp/mesos/store/docker" --docker_volume_checkpoint_dir="/var/run/mesos/isolators/docker/volume"
--enforce_container_disk_quota="false" --executor_registration_timeout="1mins" --executor_reregistration_timeout="2secs"
--executor_secret_key="/tmp/Endpoint_SlaveEndpointTest_UnauthorizedRequest_0_ZgYBgW/executor_secret_key"
--executor_shutdown_grace_period="5secs" --fetcher_cache_dir="/tmp/Endpoint_SlaveEndpointTest_UnauthorizedRequest_0_ZgYBgW/fetch"
--fetcher_cache_size="2GB" --frameworks_home="" --gc_delay="1weeks" --gc_disk_headroom="0.1"
--hadoop_home="" --help="false" --hostname_lookup="true" --http_command_executor="false" --http_credentials="/tmp/Endpoint_SlaveEndpointTest_UnauthorizedRequest_0_ZgYBgW/http_credentials"
--http_heartbeat_interval="30secs" --initialize_driver_logging="true" --isolation="posix/cpu,posix/mem"
--launcher="posix" --launcher_dir="/mesos/mesos-1.4.0/_build/src" --logbufsecs="0" --logging_level="INFO"
--max_completed_executors_per_framework="150" --oversubscribed_resources_interval="15secs"
--perf_duration="10secs" --perf_interval="1mins" --port="5051" --qos_correction_interval_min="0ns"
--quiet="false" --recover="reconnect" --recovery_timeout="15mins" --registration_backoff_factor="10ms"
--resources="cpus:2;gpus:0;mem:1024;disk:1024;ports:[31000-32000]" --revocable_cpu_low_priority="true"
--runtime_dir="/tmp/Endpoint_SlaveEndpointTest_UnauthorizedRequest_0_ZgYBgW" --sandbox_directory="/mnt/mesos/sandbox"
--strict="true" --switch_user="true" --systemd_enable_support="true" --systemd_runtime_directory="/run/systemd/system"
--version="false" --work_dir="/tmp/Endpoint_SlaveEndpointTest_UnauthorizedRequest_0_Q80ldW"
I0527 00:55:14.347801 25011 credentials.hpp:86] Loading credential for authentication from
'/tmp/Endpoint_SlaveEndpointTest_UnauthorizedRequest_0_ZgYBgW/credential'
I0527 00:55:14.348004 25011 slave.cpp:265] Agent using credential for: test-principal
I0527 00:55:14.348028 25011 credentials.hpp:37] Loading credentials for authentication from
'/tmp/Endpoint_SlaveEndpointTest_UnauthorizedRequest_0_ZgYBgW/http_credentials'
I0527 00:55:14.348413 25011 http.cpp:975] Creating default 'basic' HTTP authenticator for
realm 'mesos-agent-executor'
I0527 00:55:14.348528 25011 http.cpp:996] Creating default 'jwt' HTTP authenticator for realm
'mesos-agent-executor'
I0527 00:55:14.348812 25011 http.cpp:975] Creating default 'basic' HTTP authenticator for
realm 'mesos-agent-readonly'
I0527 00:55:14.348968 25011 http.cpp:996] Creating default 'jwt' HTTP authenticator for realm
'mesos-agent-readonly'
I0527 00:55:14.349174 25011 http.cpp:975] Creating default 'basic' HTTP authenticator for
realm 'mesos-agent-readwrite'
I0527 00:55:14.349277 25011 http.cpp:996] Creating default 'jwt' HTTP authenticator for realm
'mesos-agent-readwrite'
I0527 00:55:14.350491 25011 slave.cpp:536] Agent resources: cpus(*):2; mem(*):1024; disk(*):1024;
ports(*):[31000-32000]
I0527 00:55:14.350560 25011 slave.cpp:544] Agent attributes: [  ]
I0527 00:55:14.350572 25011 slave.cpp:549] Agent hostname: b2a1e8fe88a8
I0527 00:55:14.350695 25010 status_update_manager.cpp:177] Pausing sending status updates
I0527 00:55:14.351996 25009 state.cpp:62] Recovering state from '/tmp/Endpoint_SlaveEndpointTest_UnauthorizedRequest_0_Q80ldW/meta'
I0527 00:55:14.352311 25014 status_update_manager.cpp:203] Recovering status update manager
I0527 00:55:14.352540 25017 containerizer.cpp:582] Recovering containerizer
I0527 00:55:14.353770 25011 provisioner.cpp:416] Provisioner recovery complete
I0527 00:55:14.354143 25018 slave.cpp:6083] Finished recovery
I0527 00:55:14.354709 25018 slave.cpp:6265] Querying resource estimator for oversubscribable
resources
I0527 00:55:14.354950 25019 slave.cpp:6279] Received oversubscribable resources {} from the
resource estimator
I0527 00:55:14.356974 25015 process.cpp:3730] Handling HTTP event for process 'slave(754)'
with path: '/slave(754)/monitor/statistics'
I0527 00:55:14.358736 25009 http.cpp:1115] HTTP GET for /slave(754)/monitor/statistics from
172.17.0.2:37182
I0527 00:55:14.358830 25009 http.cpp:936] Authorizing principal 'test-principal' to GET the
'/monitor/statistics' endpoint
I0527 00:55:14.360612 25008 slave.cpp:801] Agent terminating
[       OK ] Endpoint/SlaveEndpointTest.UnauthorizedRequest/0 (29 ms)
[ RUN      ] Endpoint/SlaveEndpointTest.UnauthorizedRequest/1
I0527 00:55:14.371968  6919 containerizer.cpp:230] Using isolation: posix/cpu,posix/mem,filesystem/posix,network/cni,environment_secret
W0527 00:55:14.372411  6919 backend.cpp:76] Failed to create 'aufs' backend: AufsBackend requires
root privileges
W0527 00:55:14.372505  6919 backend.cpp:76] Failed to create 'bind' backend: BindBackend requires
root privileges
I0527 00:55:14.372539  6919 provisioner.cpp:255] Using default backend 'copy'
I0527 00:55:14.375372 25018 slave.cpp:232] Mesos agent started on (755)@172.17.0.2:54672
I0527 00:55:14.375396 25018 slave.cpp:233] Flags at startup: --acls="" --appc_simple_discovery_uri_prefix="http://"
--appc_store_dir="/tmp/mesos/store/appc" --authenticate_http_executors="true" --authenticate_http_readonly="true"
--authenticate_http_readwrite="true" --authenticatee="crammd5" --authentication_backoff_factor="1secs"
--authorizer="local" --cgroups_cpu_enable_pids_and_tids_count="false" --cgroups_enable_cfs="false"
--cgroups_hierarchy="/sys/fs/cgroup" --cgroups_limit_swap="false" --cgroups_root="mesos" --container_disk_watch_interval="15secs"
--containerizers="mesos" --credential="/tmp/Endpoint_SlaveEndpointTest_UnauthorizedRequest_1_58X4JW/credential"
--default_role="*" --disk_watch_interval="1mins" --docker="docker" --docker_kill_orphans="true"
--docker_registry="https://registry-1.docker.io" --docker_remove_delay="6hrs" --docker_socket="/var/run/docker.sock"
--docker_stop_timeout="0ns" --docker_store_dir="/tmp/mesos/store/docker" --docker_volume_checkpoint_dir="/var/run/mesos/isolators/docker/volume"
--enforce_container_disk_quota="false" --executor_registration_timeout="1mins" --executor_reregistration_timeout="2secs"
--executor_secret_key="/tmp/Endpoint_SlaveEndpointTest_UnauthorizedRequest_1_58X4JW/executor_secret_key"
--executor_shutdown_grace_period="5secs" --fetcher_cache_dir="/tmp/Endpoint_SlaveEndpointTest_UnauthorizedRequest_1_58X4JW/fetch"
--fetcher_cache_size="2GB" --frameworks_home="" --gc_delay="1weeks" --gc_disk_headroom="0.1"
--hadoop_home="" --help="false" --hostname_lookup="true" --http_command_executor="false" --http_credentials="/tmp/Endpoint_SlaveEndpointTest_UnauthorizedRequest_1_58X4JW/http_credentials"
--http_heartbeat_interval="30secs" --initialize_driver_logging="true" --isolation="posix/cpu,posix/mem"
--launcher="posix" --launcher_dir="/mesos/mesos-1.4.0/_build/src" --logbufsecs="0" --logging_level="INFO"
--max_completed_executors_per_framework="150" --oversubscribed_resources_interval="15secs"
--perf_duration="10secs" --perf_interval="1mins" --port="5051" --qos_correction_interval_min="0ns"
--quiet="false" --recover="reconnect" --recovery_timeout="15mins" --registration_backoff_factor="10ms"
--resources="cpus:2;gpus:0;mem:1024;disk:1024;ports:[31000-32000]" --revocable_cpu_low_priority="true"
--runtime_dir="/tmp/Endpoint_SlaveEndpointTest_UnauthorizedRequest_1_58X4JW" --sandbox_directory="/mnt/mesos/sandbox"
--strict="true" --switch_user="true" --systemd_enable_support="true" --systemd_runtime_directory="/run/systemd/system"
--version="false" --work_dir="/tmp/Endpoint_SlaveEndpointTest_UnauthorizedRequest_1_ePh0BW"
I0527 00:55:14.375789 25018 credentials.hpp:86] Loading credential for authentication from
'/tmp/Endpoint_SlaveEndpointTest_UnauthorizedRequest_1_58X4JW/credential'
I0527 00:55:14.376000 25018 slave.cpp:265] Agent using credential for: test-principal
I0527 00:55:14.376029 25018 credentials.hpp:37] Loading credentials for authentication from
'/tmp/Endpoint_SlaveEndpointTest_UnauthorizedRequest_1_58X4JW/http_credentials'
I0527 00:55:14.376405 25018 http.cpp:975] Creating default 'basic' HTTP authenticator for
realm 'mesos-agent-executor'
I0527 00:55:14.376541 25018 http.cpp:996] Creating default 'jwt' HTTP authenticator for realm
'mesos-agent-executor'
I0527 00:55:14.376878 25018 http.cpp:975] Creating default 'basic' HTTP authenticator for
realm 'mesos-agent-readonly'
I0527 00:55:14.377007 25018 http.cpp:996] Creating default 'jwt' HTTP authenticator for realm
'mesos-agent-readonly'
I0527 00:55:14.377185 25018 http.cpp:975] Creating default 'basic' HTTP authenticator for
realm 'mesos-agent-readwrite'
I0527 00:55:14.377272 25018 http.cpp:996] Creating default 'jwt' HTTP authenticator for realm
'mesos-agent-readwrite'
I0527 00:55:14.378532 25018 slave.cpp:536] Agent resources: cpus(*):2; mem(*):1024; disk(*):1024;
ports(*):[31000-32000]
I0527 00:55:14.378600 25018 slave.cpp:544] Agent attributes: [  ]
I0527 00:55:14.378614 25018 slave.cpp:549] Agent hostname: b2a1e8fe88a8
I0527 00:55:14.378772 25019 status_update_manager.cpp:177] Pausing sending status updates
I0527 00:55:14.380162 25013 state.cpp:62] Recovering state from '/tmp/Endpoint_SlaveEndpointTest_UnauthorizedRequest_1_ePh0BW/meta'
I0527 00:55:14.380504 25019 status_update_manager.cpp:203] Recovering status update manager
I0527 00:55:14.380683 25009 containerizer.cpp:582] Recovering containerizer
I0527 00:55:14.381985 25008 provisioner.cpp:416] Provisioner recovery complete
I0527 00:55:14.382390 25015 slave.cpp:6083] Finished recovery
I0527 00:55:14.382828 25015 slave.cpp:6265] Querying resource estimator for oversubscribable
resources
I0527 00:55:14.383069 25012 slave.cpp:6279] Received oversubscribable resources {} from the
resource estimator
I0527 00:55:14.385053 25008 process.cpp:3730] Handling HTTP event for process 'slave(755)'
with path: '/slave(755)/monitor/statistics.json'
I0527 00:55:14.387105 25019 http.cpp:1115] HTTP GET for /slave(755)/monitor/statistics.json
from 172.17.0.2:37184
I0527 00:55:14.387207 25019 http.cpp:936] Authorizing principal 'test-principal' to GET the
'/monitor/statistics.json' endpoint
I0527 00:55:14.389472 25017 slave.cpp:801] Agent terminating
[       OK ] Endpoint/SlaveEndpointTest.UnauthorizedRequest/1 (30 ms)
[ RUN      ] Endpoint/SlaveEndpointTest.UnauthorizedRequest/2
I0527 00:55:14.402652  6919 containerizer.cpp:230] Using isolation: posix/cpu,posix/mem,filesystem/posix,network/cni,environment_secret
W0527 00:55:14.403287  6919 backend.cpp:76] Failed to create 'aufs' backend: AufsBackend requires
root privileges
W0527 00:55:14.403421  6919 backend.cpp:76] Failed to create 'bind' backend: BindBackend requires
root privileges
I0527 00:55:14.403501  6919 provisioner.cpp:255] Using default backend 'copy'
I0527 00:55:14.407184 25011 slave.cpp:232] Mesos agent started on (756)@172.17.0.2:54672
I0527 00:55:14.407205 25011 slave.cpp:233] Flags at startup: --acls="" --appc_simple_discovery_uri_prefix="http://"
--appc_store_dir="/tmp/mesos/store/appc" --authenticate_http_executors="true" --authenticate_http_readonly="true"
--authenticate_http_readwrite="true" --authenticatee="crammd5" --authentication_backoff_factor="1secs"
--authorizer="local" --cgroups_cpu_enable_pids_and_tids_count="false" --cgroups_enable_cfs="false"
--cgroups_hierarchy="/sys/fs/cgroup" --cgroups_limit_swap="false" --cgroups_root="mesos" --container_disk_watch_interval="15secs"
--containerizers="mesos" --credential="/tmp/Endpoint_SlaveEndpointTest_UnauthorizedRequest_2_fP0IwX/credential"
--default_role="*" --disk_watch_interval="1mins" --docker="docker" --docker_kill_orphans="true"
--docker_registry="https://registry-1.docker.io" --docker_remove_delay="6hrs" --docker_socket="/var/run/docker.sock"
--docker_stop_timeout="0ns" --docker_store_dir="/tmp/mesos/store/docker" --docker_volume_checkpoint_dir="/var/run/mesos/isolators/docker/volume"
--enforce_container_disk_quota="false" --executor_registration_timeout="1mins" --executor_reregistration_timeout="2secs"
--executor_secret_key="/tmp/Endpoint_SlaveEndpointTest_UnauthorizedRequest_2_fP0IwX/executor_secret_key"
--executor_shutdown_grace_period="5secs" --fetcher_cache_dir="/tmp/Endpoint_SlaveEndpointTest_UnauthorizedRequest_2_fP0IwX/fetch"
--fetcher_cache_size="2GB" --frameworks_home="" --gc_delay="1weeks" --gc_disk_headroom="0.1"
--hadoop_home="" --help="false" --hostname_lookup="true" --http_command_executor="false" --http_credentials="/tmp/Endpoint_SlaveEndpointTest_UnauthorizedRequest_2_fP0IwX/http_credentials"
--http_heartbeat_interval="30secs" --initialize_driver_logging="true" --isolation="posix/cpu,posix/mem"
--launcher="posix" --launcher_dir="/mesos/mesos-1.4.0/_build/src" --logbufsecs="0" --logging_level="INFO"
--max_completed_executors_per_framework="150" --oversubscribed_resources_interval="15secs"
--perf_duration="10secs" --perf_interval="1mins" --port="5051" --qos_correction_interval_min="0ns"
--quiet="false" --recover="reconnect" --recovery_timeout="15mins" --registration_backoff_factor="10ms"
--resources="cpus:2;gpus:0;mem:1024;disk:1024;ports:[31000-32000]" --revocable_cpu_low_priority="true"
--runtime_dir="/tmp/Endpoint_SlaveEndpointTest_UnauthorizedRequest_2_fP0IwX" --sandbox_directory="/mnt/mesos/sandbox"
--strict="true" --switch_user="true" --systemd_enable_support="true" --systemd_runtime_directory="/run/systemd/system"
--version="false" --work_dir="/tmp/Endpoint_SlaveEndpointTest_UnauthorizedRequest_2_4ojMjX"
I0527 00:55:14.407603 25011 credentials.hpp:86] Loading credential for authentication from
'/tmp/Endpoint_SlaveEndpointTest_UnauthorizedRequest_2_fP0IwX/credential'
I0527 00:55:14.407773 25011 slave.cpp:265] Agent using credential for: test-principal
I0527 00:55:14.407797 25011 credentials.hpp:37] Loading credentials for authentication from
'/tmp/Endpoint_SlaveEndpointTest_UnauthorizedRequest_2_fP0IwX/http_credentials'
I0527 00:55:14.408180 25011 http.cpp:975] Creating default 'basic' HTTP authenticator for
realm 'mesos-agent-executor'
I0527 00:55:14.408334 25011 http.cpp:996] Creating default 'jwt' HTTP authenticator for realm
'mesos-agent-executor'
I0527 00:55:14.408622 25011 http.cpp:975] Creating default 'basic' HTTP authenticator for
realm 'mesos-agent-readonly'
I0527 00:55:14.408769 25011 http.cpp:996] Creating default 'jwt' HTTP authenticator for realm
'mesos-agent-readonly'
I0527 00:55:14.409061 25011 http.cpp:975] Creating default 'basic' HTTP authenticator for
realm 'mesos-agent-readwrite'
I0527 00:55:14.409160 25011 http.cpp:996] Creating default 'jwt' HTTP authenticator for realm
'mesos-agent-readwrite'
I0527 00:55:14.410387 25011 slave.cpp:536] Agent resources: cpus(*):2; mem(*):1024; disk(*):1024;
ports(*):[31000-32000]
I0527 00:55:14.410461 25011 slave.cpp:544] Agent attributes: [  ]
I0527 00:55:14.410481 25011 slave.cpp:549] Agent hostname: b2a1e8fe88a8
I0527 00:55:14.410612 25018 status_update_manager.cpp:177] Pausing sending status updates
I0527 00:55:14.411857 25009 state.cpp:62] Recovering state from '/tmp/Endpoint_SlaveEndpointTest_UnauthorizedRequest_2_4ojMjX/meta'
I0527 00:55:14.412091 25018 status_update_manager.cpp:203] Recovering status update manager
I0527 00:55:14.412322 25007 containerizer.cpp:582] Recovering containerizer
I0527 00:55:14.413674 25009 provisioner.cpp:416] Provisioner recovery complete
I0527 00:55:14.414082 25010 slave.cpp:6083] Finished recovery
I0527 00:55:14.414567 25010 slave.cpp:6265] Querying resource estimator for oversubscribable
resources
I0527 00:55:14.414815 25021 slave.cpp:6279] Received oversubscribable resources {} from the
resource estimator
I0527 00:55:14.416759 25022 process.cpp:3730] Handling HTTP event for process 'slave(756)'
with path: '/slave(756)/containers'
I0527 00:55:14.418565 25020 http.cpp:1115] HTTP GET for /slave(756)/containers from 172.17.0.2:37186
I0527 00:55:14.418668 25020 http.cpp:936] Authorizing principal 'test-principal' to GET the
'/containers' endpoint
I0527 00:55:14.421635 25018 slave.cpp:801] Agent terminating
[       OK ] Endpoint/SlaveEndpointTest.UnauthorizedRequest/2 (31 ms)
[ RUN      ] Endpoint/SlaveEndpointTest.NoAuthorizer/0
I0527 00:55:14.434752  6919 containerizer.cpp:230] Using isolation: posix/cpu,posix/mem,filesystem/posix,network/cni,environment_secret
W0527 00:55:14.435396  6919 backend.cpp:76] Failed to create 'aufs' backend: AufsBackend requires
root privileges
W0527 00:55:14.435523  6919 backend.cpp:76] Failed to create 'bind' backend: BindBackend requires
root privileges
I0527 00:55:14.435571  6919 provisioner.cpp:255] Using default backend 'copy'
I0527 00:55:14.437575  6919 cluster.cpp:448] Creating default 'local' authorizer
I0527 00:55:14.439657 25018 slave.cpp:232] Mesos agent started on (757)@172.17.0.2:54672
I0527 00:55:14.439708 25018 slave.cpp:233] Flags at startup: --acls="" --appc_simple_discovery_uri_prefix="http://"
--appc_store_dir="/tmp/mesos/store/appc" --authenticate_http_executors="true" --authenticate_http_readonly="true"
--authenticate_http_readwrite="true" --authenticatee="crammd5" --authentication_backoff_factor="1secs"
--authorizer="local" --cgroups_cpu_enable_pids_and_tids_count="false" --cgroups_enable_cfs="false"
--cgroups_hierarchy="/sys/fs/cgroup" --cgroups_limit_swap="false" --cgroups_root="mesos" --container_disk_watch_interval="15secs"
--containerizers="mesos" --credential="/tmp/Endpoint_SlaveEndpointTest_NoAuthorizer_0_tjLZDY/credential"
--default_role="*" --disk_watch_interval="1mins" --docker="docker" --docker_kill_orphans="true"
--docker_registry="https://registry-1.docker.io" --docker_remove_delay="6hrs" --docker_socket="/var/run/docker.sock"
--docker_stop_timeout="0ns" --docker_store_dir="/tmp/mesos/store/docker" --docker_volume_checkpoint_dir="/var/run/mesos/isolators/docker/volume"
--enforce_container_disk_quota="false" --executor_registration_timeout="1mins" --executor_reregistration_timeout="2secs"
--executor_secret_key="/tmp/Endpoint_SlaveEndpointTest_NoAuthorizer_0_tjLZDY/executor_secret_key"
--executor_shutdown_grace_period="5secs" --fetcher_cache_dir="/tmp/Endpoint_SlaveEndpointTest_NoAuthorizer_0_tjLZDY/fetch"
--fetcher_cache_size="2GB" --frameworks_home="" --gc_delay="1weeks" --gc_disk_headroom="0.1"
--hadoop_home="" --help="false" --hostname_lookup="true" --http_command_executor="false" --http_credentials="/tmp/Endpoint_SlaveEndpointTest_NoAuthorizer_0_tjLZDY/http_credentials"
--http_heartbeat_interval="30secs" --initialize_driver_logging="true" --isolation="posix/cpu,posix/mem"
--launcher="posix" --launcher_dir="/mesos/mesos-1.4.0/_build/src" --logbufsecs="0" --logging_level="INFO"
--max_completed_executors_per_framework="150" --oversubscribed_resources_interval="15secs"
--perf_duration="10secs" --perf_interval="1mins" --port="5051" --qos_correction_interval_min="0ns"
--quiet="false" --recover="reconnect" --recovery_timeout="15mins" --registration_backoff_factor="10ms"
--resources="cpus:2;gpus:0;mem:1024;disk:1024;ports:[31000-32000]" --revocable_cpu_low_priority="true"
--runtime_dir="/tmp/Endpoint_SlaveEndpointTest_NoAuthorizer_0_tjLZDY" --sandbox_directory="/mnt/mesos/sandbox"
--strict="true" --switch_user="true" --systemd_enable_support="true" --systemd_runtime_directory="/run/systemd/system"
--version="false" --work_dir="/tmp/Endpoint_SlaveEndpointTest_NoAuthorizer_0_c7zTlY"
I0527 00:55:14.440191 25018 credentials.hpp:86] Loading credential for authentication from
'/tmp/Endpoint_SlaveEndpointTest_NoAuthorizer_0_tjLZDY/credential'
I0527 00:55:14.440397 25018 slave.cpp:265] Agent using credential for: test-principal
I0527 00:55:14.440431 25018 credentials.hpp:37] Loading credentials for authentication from
'/tmp/Endpoint_SlaveEndpointTest_NoAuthorizer_0_tjLZDY/http_credentials'
I0527 00:55:14.440814 25018 http.cpp:975] Creating default 'basic' HTTP authenticator for
realm 'mesos-agent-executor'
I0527 00:55:14.440958 25018 http.cpp:996] Creating default 'jwt' HTTP authenticator for realm
'mesos-agent-executor'
I0527 00:55:14.441253 25018 http.cpp:975] Creating default 'basic' HTTP authenticator for
realm 'mesos-agent-readonly'
I0527 00:55:14.441406 25018 http.cpp:996] Creating default 'jwt' HTTP authenticator for realm
'mesos-agent-readonly'
I0527 00:55:14.441736 25018 http.cpp:975] Creating default 'basic' HTTP authenticator for
realm 'mesos-agent-readwrite'
I0527 00:55:14.441882 25018 http.cpp:996] Creating default 'jwt' HTTP authenticator for realm
'mesos-agent-readwrite'
I0527 00:55:14.443213 25018 slave.cpp:536] Agent resources: cpus(*):2; mem(*):1024; disk(*):1024;
ports(*):[31000-32000]
I0527 00:55:14.443289 25018 slave.cpp:544] Agent attributes: [  ]
I0527 00:55:14.443305 25018 slave.cpp:549] Agent hostname: b2a1e8fe88a8
I0527 00:55:14.443440 25020 status_update_manager.cpp:177] Pausing sending status updates
I0527 00:55:14.444613 25014 state.cpp:62] Recovering state from '/tmp/Endpoint_SlaveEndpointTest_NoAuthorizer_0_c7zTlY/meta'
I0527 00:55:14.444842 25022 status_update_manager.cpp:203] Recovering status update manager
I0527 00:55:14.445075 25017 containerizer.cpp:582] Recovering containerizer
I0527 00:55:14.446493 25018 provisioner.cpp:416] Provisioner recovery complete
I0527 00:55:14.446867 25022 slave.cpp:6083] Finished recovery
I0527 00:55:14.447446 25022 slave.cpp:6265] Querying resource estimator for oversubscribable
resources
I0527 00:55:14.447685 25010 slave.cpp:6279] Received oversubscribable resources {} from the
resource estimator
I0527 00:55:14.449570 25019 process.cpp:3730] Handling HTTP event for process 'slave(757)'
with path: '/slave(757)/monitor/statistics'
I0527 00:55:14.451244 25015 http.cpp:1115] HTTP GET for /slave(757)/monitor/statistics from
172.17.0.2:37189
I0527 00:55:14.451375 25015 http.cpp:936] Authorizing principal 'test-principal' to GET the
'/monitor/statistics' endpoint
I0527 00:55:14.454672 25015 slave.cpp:801] Agent terminating
[       OK ] Endpoint/SlaveEndpointTest.NoAuthorizer/0 (31 ms)
[ RUN      ] Endpoint/SlaveEndpointTest.NoAuthorizer/1
I0527 00:55:14.465891  6919 containerizer.cpp:230] Using isolation: posix/cpu,posix/mem,filesystem/posix,network/cni,environment_secret
W0527 00:55:14.466466  6919 backend.cpp:76] Failed to create 'aufs' backend: AufsBackend requires
root privileges
W0527 00:55:14.466567  6919 backend.cpp:76] Failed to create 'bind' backend: BindBackend requires
root privileges
I0527 00:55:14.466599  6919 provisioner.cpp:255] Using default backend 'copy'
I0527 00:55:14.468402  6919 cluster.cpp:448] Creating default 'local' authorizer
I0527 00:55:14.469995 25011 slave.cpp:232] Mesos agent started on (758)@172.17.0.2:54672
I0527 00:55:14.470016 25011 slave.cpp:233] Flags at startup: --acls="" --appc_simple_discovery_uri_prefix="http://"
--appc_store_dir="/tmp/mesos/store/appc" --authenticate_http_executors="true" --authenticate_http_readonly="true"
--authenticate_http_readwrite="true" --authenticatee="crammd5" --authentication_backoff_factor="1secs"
--authorizer="local" --cgroups_cpu_enable_pids_and_tids_count="false" --cgroups_enable_cfs="false"
--cgroups_hierarchy="/sys/fs/cgroup" --cgroups_limit_swap="false" --cgroups_root="mesos" --container_disk_watch_interval="15secs"
--containerizers="mesos" --credential="/tmp/Endpoint_SlaveEndpointTest_NoAuthorizer_1_zT7T5Z/credential"
--default_role="*" --disk_watch_interval="1mins" --docker="docker" --docker_kill_orphans="true"
--docker_registry="https://registry-1.docker.io" --docker_remove_delay="6hrs" --docker_socket="/var/run/docker.sock"
--docker_stop_timeout="0ns" --docker_store_dir="/tmp/mesos/store/docker" --docker_volume_checkpoint_dir="/var/run/mesos/isolators/docker/volume"
--enforce_container_disk_quota="false" --executor_registration_timeout="1mins" --executor_reregistration_timeout="2secs"
--executor_secret_key="/tmp/Endpoint_SlaveEndpointTest_NoAuthorizer_1_zT7T5Z/executor_secret_key"
--executor_shutdown_grace_period="5secs" --fetcher_cache_dir="/tmp/Endpoint_SlaveEndpointTest_NoAuthorizer_1_zT7T5Z/fetch"
--fetcher_cache_size="2GB" --frameworks_home="" --gc_delay="1weeks" --gc_disk_headroom="0.1"
--hadoop_home="" --help="false" --hostname_lookup="true" --http_command_executor="false" --http_credentials="/tmp/Endpoint_SlaveEndpointTest_NoAuthorizer_1_zT7T5Z/http_credentials"
--http_heartbeat_interval="30secs" --initialize_driver_logging="true" --isolation="posix/cpu,posix/mem"
--launcher="posix" --launcher_dir="/mesos/mesos-1.4.0/_build/src" --logbufsecs="0" --logging_level="INFO"
--max_completed_executors_per_framework="150" --oversubscribed_resources_interval="15secs"
--perf_duration="10secs" --perf_interval="1mins" --port="5051" --qos_correction_interval_min="0ns"
--quiet="false" --recover="reconnect" --recovery_timeout="15mins" --registration_backoff_factor="10ms"
--resources="cpus:2;gpus:0;mem:1024;disk:1024;ports:[31000-32000]" --revocable_cpu_low_priority="true"
--runtime_dir="/tmp/Endpoint_SlaveEndpointTest_NoAuthorizer_1_zT7T5Z" --sandbox_directory="/mnt/mesos/sandbox"
--strict="true" --switch_user="true" --systemd_enable_support="true" --systemd_runtime_directory="/run/systemd/system"
--version="false" --work_dir="/tmp/Endpoint_SlaveEndpointTest_NoAuthorizer_1_eFqJIZ"
I0527 00:55:14.470542 25011 credentials.hpp:86] Loading credential for authentication from
'/tmp/Endpoint_SlaveEndpointTest_NoAuthorizer_1_zT7T5Z/credential'
I0527 00:55:14.470765 25011 slave.cpp:265] Agent using credential for: test-principal
I0527 00:55:14.470787 25011 credentials.hpp:37] Loading credentials for authentication from
'/tmp/Endpoint_SlaveEndpointTest_NoAuthorizer_1_zT7T5Z/http_credentials'
I0527 00:55:14.471150 25011 http.cpp:975] Creating default 'basic' HTTP authenticator for
realm 'mesos-agent-executor'
I0527 00:55:14.471278 25011 http.cpp:996] Creating default 'jwt' HTTP authenticator for realm
'mesos-agent-executor'
I0527 00:55:14.471549 25011 http.cpp:975] Creating default 'basic' HTTP authenticator for
realm 'mesos-agent-readonly'
I0527 00:55:14.471684 25011 http.cpp:996] Creating default 'jwt' HTTP authenticator for realm
'mesos-agent-readonly'
I0527 00:55:14.471936 25011 http.cpp:975] Creating default 'basic' HTTP authenticator for
realm 'mesos-agent-readwrite'
I0527 00:55:14.472044 25011 http.cpp:996] Creating default 'jwt' HTTP authenticator for realm
'mesos-agent-readwrite'
I0527 00:55:14.473264 25011 slave.cpp:536] Agent resources: cpus(*):2; mem(*):1024; disk(*):1024;
ports(*):[31000-32000]
I0527 00:55:14.473340 25011 slave.cpp:544] Agent attributes: [  ]
I0527 00:55:14.473358 25011 slave.cpp:549] Agent hostname: b2a1e8fe88a8
I0527 00:55:14.473486 25021 status_update_manager.cpp:177] Pausing sending status updates
I0527 00:55:14.474668 25017 state.cpp:62] Recovering state from '/tmp/Endpoint_SlaveEndpointTest_NoAuthorizer_1_eFqJIZ/meta'
I0527 00:55:14.475080 25022 status_update_manager.cpp:203] Recovering status update manager
I0527 00:55:14.475288 25021 containerizer.cpp:582] Recovering containerizer
I0527 00:55:14.476609 25019 provisioner.cpp:416] Provisioner recovery complete
I0527 00:55:14.476991 25013 slave.cpp:6083] Finished recovery
I0527 00:55:14.477475 25013 slave.cpp:6265] Querying resource estimator for oversubscribable
resources
I0527 00:55:14.477694 25020 slave.cpp:6279] Received oversubscribable resources {} from the
resource estimator
I0527 00:55:14.479771 25018 process.cpp:3730] Handling HTTP event for process 'slave(758)'
with path: '/slave(758)/monitor/statistics.json'
I0527 00:55:14.481417 25020 http.cpp:1115] HTTP GET for /slave(758)/monitor/statistics.json
from 172.17.0.2:37191
I0527 00:55:14.481488 25020 http.cpp:936] Authorizing principal 'test-principal' to GET the
'/monitor/statistics.json' endpoint
I0527 00:55:14.484091 25018 slave.cpp:801] Agent terminating
[       OK ] Endpoint/SlaveEndpointTest.NoAuthorizer/1 (29 ms)
[ RUN      ] Endpoint/SlaveEndpointTest.NoAuthorizer/2
I0527 00:55:14.495313  6919 containerizer.cpp:230] Using isolation: posix/cpu,posix/mem,filesystem/posix,network/cni,environment_secret
W0527 00:55:14.495923  6919 backend.cpp:76] Failed to create 'aufs' backend: AufsBackend requires
root privileges
W0527 00:55:14.496038  6919 backend.cpp:76] Failed to create 'bind' backend: BindBackend requires
root privileges
I0527 00:55:14.496076  6919 provisioner.cpp:255] Using default backend 'copy'
I0527 00:55:14.498507  6919 cluster.cpp:448] Creating default 'local' authorizer
I0527 00:55:14.500541 25019 slave.cpp:232] Mesos agent started on (759)@172.17.0.2:54672
I0527 00:55:14.500571 25019 slave.cpp:233] Flags at startup: --acls="" --appc_simple_discovery_uri_prefix="http://"
--appc_store_dir="/tmp/mesos/store/appc" --authenticate_http_executors="true" --authenticate_http_readonly="true"
--authenticate_http_readwrite="true" --authenticatee="crammd5" --authentication_backoff_factor="1secs"
--authorizer="local" --cgroups_cpu_enable_pids_and_tids_count="false" --cgroups_enable_cfs="false"
--cgroups_hierarchy="/sys/fs/cgroup" --cgroups_limit_swap="false" --cgroups_root="mesos" --container_disk_watch_interval="15secs"
--containerizers="mesos" --credential="/tmp/Endpoint_SlaveEndpointTest_NoAuthorizer_2_JzabR1/credential"
--default_role="*" --disk_watch_interval="1mins" --docker="docker" --docker_kill_orphans="true"
--docker_registry="https://registry-1.docker.io" --docker_remove_delay="6hrs" --docker_socket="/var/run/docker.sock"
--docker_stop_timeout="0ns" --docker_store_dir="/tmp/mesos/store/docker" --docker_volume_checkpoint_dir="/var/run/mesos/isolators/docker/volume"
--enforce_container_disk_quota="false" --executor_registration_timeout="1mins" --executor_reregistration_timeout="2secs"
--executor_secret_key="/tmp/Endpoint_SlaveEndpointTest_NoAuthorizer_2_JzabR1/executor_secret_key"
--executor_shutdown_grace_period="5secs" --fetcher_cache_dir="/tmp/Endpoint_SlaveEndpointTest_NoAuthorizer_2_JzabR1/fetch"
--fetcher_cache_size="2GB" --frameworks_home="" --gc_delay="1weeks" --gc_disk_headroom="0.1"
--hadoop_home="" --help="false" --hostname_lookup="true" --http_command_executor="false" --http_credentials="/tmp/Endpoint_SlaveEndpointTest_NoAuthorizer_2_JzabR1/http_credentials"
--http_heartbeat_interval="30secs" --initialize_driver_logging="true" --isolation="posix/cpu,posix/mem"
--launcher="posix" --launcher_dir="/mesos/mesos-1.4.0/_build/src" --logbufsecs="0" --logging_level="INFO"
--max_completed_executors_per_framework="150" --oversubscribed_resources_interval="15secs"
--perf_duration="10secs" --perf_interval="1mins" --port="5051" --qos_correction_interval_min="0ns"
--quiet="false" --recover="reconnect" --recovery_timeout="15mins" --registration_backoff_factor="10ms"
--resources="cpus:2;gpus:0;mem:1024;disk:1024;ports:[31000-32000]" --revocable_cpu_low_priority="true"
--runtime_dir="/tmp/Endpoint_SlaveEndpointTest_NoAuthorizer_2_JzabR1" --sandbox_directory="/mnt/mesos/sandbox"
--strict="true" --switch_user="true" --systemd_enable_support="true" --systemd_runtime_directory="/run/systemd/system"
--version="false" --work_dir="/tmp/Endpoint_SlaveEndpointTest_NoAuthorizer_2_gMOap1"
I0527 00:55:14.501009 25019 credentials.hpp:86] Loading credential for authentication from
'/tmp/Endpoint_SlaveEndpointTest_NoAuthorizer_2_JzabR1/credential'
I0527 00:55:14.501209 25019 slave.cpp:265] Agent using credential for: test-principal
I0527 00:55:14.501276 25019 credentials.hpp:37] Loading credentials for authentication from
'/tmp/Endpoint_SlaveEndpointTest_NoAuthorizer_2_JzabR1/http_credentials'
I0527 00:55:14.501652 25019 http.cpp:975] Creating default 'basic' HTTP authenticator for
realm 'mesos-agent-executor'
I0527 00:55:14.501787 25019 http.cpp:996] Creating default 'jwt' HTTP authenticator for realm
'mesos-agent-executor'
I0527 00:55:14.502137 25019 http.cpp:975] Creating default 'basic' HTTP authenticator for
realm 'mesos-agent-readonly'
I0527 00:55:14.502301 25019 http.cpp:996] Creating default 'jwt' HTTP authenticator for realm
'mesos-agent-readonly'
I0527 00:55:14.502594 25019 http.cpp:975] Creating default 'basic' HTTP authenticator for
realm 'mesos-agent-readwrite'
I0527 00:55:14.502725 25019 http.cpp:996] Creating default 'jwt' HTTP authenticator for realm
'mesos-agent-readwrite'
I0527 00:55:14.504345 25019 slave.cpp:536] Agent resources: cpus(*):2; mem(*):1024; disk(*):1024;
ports(*):[31000-32000]
I0527 00:55:14.504444 25019 slave.cpp:544] Agent attributes: [  ]
I0527 00:55:14.504470 25019 slave.cpp:549] Agent hostname: b2a1e8fe88a8
I0527 00:55:14.504710 25012 status_update_manager.cpp:177] Pausing sending status updates
I0527 00:55:14.506119 25014 state.cpp:62] Recovering state from '/tmp/Endpoint_SlaveEndpointTest_NoAuthorizer_2_gMOap1/meta'
I0527 00:55:14.506503 25019 status_update_manager.cpp:203] Recovering status update manager
I0527 00:55:14.506850 25017 containerizer.cpp:582] Recovering containerizer
I0527 00:55:14.508733 25013 provisioner.cpp:416] Provisioner recovery complete
I0527 00:55:14.509254 25019 slave.cpp:6083] Finished recovery
I0527 00:55:14.509852 25019 slave.cpp:6265] Querying resource estimator for oversubscribable
resources
I0527 00:55:14.510186 25021 slave.cpp:6279] Received oversubscribable resources {} from the
resource estimator
I0527 00:55:14.512876 25008 process.cpp:3730] Handling HTTP event for process 'slave(759)'
with path: '/slave(759)/containers'
I0527 00:55:14.514914 25021 http.cpp:1115] HTTP GET for /slave(759)/containers from 172.17.0.2:37192
I0527 00:55:14.515008 25021 http.cpp:936] Authorizing principal 'test-principal' to GET the
'/containers' endpoint
I0527 00:55:14.519657 25015 slave.cpp:801] Agent terminating
[       OK ] Endpoint/SlaveEndpointTest.NoAuthorizer/2 (36 ms)
[----------] 9 tests from Endpoint/SlaveEndpointTest (295 ms total)

[----------] Global test environment tear-down
[==========] 1588 tests from 178 test cases ran. (479287 ms total)
[  PASSED  ] 1587 tests.
[  FAILED  ] 1 test, listed below:
[  FAILED  ] ExamplesTest.PythonFramework

 1 FAILED TEST
  YOU HAVE 22 DISABLED TESTS

E0527 00:55:14.583173 25023 process.cpp:950] Failed to accept socket: future discarded
make[4]: *** [check-local] Error 1
make[4]: Leaving directory `/mesos/mesos-1.4.0/_build/src'
make[3]: *** [check-am] Error 2
make[3]: Leaving directory `/mesos/mesos-1.4.0/_build/src'
make[2]: *** [check] Error 2
make[2]: Leaving directory `/mesos/mesos-1.4.0/_build/src'
make[1]: *** [check-recursive] Error 1
make[1]: Leaving directory `/mesos/mesos-1.4.0/_build'
make: *** [distcheck] Error 1
+ docker rmi mesos-1495843194-13319
Untagged: mesos-1495843194-13319:latest
Deleted: sha256:f95680e6eb7544d64ee076811be4c21f205051e330a51d35c31b02131a1a08cd
Deleted: sha256:6a02439101d87ed5724d99d08c06a9cfcd15d824125b9ba117ac8b4e1145f3ff
Deleted: sha256:c2ab2d87c50ac721854b7a541e79e30590917f856953373a84ffff17c3fe51c4
Deleted: sha256:3ec140168b422dc3b8f02310835da8bbbb4e7102fc09a7038ba27094ee073525
Deleted: sha256:fd6f51954fb9b95a627ec2b2516594cb36523fc7c7a519bcaf898a92cd66e69c
Deleted: sha256:3480b27cc60ff5ffa6279eb2d4e6fc8d1da7dea7e1085baedebeecc34250c48c
Deleted: sha256:f2b1534d3bd15c85588fe03c121a65ab9909f77a655c8e411a31a162dfbc2edc
Deleted: sha256:b9e1de885760904bc354534228d11d11567114e9daded0655a45ec2123370d68
Deleted: sha256:b7a9d983390540917c7118cf2b21f3261c09cf70d174ffba111b33ff6761b3b3
Deleted: sha256:0ee7058edeb15d04e787b718975044e4c7a33287de2b314ca42017893ef026cf
Deleted: sha256:4f06f6a36b13c57d5e5ee387dcfdbafcc8e6fe591c633479ee10788bca449416
Deleted: sha256:dc46e514589340b459ef6075897016b38dd36b6dd629c12cb9c0850eb404bd18
Deleted: sha256:dec0d4963bd1d5c9cb55b3bdf1601b3961509b3035ed210acac939f238c32f43
Deleted: sha256:1a23dd48f0fe123a15575f43f5dddaa0415f29444064c4268e4dadafb816f1ff
Deleted: sha256:9686262b52e9e3e7a8397d400682a2c59316af4b93f23a3e85d8543882be0dbf
Deleted: sha256:07c326fd78191eb713ce3dd5f601fc323965917860284e97f320746cdd158234
Deleted: sha256:adb0d0846caf8ca39584b0ecda5e33e8d0ca2ae8907e5ec349fe606464913dc4
Deleted: sha256:6c1a42d1fb9671c6fbf099a38fa03e1af895c6a487ad664f0a8e38d1a32af63d
Deleted: sha256:10da3fdbbf3ad96eacbac4badce4e87255a2a6a670234082f4e0d625db4f1c5a
Deleted: sha256:d1ce006243515efaf8f664c5ab3970fc2a928572f8a93a838cdf73e7b71cdbf1
Deleted: sha256:1330e051bb5f14101924a80fc97d27bd1291a20e715ada3c2e27e54aec0d3857
Deleted: sha256:397e84ae3f1378639ea3556a6e1e5797c23211b2168fcc2cf4357ee6e6f050e7
Deleted: sha256:d118a9347bfbb602500b92766e86b197e046240a3557bc71cb9d139c9d6d0f8c
Deleted: sha256:75a74c47806fbd12efad7d8bf1179d4a6db67dd8fdc8e2f5d872fa93c752f3f4
Build step 'Execute shell' marked build as failure
Not sending mail to unregistered user neil.conway@gmail.com

Mime
View raw message