mesos-builds mailing list archives

Site index · List index
Message view « Date » · « Thread »
Top « Date » · « Thread »
From Apache Jenkins Server <jenk...@builds.apache.org>
Subject Build failed in Jenkins: Mesos-Buildbot » autotools,clang,--verbose --enable-libevent --enable-ssl,GLOG_v=1 MESOS_VERBOSE=1,ubuntu:14.04,(docker||Hadoop)&&(!ubuntu-us1)&&(!ubuntu-eu2) #3701
Date Sun, 21 May 2017 16:03:20 GMT
See <https://builds.apache.org/job/Mesos-Buildbot/BUILDTOOL=autotools,COMPILER=clang,CONFIGURATION=--verbose%20--enable-libevent%20--enable-ssl,ENVIRONMENT=GLOG_v=1%20MESOS_VERBOSE=1,OS=ubuntu%3A14.04,label_exp=(docker%7C%7CHadoop)&&(!ubuntu-us1)&&(!ubuntu-eu2)/3701/display/redirect>

------------------------------------------
[...truncated 2.59 MB...]
I0521 16:03:07.566083 27247 process.cpp:1476] Returning '500 Internal Server Error' for '/(78)/body'
(failure)
I0521 16:03:07.567297 27256 process.cpp:837] Decode failure: Connection reset by peer
E0521 16:03:07.567348 27256 process.cpp:2449] Failed to shutdown socket with fd 9, address
172.17.0.2:58217: Transport endpoint is not connected
[       OK ] Scheme/HTTPTest.Endpoints/1 (26 ms)
[ RUN      ] Scheme/HTTPTest.EndpointsHelp/0
I0521 16:03:07.968888 26466 openssl.cpp:419] CA file path is unspecified! NOTE: Set CA file
path with LIBPROCESS_SSL_CA_FILE=<filepath>
I0521 16:03:07.968910 26466 openssl.cpp:424] CA directory path unspecified! NOTE: Set CA directory
path with LIBPROCESS_SSL_CA_DIR=<dirpath>
I0521 16:03:07.968915 26466 openssl.cpp:429] Will not verify peer certificate!
NOTE: Set LIBPROCESS_SSL_VERIFY_CERT=1 to enable peer certificate verification
I0521 16:03:07.968919 26466 openssl.cpp:435] Will only verify peer certificate if presented!
NOTE: Set LIBPROCESS_SSL_REQUIRE_CERT=1 to require peer certificate verification
E0521 16:03:07.969432 27256 process.cpp:950] Failed to accept socket: future discarded
I0521 16:03:07.971108 26466 process.cpp:1266] libprocess is initialized on 172.17.0.2:51707
with 16 worker threads
I0521 16:03:07.976966 27258 process.cpp:3730] Handling HTTP event for process 'help' with
path: '/help'
I0521 16:03:07.983374 27265 process.cpp:3730] Handling HTTP event for process 'help' with
path: '/help'
I0521 16:03:07.990375 27258 process.cpp:3730] Handling HTTP event for process 'help' with
path: '/help/(79)/body'
I0521 16:03:07.997303 27261 process.cpp:3730] Handling HTTP event for process 'help' with
path: '/help/(79)/a/b/c'
[       OK ] Scheme/HTTPTest.EndpointsHelp/0 (432 ms)
[ RUN      ] Scheme/HTTPTest.EndpointsHelp/1
I0521 16:03:08.005980 26466 process.cpp:1266] libprocess is initialized on 172.17.0.2:37361
with 16 worker threads
I0521 16:03:08.007081 27281 process.cpp:3730] Handling HTTP event for process 'help' with
path: '/help'
I0521 16:03:08.009608 27289 process.cpp:3730] Handling HTTP event for process 'help' with
path: '/help'
I0521 16:03:08.013428 27281 process.cpp:3730] Handling HTTP event for process 'help' with
path: '/help/(80)/body'
I0521 16:03:08.016134 27279 process.cpp:3730] Handling HTTP event for process 'help' with
path: '/help/(80)/a/b/c'
[       OK ] Scheme/HTTPTest.EndpointsHelp/1 (19 ms)
[ RUN      ] Scheme/HTTPTest.EndpointsHelpRemoval/0
I0521 16:03:08.492139 26466 openssl.cpp:419] CA file path is unspecified! NOTE: Set CA file
path with LIBPROCESS_SSL_CA_FILE=<filepath>
I0521 16:03:08.492161 26466 openssl.cpp:424] CA directory path unspecified! NOTE: Set CA directory
path with LIBPROCESS_SSL_CA_DIR=<dirpath>
I0521 16:03:08.492166 26466 openssl.cpp:429] Will not verify peer certificate!
NOTE: Set LIBPROCESS_SSL_VERIFY_CERT=1 to enable peer certificate verification
I0521 16:03:08.492171 26466 openssl.cpp:435] Will only verify peer certificate if presented!
NOTE: Set LIBPROCESS_SSL_REQUIRE_CERT=1 to require peer certificate verification
E0521 16:03:08.492677 27290 process.cpp:950] Failed to accept socket: future discarded
I0521 16:03:08.499109 26466 process.cpp:1266] libprocess is initialized on 172.17.0.2:36464
with 16 worker threads
I0521 16:03:08.505374 27299 process.cpp:3730] Handling HTTP event for process 'help' with
path: '/help/(81)/body'
I0521 16:03:08.511754 27301 process.cpp:3730] Handling HTTP event for process 'help' with
path: '/help/(81)/bogus'
[       OK ] Scheme/HTTPTest.EndpointsHelpRemoval/0 (495 ms)
[ RUN      ] Scheme/HTTPTest.EndpointsHelpRemoval/1
I0521 16:03:08.516018 26466 process.cpp:1266] libprocess is initialized on 172.17.0.2:49105
with 16 worker threads
I0521 16:03:08.518049 27312 process.cpp:3730] Handling HTTP event for process 'help' with
path: '/help/(82)/body'
I0521 16:03:08.521261 27312 process.cpp:3730] Handling HTTP event for process 'help' with
path: '/help/(82)/bogus'
[       OK ] Scheme/HTTPTest.EndpointsHelpRemoval/1 (10 ms)
[ RUN      ] Scheme/HTTPTest.PipeEOF/0
I0521 16:03:08.799883 26466 openssl.cpp:419] CA file path is unspecified! NOTE: Set CA file
path with LIBPROCESS_SSL_CA_FILE=<filepath>
I0521 16:03:08.799901 26466 openssl.cpp:424] CA directory path unspecified! NOTE: Set CA directory
path with LIBPROCESS_SSL_CA_DIR=<dirpath>
I0521 16:03:08.799906 26466 openssl.cpp:429] Will not verify peer certificate!
NOTE: Set LIBPROCESS_SSL_VERIFY_CERT=1 to enable peer certificate verification
I0521 16:03:08.799911 26466 openssl.cpp:435] Will only verify peer certificate if presented!
NOTE: Set LIBPROCESS_SSL_REQUIRE_CERT=1 to require peer certificate verification
E0521 16:03:08.800307 27324 process.cpp:950] Failed to accept socket: future discarded
I0521 16:03:08.802608 26466 process.cpp:1266] libprocess is initialized on 172.17.0.2:60668
with 16 worker threads
[       OK ] Scheme/HTTPTest.PipeEOF/0 (280 ms)
[ RUN      ] Scheme/HTTPTest.PipeEOF/1
I0521 16:03:08.807235 26466 process.cpp:1266] libprocess is initialized on 172.17.0.2:41894
with 16 worker threads
[       OK ] Scheme/HTTPTest.PipeEOF/1 (5 ms)
[ RUN      ] Scheme/HTTPTest.PipeFailure/0
I0521 16:03:09.157130 26466 openssl.cpp:419] CA file path is unspecified! NOTE: Set CA file
path with LIBPROCESS_SSL_CA_FILE=<filepath>
I0521 16:03:09.157153 26466 openssl.cpp:424] CA directory path unspecified! NOTE: Set CA directory
path with LIBPROCESS_SSL_CA_DIR=<dirpath>
I0521 16:03:09.157161 26466 openssl.cpp:429] Will not verify peer certificate!
NOTE: Set LIBPROCESS_SSL_VERIFY_CERT=1 to enable peer certificate verification
I0521 16:03:09.157167 26466 openssl.cpp:435] Will only verify peer certificate if presented!
NOTE: Set LIBPROCESS_SSL_REQUIRE_CERT=1 to require peer certificate verification
E0521 16:03:09.157691 27358 process.cpp:950] Failed to accept socket: future discarded
I0521 16:03:09.159746 26466 process.cpp:1266] libprocess is initialized on 172.17.0.2:33278
with 16 worker threads
[       OK ] Scheme/HTTPTest.PipeFailure/0 (352 ms)
[ RUN      ] Scheme/HTTPTest.PipeFailure/1
I0521 16:03:09.163038 26466 process.cpp:1266] libprocess is initialized on 172.17.0.2:47290
with 16 worker threads
[       OK ] Scheme/HTTPTest.PipeFailure/1 (3 ms)
[ RUN      ] Scheme/HTTPTest.PipeReaderCloses/0
I0521 16:03:09.628757 26466 openssl.cpp:419] CA file path is unspecified! NOTE: Set CA file
path with LIBPROCESS_SSL_CA_FILE=<filepath>
I0521 16:03:09.628779 26466 openssl.cpp:424] CA directory path unspecified! NOTE: Set CA directory
path with LIBPROCESS_SSL_CA_DIR=<dirpath>
I0521 16:03:09.628784 26466 openssl.cpp:429] Will not verify peer certificate!
NOTE: Set LIBPROCESS_SSL_VERIFY_CERT=1 to enable peer certificate verification
I0521 16:03:09.628788 26466 openssl.cpp:435] Will only verify peer certificate if presented!
NOTE: Set LIBPROCESS_SSL_REQUIRE_CERT=1 to require peer certificate verification
E0521 16:03:09.629266 27392 process.cpp:950] Failed to accept socket: future discarded
I0521 16:03:09.631976 26466 process.cpp:1266] libprocess is initialized on 172.17.0.2:36242
with 16 worker threads
[       OK ] Scheme/HTTPTest.PipeReaderCloses/0 (469 ms)
[ RUN      ] Scheme/HTTPTest.PipeReaderCloses/1
I0521 16:03:09.635138 26466 process.cpp:1266] libprocess is initialized on 172.17.0.2:33979
with 16 worker threads
[       OK ] Scheme/HTTPTest.PipeReaderCloses/1 (3 ms)
[ RUN      ] Scheme/HTTPTest.Encode/0
I0521 16:03:09.778746 26466 openssl.cpp:419] CA file path is unspecified! NOTE: Set CA file
path with LIBPROCESS_SSL_CA_FILE=<filepath>
I0521 16:03:09.778761 26466 openssl.cpp:424] CA directory path unspecified! NOTE: Set CA directory
path with LIBPROCESS_SSL_CA_DIR=<dirpath>
I0521 16:03:09.778766 26466 openssl.cpp:429] Will not verify peer certificate!
NOTE: Set LIBPROCESS_SSL_VERIFY_CERT=1 to enable peer certificate verification
I0521 16:03:09.778770 26466 openssl.cpp:435] Will only verify peer certificate if presented!
NOTE: Set LIBPROCESS_SSL_REQUIRE_CERT=1 to require peer certificate verification
E0521 16:03:09.779139 27426 process.cpp:950] Failed to accept socket: future discarded
I0521 16:03:09.780869 26466 process.cpp:1266] libprocess is initialized on 172.17.0.2:60926
with 16 worker threads
[       OK ] Scheme/HTTPTest.Encode/0 (146 ms)
[ RUN      ] Scheme/HTTPTest.Encode/1
I0521 16:03:09.785094 26466 process.cpp:1266] libprocess is initialized on 172.17.0.2:43686
with 16 worker threads
[       OK ] Scheme/HTTPTest.Encode/1 (4 ms)
[ RUN      ] Scheme/HTTPTest.PathParse/0
I0521 16:03:10.233657 26466 openssl.cpp:419] CA file path is unspecified! NOTE: Set CA file
path with LIBPROCESS_SSL_CA_FILE=<filepath>
I0521 16:03:10.233680 26466 openssl.cpp:424] CA directory path unspecified! NOTE: Set CA directory
path with LIBPROCESS_SSL_CA_DIR=<dirpath>
I0521 16:03:10.233685 26466 openssl.cpp:429] Will not verify peer certificate!
NOTE: Set LIBPROCESS_SSL_VERIFY_CERT=1 to enable peer certificate verification
I0521 16:03:10.233688 26466 openssl.cpp:435] Will only verify peer certificate if presented!
NOTE: Set LIBPROCESS_SSL_REQUIRE_CERT=1 to require peer certificate verification
E0521 16:03:10.234079 27460 process.cpp:950] Failed to accept socket: future discarded
I0521 16:03:10.236752 26466 process.cpp:1266] libprocess is initialized on 172.17.0.2:40559
with 16 worker threads
[       OK ] Scheme/HTTPTest.PathParse/0 (452 ms)
[ RUN      ] Scheme/HTTPTest.PathParse/1
I0521 16:03:10.241422 26466 process.cpp:1266] libprocess is initialized on 172.17.0.2:49427
with 16 worker threads
[       OK ] Scheme/HTTPTest.PathParse/1 (4 ms)
[ RUN      ] Scheme/HTTPTest.Get/0
I0521 16:03:10.885773 26466 openssl.cpp:419] CA file path is unspecified! NOTE: Set CA file
path with LIBPROCESS_SSL_CA_FILE=<filepath>
I0521 16:03:10.885797 26466 openssl.cpp:424] CA directory path unspecified! NOTE: Set CA directory
path with LIBPROCESS_SSL_CA_DIR=<dirpath>
I0521 16:03:10.885802 26466 openssl.cpp:429] Will not verify peer certificate!
NOTE: Set LIBPROCESS_SSL_VERIFY_CERT=1 to enable peer certificate verification
I0521 16:03:10.885808 26466 openssl.cpp:435] Will only verify peer certificate if presented!
NOTE: Set LIBPROCESS_SSL_REQUIRE_CERT=1 to require peer certificate verification
E0521 16:03:10.886338 27494 process.cpp:950] Failed to accept socket: future discarded
I0521 16:03:10.894096 26466 process.cpp:1266] libprocess is initialized on 172.17.0.2:49778
with 16 worker threads
I0521 16:03:10.899837 27497 process.cpp:3730] Handling HTTP event for process '(83)' with
path: '/(83)/get'
I0521 16:03:10.908604 27504 process.cpp:3730] Handling HTTP event for process '(83)' with
path: '/(83)/get'
[       OK ] Scheme/HTTPTest.Get/0 (670 ms)
[ RUN      ] Scheme/HTTPTest.Get/1
I0521 16:03:10.914795 26466 process.cpp:1266] libprocess is initialized on 172.17.0.2:52903
with 16 worker threads
I0521 16:03:10.915992 27521 process.cpp:3730] Handling HTTP event for process '(84)' with
path: '/(84)/get'
I0521 16:03:10.918627 27526 process.cpp:3730] Handling HTTP event for process '(84)' with
path: '/(84)/get'
[       OK ] Scheme/HTTPTest.Get/1 (9 ms)
[ RUN      ] Scheme/HTTPTest.NestedGet/0
I0521 16:03:11.282557 26466 openssl.cpp:419] CA file path is unspecified! NOTE: Set CA file
path with LIBPROCESS_SSL_CA_FILE=<filepath>
I0521 16:03:11.282579 26466 openssl.cpp:424] CA directory path unspecified! NOTE: Set CA directory
path with LIBPROCESS_SSL_CA_DIR=<dirpath>
I0521 16:03:11.282583 26466 openssl.cpp:429] Will not verify peer certificate!
NOTE: Set LIBPROCESS_SSL_VERIFY_CERT=1 to enable peer certificate verification
I0521 16:03:11.282588 26466 openssl.cpp:435] Will only verify peer certificate if presented!
NOTE: Set LIBPROCESS_SSL_REQUIRE_CERT=1 to require peer certificate verification
E0521 16:03:11.283051 27528 process.cpp:950] Failed to accept socket: future discarded
I0521 16:03:11.285957 26466 process.cpp:1266] libprocess is initialized on 172.17.0.2:52244
with 16 worker threads
I0521 16:03:11.294030 27529 process.cpp:3730] Handling HTTP event for process '(85)' with
path: '/(85)//a/b/c'
I0521 16:03:11.301764 27539 process.cpp:3730] Handling HTTP event for process '(85)' with
path: '/(85)//a/b'
[       OK ] Scheme/HTTPTest.NestedGet/0 (383 ms)
[ RUN      ] Scheme/HTTPTest.NestedGet/1
I0521 16:03:11.307025 26466 process.cpp:1266] libprocess is initialized on 172.17.0.2:34334
with 16 worker threads
I0521 16:03:11.308393 27561 process.cpp:3730] Handling HTTP event for process '(86)' with
path: '/(86)//a/b/c'
I0521 16:03:11.311421 27557 process.cpp:3730] Handling HTTP event for process '(86)' with
path: '/(86)//a/b'
[       OK ] Scheme/HTTPTest.NestedGet/1 (10 ms)
[ RUN      ] Scheme/HTTPTest.StreamingGetComplete/0
I0521 16:03:11.512424 26466 openssl.cpp:419] CA file path is unspecified! NOTE: Set CA file
path with LIBPROCESS_SSL_CA_FILE=<filepath>
I0521 16:03:11.512445 26466 openssl.cpp:424] CA directory path unspecified! NOTE: Set CA directory
path with LIBPROCESS_SSL_CA_DIR=<dirpath>
I0521 16:03:11.512450 26466 openssl.cpp:429] Will not verify peer certificate!
NOTE: Set LIBPROCESS_SSL_VERIFY_CERT=1 to enable peer certificate verification
I0521 16:03:11.512454 26466 openssl.cpp:435] Will only verify peer certificate if presented!
NOTE: Set LIBPROCESS_SSL_REQUIRE_CERT=1 to require peer certificate verification
E0521 16:03:11.512902 27562 process.cpp:950] Failed to accept socket: future discarded
I0521 16:03:11.515460 26466 process.cpp:1266] libprocess is initialized on 172.17.0.2:46312
with 16 worker threads
I0521 16:03:11.523398 27571 process.cpp:3730] Handling HTTP event for process '(87)' with
path: '/(87)/pipe'
[       OK ] Scheme/HTTPTest.StreamingGetComplete/0 (254 ms)
[ RUN      ] Scheme/HTTPTest.StreamingGetComplete/1
I0521 16:03:11.571425 26466 process.cpp:1266] libprocess is initialized on 172.17.0.2:37286
with 16 worker threads
I0521 16:03:11.572672 27588 process.cpp:3730] Handling HTTP event for process '(88)' with
path: '/(88)/pipe'
[       OK ] Scheme/HTTPTest.StreamingGetComplete/1 (9 ms)
[ RUN      ] Scheme/HTTPTest.StreamingGetFailure/0
I0521 16:03:12.081784 26466 openssl.cpp:419] CA file path is unspecified! NOTE: Set CA file
path with LIBPROCESS_SSL_CA_FILE=<filepath>
I0521 16:03:12.081804 26466 openssl.cpp:424] CA directory path unspecified! NOTE: Set CA directory
path with LIBPROCESS_SSL_CA_DIR=<dirpath>
I0521 16:03:12.081809 26466 openssl.cpp:429] Will not verify peer certificate!
NOTE: Set LIBPROCESS_SSL_VERIFY_CERT=1 to enable peer certificate verification
I0521 16:03:12.081815 26466 openssl.cpp:435] Will only verify peer certificate if presented!
NOTE: Set LIBPROCESS_SSL_REQUIRE_CERT=1 to require peer certificate verification
E0521 16:03:12.082254 27596 process.cpp:950] Failed to accept socket: future discarded
I0521 16:03:12.089792 26466 process.cpp:1266] libprocess is initialized on 172.17.0.2:41520
with 16 worker threads
I0521 16:03:12.095927 27603 process.cpp:3730] Handling HTTP event for process '(89)' with
path: '/(89)/pipe'
I0521 16:03:12.141705 27604 process.cpp:1624] Failed to read from stream: oops
[       OK ] Scheme/HTTPTest.StreamingGetFailure/0 (566 ms)
[ RUN      ] Scheme/HTTPTest.StreamingGetFailure/1
I0521 16:03:12.145829 26466 process.cpp:1266] libprocess is initialized on 172.17.0.2:34820
with 16 worker threads
I0521 16:03:12.146857 27625 process.cpp:3730] Handling HTTP event for process '(90)' with
path: '/(90)/pipe'
I0521 16:03:12.148715 27623 process.cpp:1624] Failed to read from stream: oops
[       OK ] Scheme/HTTPTest.StreamingGetFailure/1 (7 ms)
[ RUN      ] Scheme/HTTPTest.PipeEquality/0
I0521 16:03:12.703084 26466 openssl.cpp:419] CA file path is unspecified! NOTE: Set CA file
path with LIBPROCESS_SSL_CA_FILE=<filepath>
I0521 16:03:12.703110 26466 openssl.cpp:424] CA directory path unspecified! NOTE: Set CA directory
path with LIBPROCESS_SSL_CA_DIR=<dirpath>
I0521 16:03:12.703117 26466 openssl.cpp:429] Will not verify peer certificate!
NOTE: Set LIBPROCESS_SSL_VERIFY_CERT=1 to enable peer certificate verification
I0521 16:03:12.703124 26466 openssl.cpp:435] Will only verify peer certificate if presented!
NOTE: Set LIBPROCESS_SSL_REQUIRE_CERT=1 to require peer certificate verification
E0521 16:03:12.703652 27630 process.cpp:950] Failed to accept socket: future discarded
*** Aborted at 1495382592 (unix time) try "date -d @1495382592" if you are using GNU date
***
PC: @     0x2ad2b4ae764e (unknown)
*** SIGSEGV (@0x5c49ac8) received by PID 26466 (TID 0x2ad2ba97e700) from PID 96770760; stack
trace: ***
    @     0x2ad2b2439330 (unknown)
I0521 16:03:12.706135 26466 process.cpp:1266] libprocess is initialized on 172.17.0.2:41643
with 16 worker threads
    @     0x2ad2b4ae764e (unknown)
    @     0x2ad2b42e7e30 (unknown)
    @     0x2ad2b42e848c (unknown)
[       OK ] Scheme/HTTPTest.PipeEquality/0 (557 ms)
[ RUN      ] Scheme/HTTPTest.PipeEquality/1
    @           0x44b3ff process::UPID::UPID()
    @           0xa1fd5e process::DispatchEvent::DispatchEvent()
    @           0xa09523 process::internal::dispatch()
    @           0xa1f81d process::dispatch<>()
    @           0xa08547 process::ProcessBase::route()
    @           0xb2effd process::ProcessBase::route<>()
    @           0xb2c8d0 process::Help::initialize()
    @           0xb2c982 process::Help::initialize()
    @           0xa02fc0 process::ProcessManager::resume()
    @           0xa1195c process::ProcessManager::init_threads()::$_2::operator()()
    @           0xa11865 _ZNSt12_Bind_simpleIFZN7process14ProcessManager12init_threadsEvE3$_2vEE9_M_invokeIJEEEvSt12_Index_tupleIJXspT_EEE
    @           0xa11835 std::_Bind_simple<>::operator()()
    @           0xa1180c std::thread::_Impl<>::_M_run()
    @     0x2ad2b42dea60 (unknown)
    @     0x2ad2b2431184 start_thread
    @     0x2ad2b4b4abed (unknown)
make[7]: *** [check-local] Segmentation fault
make[7]: Leaving directory `/mesos/mesos-1.4.0/_build/3rdparty/libprocess'
make[6]: *** [check-am] Error 2
make[6]: Leaving directory `/mesos/mesos-1.4.0/_build/3rdparty/libprocess'
make[5]: *** [check-recursive] Error 1
make[5]: Leaving directory `/mesos/mesos-1.4.0/_build/3rdparty/libprocess'
make[4]: *** [check] Error 2
make[4]: Leaving directory `/mesos/mesos-1.4.0/_build/3rdparty/libprocess'
make[3]: *** [check-recursive] Error 1
make[3]: Leaving directory `/mesos/mesos-1.4.0/_build/3rdparty'
make[2]: *** [check] Error 2
make[2]: Leaving directory `/mesos/mesos-1.4.0/_build/3rdparty'
make[1]: *** [check-recursive] Error 1
make[1]: Leaving directory `/mesos/mesos-1.4.0/_build'
make: *** [distcheck] Error 1
+ docker rmi mesos-1495381086-2875
Untagged: mesos-1495381086-2875:latest
Deleted: sha256:5fcb10889c3c02ff4302ed0e288797acab03dab12330ab0ef6f97646677c6a8e
Deleted: sha256:1ce89643616ef2c8699df53e060a9f3b451a28435ee9a1f3c3ce59497c4fcab9
Deleted: sha256:92a6f5d2e077949148c06d86288d896687fff9ee7991966f82f37cac31a92645
Deleted: sha256:668de02a5429613114c2185e69e61fee605a8207da2490f40be67b8832689578
Deleted: sha256:2e6ca50611f1afa029f4eb449efe8caae2973200141afb35f94376a90f76ee18
Deleted: sha256:7a0cf335a73b862fee6105a70c8c0203b60f5da6eb9ab952bcc8653253f406db
Deleted: sha256:dafdf475e99a00fa84961603694690ded4ae68ab19abb4266e857bcbf2f387f9
Deleted: sha256:0aa63ae8e63f054252cfd9d237a15b301ab4ee75a33af6d33c7033a808ecf5ce
Deleted: sha256:209dc914a08b6a9643c7ef8e937bd702b29cc678d97ba28abbf7248ea11143bd
Deleted: sha256:712b828dcfa1fbc5fc9ed85d5eb8f32d8ed3ce805945ed681a8fbbf94349737f
Deleted: sha256:ffed90ecaf1b05b7496dc43e49b0f727f1fcebbbc4a38cc55868a3c7c256ab48
Deleted: sha256:494df1d3c6c29928a46d9bdc37a3046456cc3afd74c4f5d3c578a17a35756f00
Deleted: sha256:7cfd4896bc2012fad2d40199103772ca3e0d09a17ce04a081caada05cc86ce57
Deleted: sha256:714b904ad962a5dae112f519448e99eda13a4ef8f27064c6092abeef4baa4e11
Deleted: sha256:a27dce01fd6062b8ab6da4ddc9bb1c81213b36d99ab79858cd27dc4de0c369d3
Deleted: sha256:eba6cf36362345e6f61a601a95db5124eb6e1947f16f22d76d6dcbd7ee3bfc4e
Deleted: sha256:3017e2e8f6f9d83397b67292641057c96ce00b5c3b43d62f84db6446fc2167e2
Deleted: sha256:e19bdab16be8c2e0070f4ad9785f8e922e32eecc69c74be7922de2e953c97ada
Deleted: sha256:85944db6ff91ed66883cb9270a2107022a2d8196826a63471dea60bb0ff4a359
Deleted: sha256:f517f82c9b1995979ecabab5cac43259169716e08d6d5b5c39a4e5254cdf6775
Deleted: sha256:4705c92df1c3ec188063a10098ca89b682c7a4304d6932a10f8ef81a750bca46
Deleted: sha256:e26efbc3d21ee7f52190e26861be4b123d0b18d7bff77ad01d9d7359328fe75e
Deleted: sha256:f86c170667795da444330ecc2d49112e4bfdcfbd620f1e1c8eedff656b393ac5
Deleted: sha256:153468a0561c7a6022898e25db3baa8b45276b6e4b454fbfaa12a889956d6ac2
Build step 'Execute shell' marked build as failure

Mime
View raw message