mesos-builds mailing list archives

Site index · List index
Message view « Date » · « Thread »
Top « Date » · « Thread »
From Apache Jenkins Server <jenk...@builds.apache.org>
Subject Build failed in Jenkins: Mesos-Buildbot » autotools,gcc,--verbose --enable-libevent --enable-ssl,GLOG_v=1 MESOS_VERBOSE=1,ubuntu:14.04,(docker||Hadoop)&&(!ubuntu-us1)&&(!ubuntu-eu2) #3672
Date Fri, 12 May 2017 16:54:54 GMT
See <https://builds.apache.org/job/Mesos-Buildbot/BUILDTOOL=autotools,COMPILER=gcc,CONFIGURATION=--verbose%20--enable-libevent%20--enable-ssl,ENVIRONMENT=GLOG_v=1%20MESOS_VERBOSE=1,OS=ubuntu%3A14.04,label_exp=(docker%7C%7CHadoop)&&(!ubuntu-us1)&&(!ubuntu-eu2)/3672/display/redirect?page=changes>

Changes:

[alexr] Added MESOS-7482 to 1.1.2 CHANGELOG.

------------------------------------------
[...truncated 28.76 MB...]
I0512 16:54:47.340739 21839 http.cpp:936] Authorizing principal 'test-principal' to GET the
'/containers' endpoint
I0512 16:54:47.344101 21835 slave.cpp:790] Agent terminating
[       OK ] Endpoint/SlaveEndpointTest.AuthorizedRequest/2 (31 ms)
[ RUN      ] Endpoint/SlaveEndpointTest.UnauthorizedRequest/0
I0512 16:54:47.355244  1258 containerizer.cpp:221] Using isolation: posix/cpu,posix/mem,filesystem/posix,network/cni
W0512 16:54:47.355823  1258 backend.cpp:76] Failed to create 'aufs' backend: AufsBackend requires
root privileges
W0512 16:54:47.355958  1258 backend.cpp:76] Failed to create 'bind' backend: BindBackend requires
root privileges
I0512 16:54:47.356005  1258 provisioner.cpp:249] Using default backend 'copy'
I0512 16:54:47.359380 21842 slave.cpp:225] Mesos agent started on (758)@172.17.0.3:39179
I0512 16:54:47.359401 21842 slave.cpp:226] Flags at startup: --acls="" --appc_simple_discovery_uri_prefix="http://"
--appc_store_dir="/tmp/mesos/store/appc" --authenticate_http_executors="true" --authenticate_http_readonly="true"
--authenticate_http_readwrite="true" --authenticatee="crammd5" --authentication_backoff_factor="1secs"
--authorizer="local" --cgroups_cpu_enable_pids_and_tids_count="false" --cgroups_enable_cfs="false"
--cgroups_hierarchy="/sys/fs/cgroup" --cgroups_limit_swap="false" --cgroups_root="mesos" --container_disk_watch_interval="15secs"
--containerizers="mesos" --credential="/tmp/Endpoint_SlaveEndpointTest_UnauthorizedRequest_0_CZcsAo/credential"
--default_role="*" --disk_watch_interval="1mins" --docker="docker" --docker_kill_orphans="true"
--docker_registry="https://registry-1.docker.io" --docker_remove_delay="6hrs" --docker_socket="/var/run/docker.sock"
--docker_stop_timeout="0ns" --docker_store_dir="/tmp/mesos/store/docker" --docker_volume_checkpoint_dir="/var/run/mesos/isolators/docker/volume"
--enforce_container_disk_quota="false" --executor_registration_timeout="1mins" --executor_secret_key="/tmp/Endpoint_SlaveEndpointTest_UnauthorizedRequest_0_CZcsAo/executor_secret_key"
--executor_shutdown_grace_period="5secs" --fetcher_cache_dir="/tmp/Endpoint_SlaveEndpointTest_UnauthorizedRequest_0_CZcsAo/fetch"
--fetcher_cache_size="2GB" --frameworks_home="" --gc_delay="1weeks" --gc_disk_headroom="0.1"
--hadoop_home="" --help="false" --hostname_lookup="true" --http_command_executor="false" --http_credentials="/tmp/Endpoint_SlaveEndpointTest_UnauthorizedRequest_0_CZcsAo/http_credentials"
--http_heartbeat_interval="30secs" --initialize_driver_logging="true" --isolation="posix/cpu,posix/mem"
--launcher="posix" --launcher_dir="/mesos/mesos-1.4.0/_build/src" --logbufsecs="0" --logging_level="INFO"
--max_completed_executors_per_framework="150" --oversubscribed_resources_interval="15secs"
--perf_duration="10secs" --perf_interval="1mins" --port="5051" --qos_correction_interval_min="0ns"
--quiet="false" --recover="reconnect" --recovery_timeout="15mins" --registration_backoff_factor="10ms"
--resources="cpus:2;gpus:0;mem:1024;disk:1024;ports:[31000-32000]" --revocable_cpu_low_priority="true"
--runtime_dir="/tmp/Endpoint_SlaveEndpointTest_UnauthorizedRequest_0_CZcsAo" --sandbox_directory="/mnt/mesos/sandbox"
--strict="true" --switch_user="true" --systemd_enable_support="true" --systemd_runtime_directory="/run/systemd/system"
--version="false" --work_dir="/tmp/Endpoint_SlaveEndpointTest_UnauthorizedRequest_0_WV8COv"
I0512 16:54:47.359755 21842 credentials.hpp:86] Loading credential for authentication from
'/tmp/Endpoint_SlaveEndpointTest_UnauthorizedRequest_0_CZcsAo/credential'
I0512 16:54:47.359944 21842 slave.cpp:258] Agent using credential for: test-principal
I0512 16:54:47.359966 21842 credentials.hpp:37] Loading credentials for authentication from
'/tmp/Endpoint_SlaveEndpointTest_UnauthorizedRequest_0_CZcsAo/http_credentials'
I0512 16:54:47.360261 21842 http.cpp:975] Creating default 'basic' HTTP authenticator for
realm 'mesos-agent-executor'
I0512 16:54:47.360401 21842 http.cpp:996] Creating default 'jwt' HTTP authenticator for realm
'mesos-agent-executor'
I0512 16:54:47.360781 21842 http.cpp:975] Creating default 'basic' HTTP authenticator for
realm 'mesos-agent-readonly'
I0512 16:54:47.360874 21842 http.cpp:996] Creating default 'jwt' HTTP authenticator for realm
'mesos-agent-readonly'
I0512 16:54:47.361289 21842 http.cpp:975] Creating default 'basic' HTTP authenticator for
realm 'mesos-agent-readwrite'
I0512 16:54:47.361436 21842 http.cpp:996] Creating default 'jwt' HTTP authenticator for realm
'mesos-agent-readwrite'
I0512 16:54:47.362857 21842 slave.cpp:525] Agent resources: cpus(*):2; mem(*):1024; disk(*):1024;
ports(*):[31000-32000]
I0512 16:54:47.362980 21842 slave.cpp:533] Agent attributes: [  ]
I0512 16:54:47.362994 21842 slave.cpp:538] Agent hostname: d29d17d48516
I0512 16:54:47.363144 21845 status_update_manager.cpp:177] Pausing sending status updates
I0512 16:54:47.364605 21832 state.cpp:62] Recovering state from '/tmp/Endpoint_SlaveEndpointTest_UnauthorizedRequest_0_WV8COv/meta'
I0512 16:54:47.364924 21829 status_update_manager.cpp:203] Recovering status update manager
I0512 16:54:47.365213 21838 containerizer.cpp:608] Recovering containerizer
I0512 16:54:47.366535 21841 provisioner.cpp:410] Provisioner recovery complete
I0512 16:54:47.366856 21846 slave.cpp:5970] Finished recovery
I0512 16:54:47.367367 21846 slave.cpp:6152] Querying resource estimator for oversubscribable
resources
I0512 16:54:47.367593 21838 slave.cpp:6166] Received oversubscribable resources {} from the
resource estimator
I0512 16:54:47.369544 21834 process.cpp:3730] Handling HTTP event for process 'slave(758)'
with path: '/slave(758)/monitor/statistics'
I0512 16:54:47.371258 21839 http.cpp:1115] HTTP GET for /slave(758)/monitor/statistics from
172.17.0.3:52026
I0512 16:54:47.371340 21839 http.cpp:936] Authorizing principal 'test-principal' to GET the
'/monitor/statistics' endpoint
I0512 16:54:47.374099 21839 slave.cpp:790] Agent terminating
[       OK ] Endpoint/SlaveEndpointTest.UnauthorizedRequest/0 (29 ms)
[ RUN      ] Endpoint/SlaveEndpointTest.UnauthorizedRequest/1
I0512 16:54:47.383642  1258 containerizer.cpp:221] Using isolation: posix/cpu,posix/mem,filesystem/posix,network/cni
W0512 16:54:47.384099  1258 backend.cpp:76] Failed to create 'aufs' backend: AufsBackend requires
root privileges
W0512 16:54:47.384198  1258 backend.cpp:76] Failed to create 'bind' backend: BindBackend requires
root privileges
I0512 16:54:47.384229  1258 provisioner.cpp:249] Using default backend 'copy'
I0512 16:54:47.387266 21834 slave.cpp:225] Mesos agent started on (759)@172.17.0.3:39179
I0512 16:54:47.387285 21834 slave.cpp:226] Flags at startup: --acls="" --appc_simple_discovery_uri_prefix="http://"
--appc_store_dir="/tmp/mesos/store/appc" --authenticate_http_executors="true" --authenticate_http_readonly="true"
--authenticate_http_readwrite="true" --authenticatee="crammd5" --authentication_backoff_factor="1secs"
--authorizer="local" --cgroups_cpu_enable_pids_and_tids_count="false" --cgroups_enable_cfs="false"
--cgroups_hierarchy="/sys/fs/cgroup" --cgroups_limit_swap="false" --cgroups_root="mesos" --container_disk_watch_interval="15secs"
--containerizers="mesos" --credential="/tmp/Endpoint_SlaveEndpointTest_UnauthorizedRequest_1_1NXoUV/credential"
--default_role="*" --disk_watch_interval="1mins" --docker="docker" --docker_kill_orphans="true"
--docker_registry="https://registry-1.docker.io" --docker_remove_delay="6hrs" --docker_socket="/var/run/docker.sock"
--docker_stop_timeout="0ns" --docker_store_dir="/tmp/mesos/store/docker" --docker_volume_checkpoint_dir="/var/run/mesos/isolators/docker/volume"
--enforce_container_disk_quota="false" --executor_registration_timeout="1mins" --executor_secret_key="/tmp/Endpoint_SlaveEndpointTest_UnauthorizedRequest_1_1NXoUV/executor_secret_key"
--executor_shutdown_grace_period="5secs" --fetcher_cache_dir="/tmp/Endpoint_SlaveEndpointTest_UnauthorizedRequest_1_1NXoUV/fetch"
--fetcher_cache_size="2GB" --frameworks_home="" --gc_delay="1weeks" --gc_disk_headroom="0.1"
--hadoop_home="" --help="false" --hostname_lookup="true" --http_command_executor="false" --http_credentials="/tmp/Endpoint_SlaveEndpointTest_UnauthorizedRequest_1_1NXoUV/http_credentials"
--http_heartbeat_interval="30secs" --initialize_driver_logging="true" --isolation="posix/cpu,posix/mem"
--launcher="posix" --launcher_dir="/mesos/mesos-1.4.0/_build/src" --logbufsecs="0" --logging_level="INFO"
--max_completed_executors_per_framework="150" --oversubscribed_resources_interval="15secs"
--perf_duration="10secs" --perf_interval="1mins" --port="5051" --qos_correction_interval_min="0ns"
--quiet="false" --recover="reconnect" --recovery_timeout="15mins" --registration_backoff_factor="10ms"
--resources="cpus:2;gpus:0;mem:1024;disk:1024;ports:[31000-32000]" --revocable_cpu_low_priority="true"
--runtime_dir="/tmp/Endpoint_SlaveEndpointTest_UnauthorizedRequest_1_1NXoUV" --sandbox_directory="/mnt/mesos/sandbox"
--strict="true" --switch_user="true" --systemd_enable_support="true" --systemd_runtime_directory="/run/systemd/system"
--version="false" --work_dir="/tmp/Endpoint_SlaveEndpointTest_UnauthorizedRequest_1_vywj42"
I0512 16:54:47.387626 21834 credentials.hpp:86] Loading credential for authentication from
'/tmp/Endpoint_SlaveEndpointTest_UnauthorizedRequest_1_1NXoUV/credential'
I0512 16:54:47.387761 21834 slave.cpp:258] Agent using credential for: test-principal
I0512 16:54:47.387778 21834 credentials.hpp:37] Loading credentials for authentication from
'/tmp/Endpoint_SlaveEndpointTest_UnauthorizedRequest_1_1NXoUV/http_credentials'
I0512 16:54:47.388005 21834 http.cpp:975] Creating default 'basic' HTTP authenticator for
realm 'mesos-agent-executor'
I0512 16:54:47.388094 21834 http.cpp:996] Creating default 'jwt' HTTP authenticator for realm
'mesos-agent-executor'
I0512 16:54:47.388428 21834 http.cpp:975] Creating default 'basic' HTTP authenticator for
realm 'mesos-agent-readonly'
I0512 16:54:47.388556 21834 http.cpp:996] Creating default 'jwt' HTTP authenticator for realm
'mesos-agent-readonly'
I0512 16:54:47.388913 21834 http.cpp:975] Creating default 'basic' HTTP authenticator for
realm 'mesos-agent-readwrite'
I0512 16:54:47.389010 21834 http.cpp:996] Creating default 'jwt' HTTP authenticator for realm
'mesos-agent-readwrite'
I0512 16:54:47.390179 21834 slave.cpp:525] Agent resources: cpus(*):2; mem(*):1024; disk(*):1024;
ports(*):[31000-32000]
I0512 16:54:47.390245 21834 slave.cpp:533] Agent attributes: [  ]
I0512 16:54:47.390256 21834 slave.cpp:538] Agent hostname: d29d17d48516
I0512 16:54:47.390357 21838 status_update_manager.cpp:177] Pausing sending status updates
I0512 16:54:47.391675 21836 state.cpp:62] Recovering state from '/tmp/Endpoint_SlaveEndpointTest_UnauthorizedRequest_1_vywj42/meta'
I0512 16:54:47.391906 21832 status_update_manager.cpp:203] Recovering status update manager
I0512 16:54:47.392304 21851 containerizer.cpp:608] Recovering containerizer
I0512 16:54:47.393501 21850 provisioner.cpp:410] Provisioner recovery complete
I0512 16:54:47.393992 21837 slave.cpp:5970] Finished recovery
I0512 16:54:47.394337 21837 slave.cpp:6152] Querying resource estimator for oversubscribable
resources
I0512 16:54:47.394585 21848 slave.cpp:6166] Received oversubscribable resources {} from the
resource estimator
I0512 16:54:47.396245 21845 process.cpp:3730] Handling HTTP event for process 'slave(759)'
with path: '/slave(759)/monitor/statistics.json'
I0512 16:54:47.397835 21834 http.cpp:1115] HTTP GET for /slave(759)/monitor/statistics.json
from 172.17.0.3:52030
I0512 16:54:47.397894 21834 http.cpp:936] Authorizing principal 'test-principal' to GET the
'/monitor/statistics.json' endpoint
I0512 16:54:47.400172 21849 slave.cpp:790] Agent terminating
[       OK ] Endpoint/SlaveEndpointTest.UnauthorizedRequest/1 (26 ms)
[ RUN      ] Endpoint/SlaveEndpointTest.UnauthorizedRequest/2
I0512 16:54:47.409354  1258 containerizer.cpp:221] Using isolation: posix/cpu,posix/mem,filesystem/posix,network/cni
W0512 16:54:47.409796  1258 backend.cpp:76] Failed to create 'aufs' backend: AufsBackend requires
root privileges
W0512 16:54:47.409878  1258 backend.cpp:76] Failed to create 'bind' backend: BindBackend requires
root privileges
I0512 16:54:47.409904  1258 provisioner.cpp:249] Using default backend 'copy'
I0512 16:54:47.413565 21829 slave.cpp:225] Mesos agent started on (760)@172.17.0.3:39179
I0512 16:54:47.413605 21829 slave.cpp:226] Flags at startup: --acls="" --appc_simple_discovery_uri_prefix="http://"
--appc_store_dir="/tmp/mesos/store/appc" --authenticate_http_executors="true" --authenticate_http_readonly="true"
--authenticate_http_readwrite="true" --authenticatee="crammd5" --authentication_backoff_factor="1secs"
--authorizer="local" --cgroups_cpu_enable_pids_and_tids_count="false" --cgroups_enable_cfs="false"
--cgroups_hierarchy="/sys/fs/cgroup" --cgroups_limit_swap="false" --cgroups_root="mesos" --container_disk_watch_interval="15secs"
--containerizers="mesos" --credential="/tmp/Endpoint_SlaveEndpointTest_UnauthorizedRequest_2_YPJVtt/credential"
--default_role="*" --disk_watch_interval="1mins" --docker="docker" --docker_kill_orphans="true"
--docker_registry="https://registry-1.docker.io" --docker_remove_delay="6hrs" --docker_socket="/var/run/docker.sock"
--docker_stop_timeout="0ns" --docker_store_dir="/tmp/mesos/store/docker" --docker_volume_checkpoint_dir="/var/run/mesos/isolators/docker/volume"
--enforce_container_disk_quota="false" --executor_registration_timeout="1mins" --executor_secret_key="/tmp/Endpoint_SlaveEndpointTest_UnauthorizedRequest_2_YPJVtt/executor_secret_key"
--executor_shutdown_grace_period="5secs" --fetcher_cache_dir="/tmp/Endpoint_SlaveEndpointTest_UnauthorizedRequest_2_YPJVtt/fetch"
--fetcher_cache_size="2GB" --frameworks_home="" --gc_delay="1weeks" --gc_disk_headroom="0.1"
--hadoop_home="" --help="false" --hostname_lookup="true" --http_command_executor="false" --http_credentials="/tmp/Endpoint_SlaveEndpointTest_UnauthorizedRequest_2_YPJVtt/http_credentials"
--http_heartbeat_interval="30secs" --initialize_driver_logging="true" --isolation="posix/cpu,posix/mem"
--launcher="posix" --launcher_dir="/mesos/mesos-1.4.0/_build/src" --logbufsecs="0" --logging_level="INFO"
--max_completed_executors_per_framework="150" --oversubscribed_resources_interval="15secs"
--perf_duration="10secs" --perf_interval="1mins" --port="5051" --qos_correction_interval_min="0ns"
--quiet="false" --recover="reconnect" --recovery_timeout="15mins" --registration_backoff_factor="10ms"
--resources="cpus:2;gpus:0;mem:1024;disk:1024;ports:[31000-32000]" --revocable_cpu_low_priority="true"
--runtime_dir="/tmp/Endpoint_SlaveEndpointTest_UnauthorizedRequest_2_YPJVtt" --sandbox_directory="/mnt/mesos/sandbox"
--strict="true" --switch_user="true" --systemd_enable_support="true" --systemd_runtime_directory="/run/systemd/system"
--version="false" --work_dir="/tmp/Endpoint_SlaveEndpointTest_UnauthorizedRequest_2_tpZZzA"
I0512 16:54:47.414124 21829 credentials.hpp:86] Loading credential for authentication from
'/tmp/Endpoint_SlaveEndpointTest_UnauthorizedRequest_2_YPJVtt/credential'
I0512 16:54:47.414402 21829 slave.cpp:258] Agent using credential for: test-principal
I0512 16:54:47.414424 21829 credentials.hpp:37] Loading credentials for authentication from
'/tmp/Endpoint_SlaveEndpointTest_UnauthorizedRequest_2_YPJVtt/http_credentials'
I0512 16:54:47.414742 21829 http.cpp:975] Creating default 'basic' HTTP authenticator for
realm 'mesos-agent-executor'
I0512 16:54:47.414887 21829 http.cpp:996] Creating default 'jwt' HTTP authenticator for realm
'mesos-agent-executor'
I0512 16:54:47.415285 21829 http.cpp:975] Creating default 'basic' HTTP authenticator for
realm 'mesos-agent-readonly'
I0512 16:54:47.415390 21829 http.cpp:996] Creating default 'jwt' HTTP authenticator for realm
'mesos-agent-readonly'
I0512 16:54:47.415735 21829 http.cpp:975] Creating default 'basic' HTTP authenticator for
realm 'mesos-agent-readwrite'
I0512 16:54:47.415839 21829 http.cpp:996] Creating default 'jwt' HTTP authenticator for realm
'mesos-agent-readwrite'
I0512 16:54:47.417107 21829 slave.cpp:525] Agent resources: cpus(*):2; mem(*):1024; disk(*):1024;
ports(*):[31000-32000]
I0512 16:54:47.417173 21829 slave.cpp:533] Agent attributes: [  ]
I0512 16:54:47.417186 21829 slave.cpp:538] Agent hostname: d29d17d48516
I0512 16:54:47.417317 21839 status_update_manager.cpp:177] Pausing sending status updates
I0512 16:54:47.418388 21836 state.cpp:62] Recovering state from '/tmp/Endpoint_SlaveEndpointTest_UnauthorizedRequest_2_tpZZzA/meta'
I0512 16:54:47.418661 21852 status_update_manager.cpp:203] Recovering status update manager
I0512 16:54:47.418885 21839 containerizer.cpp:608] Recovering containerizer
I0512 16:54:47.420485 21831 provisioner.cpp:410] Provisioner recovery complete
I0512 16:54:47.420912 21838 slave.cpp:5970] Finished recovery
I0512 16:54:47.421365 21838 slave.cpp:6152] Querying resource estimator for oversubscribable
resources
I0512 16:54:47.421609 21839 slave.cpp:6166] Received oversubscribable resources {} from the
resource estimator
I0512 16:54:47.423501 21836 process.cpp:3730] Handling HTTP event for process 'slave(760)'
with path: '/slave(760)/containers'
I0512 16:54:47.425017 21836 http.cpp:1115] HTTP GET for /slave(760)/containers from 172.17.0.3:52036
I0512 16:54:47.425092 21836 http.cpp:936] Authorizing principal 'test-principal' to GET the
'/containers' endpoint
I0512 16:54:47.427245 21841 slave.cpp:790] Agent terminating
[       OK ] Endpoint/SlaveEndpointTest.UnauthorizedRequest/2 (28 ms)
[ RUN      ] Endpoint/SlaveEndpointTest.NoAuthorizer/0
I0512 16:54:47.438864  1258 containerizer.cpp:221] Using isolation: posix/cpu,posix/mem,filesystem/posix,network/cni
W0512 16:54:47.439451  1258 backend.cpp:76] Failed to create 'aufs' backend: AufsBackend requires
root privileges
W0512 16:54:47.439568  1258 backend.cpp:76] Failed to create 'bind' backend: BindBackend requires
root privileges
I0512 16:54:47.439611  1258 provisioner.cpp:249] Using default backend 'copy'
I0512 16:54:47.441195  1258 cluster.cpp:448] Creating default 'local' authorizer
I0512 16:54:47.442819 21839 slave.cpp:225] Mesos agent started on (761)@172.17.0.3:39179
I0512 16:54:47.442842 21839 slave.cpp:226] Flags at startup: --acls="" --appc_simple_discovery_uri_prefix="http://"
--appc_store_dir="/tmp/mesos/store/appc" --authenticate_http_executors="true" --authenticate_http_readonly="true"
--authenticate_http_readwrite="true" --authenticatee="crammd5" --authentication_backoff_factor="1secs"
--authorizer="local" --cgroups_cpu_enable_pids_and_tids_count="false" --cgroups_enable_cfs="false"
--cgroups_hierarchy="/sys/fs/cgroup" --cgroups_limit_swap="false" --cgroups_root="mesos" --container_disk_watch_interval="15secs"
--containerizers="mesos" --credential="/tmp/Endpoint_SlaveEndpointTest_NoAuthorizer_0_BJMik1/credential"
--default_role="*" --disk_watch_interval="1mins" --docker="docker" --docker_kill_orphans="true"
--docker_registry="https://registry-1.docker.io" --docker_remove_delay="6hrs" --docker_socket="/var/run/docker.sock"
--docker_stop_timeout="0ns" --docker_store_dir="/tmp/mesos/store/docker" --docker_volume_checkpoint_dir="/var/run/mesos/isolators/docker/volume"
--enforce_container_disk_quota="false" --executor_registration_timeout="1mins" --executor_secret_key="/tmp/Endpoint_SlaveEndpointTest_NoAuthorizer_0_BJMik1/executor_secret_key"
--executor_shutdown_grace_period="5secs" --fetcher_cache_dir="/tmp/Endpoint_SlaveEndpointTest_NoAuthorizer_0_BJMik1/fetch"
--fetcher_cache_size="2GB" --frameworks_home="" --gc_delay="1weeks" --gc_disk_headroom="0.1"
--hadoop_home="" --help="false" --hostname_lookup="true" --http_command_executor="false" --http_credentials="/tmp/Endpoint_SlaveEndpointTest_NoAuthorizer_0_BJMik1/http_credentials"
--http_heartbeat_interval="30secs" --initialize_driver_logging="true" --isolation="posix/cpu,posix/mem"
--launcher="posix" --launcher_dir="/mesos/mesos-1.4.0/_build/src" --logbufsecs="0" --logging_level="INFO"
--max_completed_executors_per_framework="150" --oversubscribed_resources_interval="15secs"
--perf_duration="10secs" --perf_interval="1mins" --port="5051" --qos_correction_interval_min="0ns"
--quiet="false" --recover="reconnect" --recovery_timeout="15mins" --registration_backoff_factor="10ms"
--resources="cpus:2;gpus:0;mem:1024;disk:1024;ports:[31000-32000]" --revocable_cpu_low_priority="true"
--runtime_dir="/tmp/Endpoint_SlaveEndpointTest_NoAuthorizer_0_BJMik1" --sandbox_directory="/mnt/mesos/sandbox"
--strict="true" --switch_user="true" --systemd_enable_support="true" --systemd_runtime_directory="/run/systemd/system"
--version="false" --work_dir="/tmp/Endpoint_SlaveEndpointTest_NoAuthorizer_0_vA13l8"
I0512 16:54:47.443222 21839 credentials.hpp:86] Loading credential for authentication from
'/tmp/Endpoint_SlaveEndpointTest_NoAuthorizer_0_BJMik1/credential'
I0512 16:54:47.443397 21839 slave.cpp:258] Agent using credential for: test-principal
I0512 16:54:47.443419 21839 credentials.hpp:37] Loading credentials for authentication from
'/tmp/Endpoint_SlaveEndpointTest_NoAuthorizer_0_BJMik1/http_credentials'
I0512 16:54:47.443691 21839 http.cpp:975] Creating default 'basic' HTTP authenticator for
realm 'mesos-agent-executor'
I0512 16:54:47.443812 21839 http.cpp:996] Creating default 'jwt' HTTP authenticator for realm
'mesos-agent-executor'
I0512 16:54:47.444123 21839 http.cpp:975] Creating default 'basic' HTTP authenticator for
realm 'mesos-agent-readonly'
I0512 16:54:47.444221 21839 http.cpp:996] Creating default 'jwt' HTTP authenticator for realm
'mesos-agent-readonly'
I0512 16:54:47.444500 21839 http.cpp:975] Creating default 'basic' HTTP authenticator for
realm 'mesos-agent-readwrite'
I0512 16:54:47.444602 21839 http.cpp:996] Creating default 'jwt' HTTP authenticator for realm
'mesos-agent-readwrite'
I0512 16:54:47.446077 21839 slave.cpp:525] Agent resources: cpus(*):2; mem(*):1024; disk(*):1024;
ports(*):[31000-32000]
I0512 16:54:47.446171 21839 slave.cpp:533] Agent attributes: [  ]
I0512 16:54:47.446184 21839 slave.cpp:538] Agent hostname: d29d17d48516
I0512 16:54:47.446316 21836 status_update_manager.cpp:177] Pausing sending status updates
I0512 16:54:47.447674 21850 state.cpp:62] Recovering state from '/tmp/Endpoint_SlaveEndpointTest_NoAuthorizer_0_vA13l8/meta'
I0512 16:54:47.448056 21835 status_update_manager.cpp:203] Recovering status update manager
I0512 16:54:47.448279 21847 containerizer.cpp:608] Recovering containerizer
I0512 16:54:47.450018 21833 provisioner.cpp:410] Provisioner recovery complete
I0512 16:54:47.450444 21843 slave.cpp:5970] Finished recovery
I0512 16:54:47.450990 21843 slave.cpp:6152] Querying resource estimator for oversubscribable
resources
I0512 16:54:47.451334 21842 slave.cpp:6166] Received oversubscribable resources {} from the
resource estimator
I0512 16:54:47.453794 21837 process.cpp:3730] Handling HTTP event for process 'slave(761)'
with path: '/slave(761)/monitor/statistics'
I0512 16:54:47.455790 21843 http.cpp:1115] HTTP GET for /slave(761)/monitor/statistics from
172.17.0.3:52042
I0512 16:54:47.455879 21843 http.cpp:936] Authorizing principal 'test-principal' to GET the
'/monitor/statistics' endpoint
I0512 16:54:47.459519 21847 slave.cpp:790] Agent terminating
[       OK ] Endpoint/SlaveEndpointTest.NoAuthorizer/0 (32 ms)
[ RUN      ] Endpoint/SlaveEndpointTest.NoAuthorizer/1
I0512 16:54:47.470765  1258 containerizer.cpp:221] Using isolation: posix/cpu,posix/mem,filesystem/posix,network/cni
W0512 16:54:47.471348  1258 backend.cpp:76] Failed to create 'aufs' backend: AufsBackend requires
root privileges
W0512 16:54:47.471441  1258 backend.cpp:76] Failed to create 'bind' backend: BindBackend requires
root privileges
I0512 16:54:47.471470  1258 provisioner.cpp:249] Using default backend 'copy'
I0512 16:54:47.473436  1258 cluster.cpp:448] Creating default 'local' authorizer
I0512 16:54:47.475113 21834 slave.cpp:225] Mesos agent started on (762)@172.17.0.3:39179
I0512 16:54:47.475138 21834 slave.cpp:226] Flags at startup: --acls="" --appc_simple_discovery_uri_prefix="http://"
--appc_store_dir="/tmp/mesos/store/appc" --authenticate_http_executors="true" --authenticate_http_readonly="true"
--authenticate_http_readwrite="true" --authenticatee="crammd5" --authentication_backoff_factor="1secs"
--authorizer="local" --cgroups_cpu_enable_pids_and_tids_count="false" --cgroups_enable_cfs="false"
--cgroups_hierarchy="/sys/fs/cgroup" --cgroups_limit_swap="false" --cgroups_root="mesos" --container_disk_watch_interval="15secs"
--containerizers="mesos" --credential="/tmp/Endpoint_SlaveEndpointTest_NoAuthorizer_1_l77ctz/credential"
--default_role="*" --disk_watch_interval="1mins" --docker="docker" --docker_kill_orphans="true"
--docker_registry="https://registry-1.docker.io" --docker_remove_delay="6hrs" --docker_socket="/var/run/docker.sock"
--docker_stop_timeout="0ns" --docker_store_dir="/tmp/mesos/store/docker" --docker_volume_checkpoint_dir="/var/run/mesos/isolators/docker/volume"
--enforce_container_disk_quota="false" --executor_registration_timeout="1mins" --executor_secret_key="/tmp/Endpoint_SlaveEndpointTest_NoAuthorizer_1_l77ctz/executor_secret_key"
--executor_shutdown_grace_period="5secs" --fetcher_cache_dir="/tmp/Endpoint_SlaveEndpointTest_NoAuthorizer_1_l77ctz/fetch"
--fetcher_cache_size="2GB" --frameworks_home="" --gc_delay="1weeks" --gc_disk_headroom="0.1"
--hadoop_home="" --help="false" --hostname_lookup="true" --http_command_executor="false" --http_credentials="/tmp/Endpoint_SlaveEndpointTest_NoAuthorizer_1_l77ctz/http_credentials"
--http_heartbeat_interval="30secs" --initialize_driver_logging="true" --isolation="posix/cpu,posix/mem"
--launcher="posix" --launcher_dir="/mesos/mesos-1.4.0/_build/src" --logbufsecs="0" --logging_level="INFO"
--max_completed_executors_per_framework="150" --oversubscribed_resources_interval="15secs"
--perf_duration="10secs" --perf_interval="1mins" --port="5051" --qos_correction_interval_min="0ns"
--quiet="false" --recover="reconnect" --recovery_timeout="15mins" --registration_backoff_factor="10ms"
--resources="cpus:2;gpus:0;mem:1024;disk:1024;ports:[31000-32000]" --revocable_cpu_low_priority="true"
--runtime_dir="/tmp/Endpoint_SlaveEndpointTest_NoAuthorizer_1_l77ctz" --sandbox_directory="/mnt/mesos/sandbox"
--strict="true" --switch_user="true" --systemd_enable_support="true" --systemd_runtime_directory="/run/systemd/system"
--version="false" --work_dir="/tmp/Endpoint_SlaveEndpointTest_NoAuthorizer_1_TpegqG"
I0512 16:54:47.475517 21834 credentials.hpp:86] Loading credential for authentication from
'/tmp/Endpoint_SlaveEndpointTest_NoAuthorizer_1_l77ctz/credential'
I0512 16:54:47.475698 21834 slave.cpp:258] Agent using credential for: test-principal
I0512 16:54:47.475725 21834 credentials.hpp:37] Loading credentials for authentication from
'/tmp/Endpoint_SlaveEndpointTest_NoAuthorizer_1_l77ctz/http_credentials'
I0512 16:54:47.476027 21834 http.cpp:975] Creating default 'basic' HTTP authenticator for
realm 'mesos-agent-executor'
I0512 16:54:47.476161 21834 http.cpp:996] Creating default 'jwt' HTTP authenticator for realm
'mesos-agent-executor'
I0512 16:54:47.476562 21834 http.cpp:975] Creating default 'basic' HTTP authenticator for
realm 'mesos-agent-readonly'
I0512 16:54:47.476771 21834 http.cpp:996] Creating default 'jwt' HTTP authenticator for realm
'mesos-agent-readonly'
I0512 16:54:47.477061 21834 http.cpp:975] Creating default 'basic' HTTP authenticator for
realm 'mesos-agent-readwrite'
I0512 16:54:47.477217 21834 http.cpp:996] Creating default 'jwt' HTTP authenticator for realm
'mesos-agent-readwrite'
I0512 16:54:47.478714 21834 slave.cpp:525] Agent resources: cpus(*):2; mem(*):1024; disk(*):1024;
ports(*):[31000-32000]
I0512 16:54:47.478799 21834 slave.cpp:533] Agent attributes: [  ]
I0512 16:54:47.478818 21834 slave.cpp:538] Agent hostname: d29d17d48516
I0512 16:54:47.478994 21833 status_update_manager.cpp:177] Pausing sending status updates
I0512 16:54:47.480527 21844 state.cpp:62] Recovering state from '/tmp/Endpoint_SlaveEndpointTest_NoAuthorizer_1_TpegqG/meta'
I0512 16:54:47.480967 21848 status_update_manager.cpp:203] Recovering status update manager
I0512 16:54:47.481261 21836 containerizer.cpp:608] Recovering containerizer
I0512 16:54:47.483075 21848 provisioner.cpp:410] Provisioner recovery complete
I0512 16:54:47.483558 21842 slave.cpp:5970] Finished recovery
I0512 16:54:47.483988 21842 slave.cpp:6152] Querying resource estimator for oversubscribable
resources
I0512 16:54:47.484303 21836 slave.cpp:6166] Received oversubscribable resources {} from the
resource estimator
I0512 16:54:47.486706 21836 process.cpp:3730] Handling HTTP event for process 'slave(762)'
with path: '/slave(762)/monitor/statistics.json'
I0512 16:54:47.488608 21835 http.cpp:1115] HTTP GET for /slave(762)/monitor/statistics.json
from 172.17.0.3:52044
I0512 16:54:47.488682 21835 http.cpp:936] Authorizing principal 'test-principal' to GET the
'/monitor/statistics.json' endpoint
I0512 16:54:47.491840 21838 slave.cpp:790] Agent terminating
[       OK ] Endpoint/SlaveEndpointTest.NoAuthorizer/1 (32 ms)
[ RUN      ] Endpoint/SlaveEndpointTest.NoAuthorizer/2
I0512 16:54:47.502246  1258 containerizer.cpp:221] Using isolation: posix/cpu,posix/mem,filesystem/posix,network/cni
W0512 16:54:47.502740  1258 backend.cpp:76] Failed to create 'aufs' backend: AufsBackend requires
root privileges
W0512 16:54:47.502835  1258 backend.cpp:76] Failed to create 'bind' backend: BindBackend requires
root privileges
I0512 16:54:47.502864  1258 provisioner.cpp:249] Using default backend 'copy'
I0512 16:54:47.504261  1258 cluster.cpp:448] Creating default 'local' authorizer
I0512 16:54:47.506243 21847 slave.cpp:225] Mesos agent started on (763)@172.17.0.3:39179
I0512 16:54:47.506266 21847 slave.cpp:226] Flags at startup: --acls="" --appc_simple_discovery_uri_prefix="http://"
--appc_store_dir="/tmp/mesos/store/appc" --authenticate_http_executors="true" --authenticate_http_readonly="true"
--authenticate_http_readwrite="true" --authenticatee="crammd5" --authentication_backoff_factor="1secs"
--authorizer="local" --cgroups_cpu_enable_pids_and_tids_count="false" --cgroups_enable_cfs="false"
--cgroups_hierarchy="/sys/fs/cgroup" --cgroups_limit_swap="false" --cgroups_root="mesos" --container_disk_watch_interval="15secs"
--containerizers="mesos" --credential="/tmp/Endpoint_SlaveEndpointTest_NoAuthorizer_2_nCBoV7/credential"
--default_role="*" --disk_watch_interval="1mins" --docker="docker" --docker_kill_orphans="true"
--docker_registry="https://registry-1.docker.io" --docker_remove_delay="6hrs" --docker_socket="/var/run/docker.sock"
--docker_stop_timeout="0ns" --docker_store_dir="/tmp/mesos/store/docker" --docker_volume_checkpoint_dir="/var/run/mesos/isolators/docker/volume"
--enforce_container_disk_quota="false" --executor_registration_timeout="1mins" --executor_secret_key="/tmp/Endpoint_SlaveEndpointTest_NoAuthorizer_2_nCBoV7/executor_secret_key"
--executor_shutdown_grace_period="5secs" --fetcher_cache_dir="/tmp/Endpoint_SlaveEndpointTest_NoAuthorizer_2_nCBoV7/fetch"
--fetcher_cache_size="2GB" --frameworks_home="" --gc_delay="1weeks" --gc_disk_headroom="0.1"
--hadoop_home="" --help="false" --hostname_lookup="true" --http_command_executor="false" --http_credentials="/tmp/Endpoint_SlaveEndpointTest_NoAuthorizer_2_nCBoV7/http_credentials"
--http_heartbeat_interval="30secs" --initialize_driver_logging="true" --isolation="posix/cpu,posix/mem"
--launcher="posix" --launcher_dir="/mesos/mesos-1.4.0/_build/src" --logbufsecs="0" --logging_level="INFO"
--max_completed_executors_per_framework="150" --oversubscribed_resources_interval="15secs"
--perf_duration="10secs" --perf_interval="1mins" --port="5051" --qos_correction_interval_min="0ns"
--quiet="false" --recover="reconnect" --recovery_timeout="15mins" --registration_backoff_factor="10ms"
--resources="cpus:2;gpus:0;mem:1024;disk:1024;ports:[31000-32000]" --revocable_cpu_low_priority="true"
--runtime_dir="/tmp/Endpoint_SlaveEndpointTest_NoAuthorizer_2_nCBoV7" --sandbox_directory="/mnt/mesos/sandbox"
--strict="true" --switch_user="true" --systemd_enable_support="true" --systemd_runtime_directory="/run/systemd/system"
--version="false" --work_dir="/tmp/Endpoint_SlaveEndpointTest_NoAuthorizer_2_lDfGNe"
I0512 16:54:47.506584 21847 credentials.hpp:86] Loading credential for authentication from
'/tmp/Endpoint_SlaveEndpointTest_NoAuthorizer_2_nCBoV7/credential'
I0512 16:54:47.506745 21847 slave.cpp:258] Agent using credential for: test-principal
I0512 16:54:47.506763 21847 credentials.hpp:37] Loading credentials for authentication from
'/tmp/Endpoint_SlaveEndpointTest_NoAuthorizer_2_nCBoV7/http_credentials'
I0512 16:54:47.507025 21847 http.cpp:975] Creating default 'basic' HTTP authenticator for
realm 'mesos-agent-executor'
I0512 16:54:47.507141 21847 http.cpp:996] Creating default 'jwt' HTTP authenticator for realm
'mesos-agent-executor'
I0512 16:54:47.507405 21847 http.cpp:975] Creating default 'basic' HTTP authenticator for
realm 'mesos-agent-readonly'
I0512 16:54:47.507504 21847 http.cpp:996] Creating default 'jwt' HTTP authenticator for realm
'mesos-agent-readonly'
I0512 16:54:47.507851 21847 http.cpp:975] Creating default 'basic' HTTP authenticator for
realm 'mesos-agent-readwrite'
I0512 16:54:47.508002 21847 http.cpp:996] Creating default 'jwt' HTTP authenticator for realm
'mesos-agent-readwrite'
I0512 16:54:47.509567 21847 slave.cpp:525] Agent resources: cpus(*):2; mem(*):1024; disk(*):1024;
ports(*):[31000-32000]
I0512 16:54:47.509667 21847 slave.cpp:533] Agent attributes: [  ]
I0512 16:54:47.509687 21847 slave.cpp:538] Agent hostname: d29d17d48516
I0512 16:54:47.509850 21846 status_update_manager.cpp:177] Pausing sending status updates
I0512 16:54:47.511521 21836 state.cpp:62] Recovering state from '/tmp/Endpoint_SlaveEndpointTest_NoAuthorizer_2_lDfGNe/meta'
I0512 16:54:47.511978 21852 status_update_manager.cpp:203] Recovering status update manager
I0512 16:54:47.512279 21833 containerizer.cpp:608] Recovering containerizer
I0512 16:54:47.513677 21846 provisioner.cpp:410] Provisioner recovery complete
I0512 16:54:47.514034 21832 slave.cpp:5970] Finished recovery
I0512 16:54:47.514480 21832 slave.cpp:6152] Querying resource estimator for oversubscribable
resources
I0512 16:54:47.514752 21849 slave.cpp:6166] Received oversubscribable resources {} from the
resource estimator
I0512 16:54:47.517426 21839 process.cpp:3730] Handling HTTP event for process 'slave(763)'
with path: '/slave(763)/containers'
I0512 16:54:47.519317 21829 http.cpp:1115] HTTP GET for /slave(763)/containers from 172.17.0.3:52046
I0512 16:54:47.519412 21829 http.cpp:936] Authorizing principal 'test-principal' to GET the
'/containers' endpoint
I0512 16:54:47.522689 21832 slave.cpp:790] Agent terminating
[       OK ] Endpoint/SlaveEndpointTest.NoAuthorizer/2 (31 ms)
[----------] 9 tests from Endpoint/SlaveEndpointTest (274 ms total)

[----------] Global test environment tear-down
[==========] 1585 tests from 177 test cases ran. (586971 ms total)
[  PASSED  ] 1581 tests.
[  FAILED  ] 4 tests, listed below:
[  FAILED  ] DefaultExecutorCheckTest.CommandCheckDeliveredAndReconciled
[  FAILED  ] DefaultExecutorCheckTest.CommandCheckStatusChange
[  FAILED  ] DefaultExecutorCheckTest.CommandCheckSeesParentsEnv
[  FAILED  ] DefaultExecutorCheckTest.CommandCheckSharesWorkDirWithTask

 4 FAILED TESTS
  YOU HAVE 19 DISABLED TESTS

E0512 16:54:47.580440 21853 process.cpp:950] Failed to accept socket: future discarded
make[4]: *** [check-local] Error 1
make[4]: Leaving directory `/mesos/mesos-1.4.0/_build/src'
make[3]: *** [check-am] Error 2
make[3]: Leaving directory `/mesos/mesos-1.4.0/_build/src'
make[2]: *** [check] Error 2
make[2]: Leaving directory `/mesos/mesos-1.4.0/_build/src'
make[1]: *** [check-recursive] Error 1
make[1]: Leaving directory `/mesos/mesos-1.4.0/_build'
make: *** [distcheck] Error 1
+ docker rmi mesos-1494605138-16838
Untagged: mesos-1494605138-16838:latest
Deleted: sha256:1d73d6e2cea29d71aecba5b60054f175407e5bf0ef8f1acc25f882f0ff2c0b45
Deleted: sha256:5cf80508413bd055c18f74badc70922541d9462396eedbdd56402447777cca38
Deleted: sha256:b3053958db5e82093cc6459611cf7e271d827dd6fa580422a3bd5b25120d2427
Deleted: sha256:f7fdb9e1a710b5fd5806b883c1dbb6db8a9a2fc2645a45e0f3e12b5d606f89f8
Deleted: sha256:38b5e96217a4717b80409361a4375ff4f7e018ae87783181470932082ae0194c
Deleted: sha256:55f880b0950ece02d09e42eded6de6e944428524f3053002ab18168592f6bad8
Deleted: sha256:b6abe04da5f017a7c06465890bf88965335b49eda166b7557fe182ec7dd51c35
Deleted: sha256:472bd411b60aa7196d0ae1f2b6bb6e9ce9ed9ba6ff7ccd92f196ef17d46a4e31
Deleted: sha256:1bd38153655ee9d6cd6e47212fc0019f3e26750f289271d991289393446d2ad9
Deleted: sha256:4584aaad17eac5374b97ee095bd1a5e86d2fffe99c38e7031258bed4ed4e8cfb
Deleted: sha256:adfa35c80da5d803415c6b6692b83c9c6df1781d7452ad8fc24b9884c88a99e4
Deleted: sha256:448ed043f0f0c0560bbd8d97419c51b66e10de83d10a85f5735971bb948a16e0
Deleted: sha256:3e3970a7fd827033635be5e711c17e4f934ba915d08e6dd1fb5112cf6a891b59
Deleted: sha256:c1448f71aa84c2e927739e0b9254667984c3117ed2432b3972526012f5c2f18b
Deleted: sha256:699deb67c3ae894303e7de932dc7c30f406e2c3e33087b71efa5604c120fb1eb
Deleted: sha256:64c19778b4a7a103d21a4c953520258b4273851d4cbb95cca1ef6eaa474e0181
Deleted: sha256:18a7245ec6bfb79d2a1d7cef5c13a68ca2efbfbba49c268e2ac68bc57dd119d8
Deleted: sha256:faba2ebee4aef973630e37046c251be0a2dd131c4b07b0e91ec56480ade2147d
Deleted: sha256:43295d10989177e4fb73fab208ae7be9973ddbda8560ea1fce391de01b3cf486
Deleted: sha256:a6dfa7a8cfd433d0a08fa1779e47fb6c88b86d5d4a34d58f9eda8416e6ac18c0
Deleted: sha256:5087405d0b782e968fd2b2e1ce8e6d3fb924a94828e121040d6719c896d609ab
Deleted: sha256:556ef8e09dcc013cb1ea3b5f9f87ad7737466231d7da9400b40805a9fc419337
Deleted: sha256:d2bc4fac8a4deea1309a9bafe0f90b7e12cdbf46be4ff6b62a3fdc66be1ad70e
Deleted: sha256:90203a3bbf5fb390bee2e29c11eaf28b1d992925d80134f4e291e9deb433ee76
Build step 'Execute shell' marked build as failure

Mime
View raw message