mesos-builds mailing list archives

Site index · List index
Message view « Date » · « Thread »
Top « Date » · « Thread »
From Apache Jenkins Server <jenk...@builds.apache.org>
Subject Build failed in Jenkins: Mesos-Buildbot » autotools,gcc,--verbose --enable-libevent --enable-ssl,GLOG_v=1 MESOS_VERBOSE=1,centos:7,(docker||Hadoop)&&(!ubuntu-us1)&&(!ubuntu-eu2) #3652
Date Wed, 10 May 2017 16:18:38 GMT
See <https://builds.apache.org/job/Mesos-Buildbot/BUILDTOOL=autotools,COMPILER=gcc,CONFIGURATION=--verbose%20--enable-libevent%20--enable-ssl,ENVIRONMENT=GLOG_v=1%20MESOS_VERBOSE=1,OS=centos%3A7,label_exp=(docker%7C%7CHadoop)&&(!ubuntu-us1)&&(!ubuntu-eu2)/3652/display/redirect>

------------------------------------------
[...truncated 10.59 MB...]
I0510 16:18:31.192112  1900 slave.cpp:4324] Sending message for framework d9ce38ef-9c0c-4102-ac3f-ce8dfc58262f-0000
to scheduler-35d12973-6464-4f3a-a999-6cdbeb1fa642@172.17.0.2:46056
I0510 16:18:31.192342  1891 sched.cpp:1177] Scheduler::frameworkMessage took 70019ns
I0510 16:18:31.192780  1868 sched.cpp:2021] Asked to stop the driver
I0510 16:18:31.192864  1906 sched.cpp:1203] Stopping framework d9ce38ef-9c0c-4102-ac3f-ce8dfc58262f-0000
I0510 16:18:31.193220  1893 master.cpp:7741] Processing TEARDOWN call for framework d9ce38ef-9c0c-4102-ac3f-ce8dfc58262f-0000
(default) at scheduler-35d12973-6464-4f3a-a999-6cdbeb1fa642@172.17.0.2:46056
I0510 16:18:31.193250  1893 master.cpp:7753] Removing framework d9ce38ef-9c0c-4102-ac3f-ce8dfc58262f-0000
(default) at scheduler-35d12973-6464-4f3a-a999-6cdbeb1fa642@172.17.0.2:46056
I0510 16:18:31.193276  1893 master.cpp:3081] Deactivating framework d9ce38ef-9c0c-4102-ac3f-ce8dfc58262f-0000
(default) at scheduler-35d12973-6464-4f3a-a999-6cdbeb1fa642@172.17.0.2:46056
I0510 16:18:31.193651  1908 hierarchical.cpp:415] Deactivated framework d9ce38ef-9c0c-4102-ac3f-ce8dfc58262f-0000
I0510 16:18:31.193823  1906 slave.cpp:2658] Asked to shut down framework d9ce38ef-9c0c-4102-ac3f-ce8dfc58262f-0000
by master@172.17.0.2:46056
I0510 16:18:31.193828  1893 master.cpp:8338] Updating the state of task 1 of framework d9ce38ef-9c0c-4102-ac3f-ce8dfc58262f-0000
(latest state: TASK_KILLED, status update state: TASK_KILLED)
I0510 16:18:31.193899  1906 slave.cpp:2683] Shutting down framework d9ce38ef-9c0c-4102-ac3f-ce8dfc58262f-0000
I0510 16:18:31.193964  1906 slave.cpp:5082] Shutting down executor 'default' of framework
d9ce38ef-9c0c-4102-ac3f-ce8dfc58262f-0000 at executor(74)@172.17.0.2:46056
I0510 16:18:31.194214  1907 exec.cpp:415] Executor asked to shutdown
I0510 16:18:31.194259  1907 exec.cpp:430] Executor::shutdown took 24538ns
I0510 16:18:31.194417  1891 slave.cpp:4388] Got exited event for executor(74)@172.17.0.2:46056
I0510 16:18:31.194818  1891 slave.cpp:4768] Executor 'default' of framework d9ce38ef-9c0c-4102-ac3f-ce8dfc58262f-0000
exited with status 0
I0510 16:18:31.194897  1891 slave.cpp:4868] Cleaning up executor 'default' of framework d9ce38ef-9c0c-4102-ac3f-ce8dfc58262f-0000
at executor(74)@172.17.0.2:46056
I0510 16:18:31.194818  1893 master.cpp:8432] Removing task 1 with resources cpus(*)(allocated:
*):2; mem(*)(allocated: *):1024; disk(*)(allocated: *):1024; ports(*)(allocated: *):[31000-32000]
of framework d9ce38ef-9c0c-4102-ac3f-ce8dfc58262f-0000 on agent d9ce38ef-9c0c-4102-ac3f-ce8dfc58262f-S0
at slave(176)@172.17.0.2:46056 (d9c6efc5244b)
I0510 16:18:31.195174  1893 master.cpp:8461] Removing executor 'default' with resources {}
of framework d9ce38ef-9c0c-4102-ac3f-ce8dfc58262f-0000 on agent d9ce38ef-9c0c-4102-ac3f-ce8dfc58262f-S0
at slave(176)@172.17.0.2:46056 (d9c6efc5244b)
I0510 16:18:31.195209  1887 gc.cpp:55] Scheduling '/tmp/MasterTest_FrameworkMessage_CzAQT5/slaves/d9ce38ef-9c0c-4102-ac3f-ce8dfc58262f-S0/frameworks/d9ce38ef-9c0c-4102-ac3f-ce8dfc58262f-0000/executors/default/runs/a807637c-9db5-4937-8d39-32661386e44b'
for gc 6.99999774251259days in the future
I0510 16:18:31.195327  1891 slave.cpp:4956] Cleaning up framework d9ce38ef-9c0c-4102-ac3f-ce8dfc58262f-0000
I0510 16:18:31.195348  1887 gc.cpp:55] Scheduling '/tmp/MasterTest_FrameworkMessage_CzAQT5/slaves/d9ce38ef-9c0c-4102-ac3f-ce8dfc58262f-S0/frameworks/d9ce38ef-9c0c-4102-ac3f-ce8dfc58262f-0000/executors/default'
for gc 6.99999773990815days in the future
I0510 16:18:31.195318  1898 hierarchical.cpp:1064] Recovered cpus(*)(allocated: *):2; mem(*)(allocated:
*):1024; disk(*)(allocated: *):1024; ports(*)(allocated: *):[31000-32000] (total: cpus(*):2;
mem(*):1024; disk(*):1024; ports(*):[31000-32000], allocated: {}) on agent d9ce38ef-9c0c-4102-ac3f-ce8dfc58262f-S0
from framework d9ce38ef-9c0c-4102-ac3f-ce8dfc58262f-0000
I0510 16:18:31.195549  1895 status_update_manager.cpp:285] Closing status update streams for
framework d9ce38ef-9c0c-4102-ac3f-ce8dfc58262f-0000
I0510 16:18:31.195588  1895 status_update_manager.cpp:531] Cleaning up status update stream
for task 1 of framework d9ce38ef-9c0c-4102-ac3f-ce8dfc58262f-0000
I0510 16:18:31.195708  1891 slave.cpp:803] Agent terminating
I0510 16:18:31.195709  1899 gc.cpp:55] Scheduling '/tmp/MasterTest_FrameworkMessage_CzAQT5/slaves/d9ce38ef-9c0c-4102-ac3f-ce8dfc58262f-S0/frameworks/d9ce38ef-9c0c-4102-ac3f-ce8dfc58262f-0000'
for gc 6.99999773776593days in the future
W0510 16:18:31.195736  1893 master.cpp:6314] Ignoring unknown exited executor 'default' of
framework d9ce38ef-9c0c-4102-ac3f-ce8dfc58262f-0000 on agent d9ce38ef-9c0c-4102-ac3f-ce8dfc58262f-S0
at slave(176)@172.17.0.2:46056 (d9c6efc5244b)
I0510 16:18:31.195888  1900 master.cpp:1264] Agent d9ce38ef-9c0c-4102-ac3f-ce8dfc58262f-S0
at slave(176)@172.17.0.2:46056 (d9c6efc5244b) disconnected
I0510 16:18:31.195914  1900 master.cpp:3118] Disconnecting agent d9ce38ef-9c0c-4102-ac3f-ce8dfc58262f-S0
at slave(176)@172.17.0.2:46056 (d9c6efc5244b)
I0510 16:18:31.195942  1898 hierarchical.cpp:362] Removed framework d9ce38ef-9c0c-4102-ac3f-ce8dfc58262f-0000
I0510 16:18:31.195996  1900 master.cpp:3137] Deactivating agent d9ce38ef-9c0c-4102-ac3f-ce8dfc58262f-S0
at slave(176)@172.17.0.2:46056 (d9c6efc5244b)
I0510 16:18:31.196117  1889 hierarchical.cpp:618] Agent d9ce38ef-9c0c-4102-ac3f-ce8dfc58262f-S0
deactivated
I0510 16:18:31.198609  1887 master.cpp:1103] Master terminating
I0510 16:18:31.199198  1889 hierarchical.cpp:549] Removed agent d9ce38ef-9c0c-4102-ac3f-ce8dfc58262f-S0
[       OK ] MasterTest.FrameworkMessage (67 ms)
[ RUN      ] MasterTest.MultipleExecutors
I0510 16:18:31.205302  1868 cluster.cpp:160] Creating default 'local' authorizer
I0510 16:18:31.207901  1900 master.cpp:383] Master a7ca1d2e-799a-42f7-867c-a18d05f3c92b (d9c6efc5244b)
started on 172.17.0.2:46056
I0510 16:18:31.207926  1900 master.cpp:385] Flags at startup: --acls="" --agent_ping_timeout="15secs"
--agent_reregister_timeout="10mins" --allocation_interval="1secs" --allocator="HierarchicalDRF"
--authenticate_agents="true" --authenticate_frameworks="true" --authenticate_http_frameworks="true"
--authenticate_http_readonly="true" --authenticate_http_readwrite="true" --authenticators="crammd5"
--authorizers="local" --credentials="/tmp/XwHk0R/credentials" --framework_sorter="drf" --help="false"
--hostname_lookup="true" --http_authenticators="basic" --http_framework_authenticators="basic"
--initialize_driver_logging="true" --log_auto_initialize="true" --logbufsecs="0" --logging_level="INFO"
--max_agent_ping_timeouts="5" --max_completed_frameworks="50" --max_completed_tasks_per_framework="1000"
--max_unreachable_tasks_per_framework="1000" --port="5050" --quiet="false" --recovery_agent_removal_limit="100%"
--registry="in_memory" --registry_fetch_timeout="1mins" --registry_gc_interval="15mins" --registry_max_agent_age="2weeks"
--registry_max_agent_count="102400" --registry_store_timeout="100secs" --registry_strict="false"
--root_submissions="true" --user_sorter="drf" --version="false" --webui_dir="/mesos/mesos-1.2.1/_inst/share/mesos/webui"
--work_dir="/tmp/XwHk0R/master" --zk_session_timeout="10secs"
I0510 16:18:31.208290  1900 master.cpp:435] Master only allowing authenticated frameworks
to register
I0510 16:18:31.208303  1900 master.cpp:449] Master only allowing authenticated agents to register
I0510 16:18:31.208312  1900 master.cpp:462] Master only allowing authenticated HTTP frameworks
to register
I0510 16:18:31.208319  1900 credentials.hpp:37] Loading credentials for authentication from
'/tmp/XwHk0R/credentials'
I0510 16:18:31.208657  1900 master.cpp:507] Using default 'crammd5' authenticator
I0510 16:18:31.208837  1900 http.cpp:919] Using default 'basic' HTTP authenticator for realm
'mesos-master-readonly'
I0510 16:18:31.209034  1900 http.cpp:919] Using default 'basic' HTTP authenticator for realm
'mesos-master-readwrite'
I0510 16:18:31.209324  1900 http.cpp:919] Using default 'basic' HTTP authenticator for realm
'mesos-master-scheduler'
I0510 16:18:31.209447  1900 master.cpp:587] Authorization enabled
I0510 16:18:31.209697  1898 hierarchical.cpp:161] Initialized hierarchical allocator process
I0510 16:18:31.209738  1901 whitelist_watcher.cpp:77] No whitelist given
I0510 16:18:31.211922  1893 master.cpp:2124] Elected as the leading master!
I0510 16:18:31.211948  1893 master.cpp:1646] Recovering from registrar
I0510 16:18:31.212067  1910 registrar.cpp:329] Recovering registrar
I0510 16:18:31.212796  1910 registrar.cpp:362] Successfully fetched the registry (0B) in 686848ns
I0510 16:18:31.212882  1910 registrar.cpp:461] Applied 1 operations in 20398ns; attempting
to update the registry
I0510 16:18:31.213879  1910 registrar.cpp:506] Successfully updated the registry in 939776ns
I0510 16:18:31.214011  1910 registrar.cpp:392] Successfully recovered registrar
I0510 16:18:31.214498  1904 master.cpp:1762] Recovered 0 agents from the registry (129B);
allowing 10mins for agents to re-register
I0510 16:18:31.214550  1895 hierarchical.cpp:188] Skipping recovery of hierarchical allocator:
nothing to recover
I0510 16:18:31.218786  1868 cluster.cpp:446] Creating default 'local' authorizer
I0510 16:18:31.220619  1896 slave.cpp:211] Mesos agent started on (177)@172.17.0.2:46056
I0510 16:18:31.220644  1896 slave.cpp:212] Flags at startup: --acls="" --appc_simple_discovery_uri_prefix="http://"
--appc_store_dir="/tmp/mesos/store/appc" --authenticate_http_readonly="true" --authenticate_http_readwrite="true"
--authenticatee="crammd5" --authentication_backoff_factor="1secs" --authorizer="local" --cgroups_cpu_enable_pids_and_tids_count="false"
--cgroups_enable_cfs="false" --cgroups_hierarchy="/sys/fs/cgroup" --cgroups_limit_swap="false"
--cgroups_root="mesos" --container_disk_watch_interval="15secs" --containerizers="mesos" --credential="/tmp/MasterTest_MultipleExecutors_lV3Hgg/credential"
--default_role="*" --disk_watch_interval="1mins" --docker="docker" --docker_kill_orphans="true"
--docker_registry="https://registry-1.docker.io" --docker_remove_delay="6hrs" --docker_socket="/var/run/docker.sock"
--docker_stop_timeout="0ns" --docker_store_dir="/tmp/mesos/store/docker" --docker_volume_checkpoint_dir="/var/run/mesos/isolators/docker/volume"
--enforce_container_disk_quota="false" --executor_registration_timeout="1mins" --executor_shutdown_grace_period="5secs"
--fetcher_cache_dir="/tmp/MasterTest_MultipleExecutors_lV3Hgg/fetch" --fetcher_cache_size="2GB"
--frameworks_home="" --gc_delay="1weeks" --gc_disk_headroom="0.1" --hadoop_home="" --help="false"
--hostname_lookup="true" --http_authenticators="basic" --http_command_executor="false" --http_credentials="/tmp/MasterTest_MultipleExecutors_lV3Hgg/http_credentials"
--http_heartbeat_interval="30secs" --initialize_driver_logging="true" --isolation="posix/cpu,posix/mem"
--launcher="posix" --launcher_dir="/mesos/mesos-1.2.1/_build/src" --logbufsecs="0" --logging_level="INFO"
--max_completed_executors_per_framework="150" --oversubscribed_resources_interval="15secs"
--perf_duration="10secs" --perf_interval="1mins" --port="5051" --qos_correction_interval_min="0ns"
--quiet="false" --recover="reconnect" --recovery_timeout="15mins" --registration_backoff_factor="10ms"
--resources="cpus:2;gpus:0;mem:1024;disk:1024;ports:[31000-32000]" --revocable_cpu_low_priority="true"
--runtime_dir="/tmp/MasterTest_MultipleExecutors_lV3Hgg" --sandbox_directory="/mnt/mesos/sandbox"
--strict="true" --switch_user="true" --systemd_enable_support="true" --systemd_runtime_directory="/run/systemd/system"
--version="false" --work_dir="/tmp/MasterTest_MultipleExecutors_v7Sv8y"
I0510 16:18:31.221181  1896 credentials.hpp:86] Loading credential for authentication from
'/tmp/MasterTest_MultipleExecutors_lV3Hgg/credential'
I0510 16:18:31.221324  1896 slave.cpp:354] Agent using credential for: test-principal
I0510 16:18:31.221345  1896 credentials.hpp:37] Loading credentials for authentication from
'/tmp/MasterTest_MultipleExecutors_lV3Hgg/http_credentials'
I0510 16:18:31.221595  1896 http.cpp:919] Using default 'basic' HTTP authenticator for realm
'mesos-agent-readonly'
I0510 16:18:31.221933  1896 http.cpp:919] Using default 'basic' HTTP authenticator for realm
'mesos-agent-readwrite'
I0510 16:18:31.221990  1868 sched.cpp:232] Version: 1.2.1
I0510 16:18:31.222496  1907 sched.cpp:336] New master detected at master@172.17.0.2:46056
I0510 16:18:31.222592  1907 sched.cpp:407] Authenticating with master master@172.17.0.2:46056
I0510 16:18:31.222612  1907 sched.cpp:414] Using default CRAM-MD5 authenticatee
I0510 16:18:31.222793  1887 authenticatee.cpp:121] Creating new client SASL connection
I0510 16:18:31.223057  1900 master.cpp:7199] Authenticating scheduler-43fa0b6a-7538-4d19-bc38-4e701a96eca8@172.17.0.2:46056
I0510 16:18:31.223139  1896 slave.cpp:541] Agent resources: cpus(*):2; mem(*):1024; disk(*):1024;
ports(*):[31000-32000]
I0510 16:18:31.223196  1897 authenticator.cpp:414] Starting authentication session for crammd5-authenticatee(407)@172.17.0.2:46056
I0510 16:18:31.223227  1896 slave.cpp:549] Agent attributes: [  ]
I0510 16:18:31.223239  1896 slave.cpp:554] Agent hostname: d9c6efc5244b
I0510 16:18:31.223376  1890 status_update_manager.cpp:177] Pausing sending status updates
I0510 16:18:31.223438  1910 authenticator.cpp:98] Creating new server SASL connection
I0510 16:18:31.223660  1907 authenticatee.cpp:213] Received SASL authentication mechanisms:
CRAM-MD5
I0510 16:18:31.223695  1907 authenticatee.cpp:239] Attempting to authenticate with mechanism
'CRAM-MD5'
I0510 16:18:31.223906  1892 authenticator.cpp:204] Received SASL authentication start
I0510 16:18:31.223979  1892 authenticator.cpp:326] Authentication requires more steps
I0510 16:18:31.224205  1906 authenticatee.cpp:259] Received SASL authentication step
I0510 16:18:31.224419  1891 authenticator.cpp:232] Received SASL authentication step
I0510 16:18:31.224453  1891 auxprop.cpp:109] Request to lookup properties for user: 'test-principal'
realm: 'd9c6efc5244b' server FQDN: 'd9c6efc5244b' SASL_AUXPROP_VERIFY_AGAINST_HASH: false
SASL_AUXPROP_OVERRIDE: false SASL_AUXPROP_AUTHZID: false 
I0510 16:18:31.224473  1891 auxprop.cpp:181] Looking up auxiliary property '*userPassword'
I0510 16:18:31.224499  1891 auxprop.cpp:181] Looking up auxiliary property '*cmusaslsecretCRAM-MD5'
I0510 16:18:31.224520  1891 auxprop.cpp:109] Request to lookup properties for user: 'test-principal'
realm: 'd9c6efc5244b' server FQDN: 'd9c6efc5244b' SASL_AUXPROP_VERIFY_AGAINST_HASH: false
SASL_AUXPROP_OVERRIDE: false SASL_AUXPROP_AUTHZID: true 
I0510 16:18:31.224532  1891 auxprop.cpp:131] Skipping auxiliary property '*userPassword' since
SASL_AUXPROP_AUTHZID == true
I0510 16:18:31.224542  1891 auxprop.cpp:131] Skipping auxiliary property '*cmusaslsecretCRAM-MD5'
since SASL_AUXPROP_AUTHZID == true
I0510 16:18:31.224560  1891 authenticator.cpp:318] Authentication success
I0510 16:18:31.224679  1909 authenticatee.cpp:299] Authentication success
I0510 16:18:31.224700  1901 master.cpp:7229] Successfully authenticated principal 'test-principal'
at scheduler-43fa0b6a-7538-4d19-bc38-4e701a96eca8@172.17.0.2:46056
I0510 16:18:31.224804  1905 authenticator.cpp:432] Authentication session cleanup for crammd5-authenticatee(407)@172.17.0.2:46056
I0510 16:18:31.225061  1891 state.cpp:62] Recovering state from '/tmp/MasterTest_MultipleExecutors_v7Sv8y/meta'
I0510 16:18:31.225065  1888 sched.cpp:513] Successfully authenticated with master master@172.17.0.2:46056
I0510 16:18:31.225101  1888 sched.cpp:836] Sending SUBSCRIBE call to master@172.17.0.2:46056
I0510 16:18:31.225180  1888 sched.cpp:869] Will retry registration in 145.410076ms if necessary
I0510 16:18:31.225294  1910 status_update_manager.cpp:203] Recovering status update manager
I0510 16:18:31.225319  1887 master.cpp:2737] Received SUBSCRIBE call for framework 'default'
at scheduler-43fa0b6a-7538-4d19-bc38-4e701a96eca8@172.17.0.2:46056
I0510 16:18:31.225380  1887 master.cpp:2160] Authorizing framework principal 'test-principal'
to receive offers for role '*'
I0510 16:18:31.225764  1910 master.cpp:2813] Subscribing framework default with checkpointing
disabled and capabilities [  ]
I0510 16:18:31.225766  1905 slave.cpp:5557] Finished recovery
I0510 16:18:31.226291  1904 sched.cpp:759] Framework registered with a7ca1d2e-799a-42f7-867c-a18d05f3c92b-0000
I0510 16:18:31.226330  1905 slave.cpp:5731] Querying resource estimator for oversubscribable
resources
I0510 16:18:31.226338  1904 sched.cpp:773] Scheduler::registered took 21344ns
I0510 16:18:31.226511  1890 hierarchical.cpp:286] Added framework a7ca1d2e-799a-42f7-867c-a18d05f3c92b-0000
I0510 16:18:31.226549  1905 slave.cpp:931] New master detected at master@172.17.0.2:46056
I0510 16:18:31.226552  1906 status_update_manager.cpp:177] Pausing sending status updates
I0510 16:18:31.226641  1905 slave.cpp:966] Detecting new master
I0510 16:18:31.226681  1890 hierarchical.cpp:1810] No allocations performed
I0510 16:18:31.226716  1890 hierarchical.cpp:1900] No inverse offers to send out!
I0510 16:18:31.226757  1890 hierarchical.cpp:1394] Performed allocation for 0 agents in 154799ns
I0510 16:18:31.226765  1905 slave.cpp:5745] Received oversubscribable resources {} from the
resource estimator
I0510 16:18:31.230794  1901 slave.cpp:993] Authenticating with master master@172.17.0.2:46056
I0510 16:18:31.230860  1901 slave.cpp:1004] Using default CRAM-MD5 authenticatee
I0510 16:18:31.231073  1888 authenticatee.cpp:121] Creating new client SASL connection
I0510 16:18:31.231518  1909 master.cpp:7199] Authenticating slave(177)@172.17.0.2:46056
I0510 16:18:31.231622  1892 authenticator.cpp:414] Starting authentication session for crammd5-authenticatee(408)@172.17.0.2:46056
I0510 16:18:31.231981  1907 authenticator.cpp:98] Creating new server SASL connection
I0510 16:18:31.232178  1898 authenticatee.cpp:213] Received SASL authentication mechanisms:
CRAM-MD5
I0510 16:18:31.232211  1898 authenticatee.cpp:239] Attempting to authenticate with mechanism
'CRAM-MD5'
I0510 16:18:31.232406  1896 authenticator.cpp:204] Received SASL authentication start
I0510 16:18:31.232461  1896 authenticator.cpp:326] Authentication requires more steps
I0510 16:18:31.232591  1908 authenticatee.cpp:259] Received SASL authentication step
I0510 16:18:31.232807  1910 authenticator.cpp:232] Received SASL authentication step
I0510 16:18:31.232851  1910 auxprop.cpp:109] Request to lookup properties for user: 'test-principal'
realm: 'd9c6efc5244b' server FQDN: 'd9c6efc5244b' SASL_AUXPROP_VERIFY_AGAINST_HASH: false
SASL_AUXPROP_OVERRIDE: false SASL_AUXPROP_AUTHZID: false 
I0510 16:18:31.232866  1910 auxprop.cpp:181] Looking up auxiliary property '*userPassword'
I0510 16:18:31.232897  1910 auxprop.cpp:181] Looking up auxiliary property '*cmusaslsecretCRAM-MD5'
I0510 16:18:31.232924  1910 auxprop.cpp:109] Request to lookup properties for user: 'test-principal'
realm: 'd9c6efc5244b' server FQDN: 'd9c6efc5244b' SASL_AUXPROP_VERIFY_AGAINST_HASH: false
SASL_AUXPROP_OVERRIDE: false SASL_AUXPROP_AUTHZID: true 
I0510 16:18:31.232936  1910 auxprop.cpp:131] Skipping auxiliary property '*userPassword' since
SASL_AUXPROP_AUTHZID == true
I0510 16:18:31.232944  1910 auxprop.cpp:131] Skipping auxiliary property '*cmusaslsecretCRAM-MD5'
since SASL_AUXPROP_AUTHZID == true
I0510 16:18:31.232961  1910 authenticator.cpp:318] Authentication success
I0510 16:18:31.233043  1893 authenticatee.cpp:299] Authentication success
I0510 16:18:31.233103  1901 master.cpp:7229] Successfully authenticated principal 'test-principal'
at slave(177)@172.17.0.2:46056
I0510 16:18:31.233327  1898 authenticator.cpp:432] Authentication session cleanup for crammd5-authenticatee(408)@172.17.0.2:46056
I0510 16:18:31.233631  1904 slave.cpp:1088] Successfully authenticated with master master@172.17.0.2:46056
I0510 16:18:31.233780  1904 slave.cpp:1515] Will retry registration in 12.833479ms if necessary
I0510 16:18:31.233975  1893 master.cpp:5396] Registering agent at slave(177)@172.17.0.2:46056
(d9c6efc5244b) with id a7ca1d2e-799a-42f7-867c-a18d05f3c92b-S0
I0510 16:18:31.234365  1888 registrar.cpp:461] Applied 1 operations in 49847ns; attempting
to update the registry
I0510 16:18:31.235770  1888 registrar.cpp:506] Successfully updated the registry in 1.342976ms
I0510 16:18:31.236508  1902 slave.cpp:4346] Received ping from slave-observer(174)@172.17.0.2:46056
I0510 16:18:31.236555  1897 master.cpp:5470] Registered agent a7ca1d2e-799a-42f7-867c-a18d05f3c92b-S0
at slave(177)@172.17.0.2:46056 (d9c6efc5244b) with cpus(*):2; mem(*):1024; disk(*):1024; ports(*):[31000-32000]
I0510 16:18:31.236663  1902 slave.cpp:1134] Registered with master master@172.17.0.2:46056;
given agent ID a7ca1d2e-799a-42f7-867c-a18d05f3c92b-S0
I0510 16:18:31.236685  1902 fetcher.cpp:94] Clearing fetcher cache
I0510 16:18:31.236840  1890 status_update_manager.cpp:184] Resuming sending status updates
I0510 16:18:31.236865  1887 hierarchical.cpp:516] Added agent a7ca1d2e-799a-42f7-867c-a18d05f3c92b-S0
(d9c6efc5244b) with cpus(*):2; mem(*):1024; disk(*):1024; ports(*):[31000-32000] (allocated:
{})
I0510 16:18:31.237081  1902 slave.cpp:1162] Checkpointing SlaveInfo to '/tmp/MasterTest_MultipleExecutors_v7Sv8y/meta/slaves/a7ca1d2e-799a-42f7-867c-a18d05f3c92b-S0/slave.info'
I0510 16:18:31.237403  1902 slave.cpp:1200] Forwarding total oversubscribed resources {}
I0510 16:18:31.237550  1900 master.cpp:6045] Received update of agent a7ca1d2e-799a-42f7-867c-a18d05f3c92b-S0
at slave(177)@172.17.0.2:46056 (d9c6efc5244b) with total oversubscribed resources {}
I0510 16:18:31.238024  1887 hierarchical.cpp:1900] No inverse offers to send out!
I0510 16:18:31.238081  1887 hierarchical.cpp:1394] Performed allocation for 1 agents in 1.095973ms
I0510 16:18:31.238215  1887 hierarchical.cpp:589] Agent a7ca1d2e-799a-42f7-867c-a18d05f3c92b-S0
(d9c6efc5244b) updated with oversubscribed resources {} (total: cpus(*):2; mem(*):1024; disk(*):1024;
ports(*):[31000-32000], allocated: cpus(*)(allocated: *):2; mem(*)(allocated: *):1024; disk(*)(allocated:
*):1024; ports(*)(allocated: *):[31000-32000])
I0510 16:18:31.238391  1887 hierarchical.cpp:1810] No allocations performed
I0510 16:18:31.238430  1887 hierarchical.cpp:1900] No inverse offers to send out!
I0510 16:18:31.238471  1887 hierarchical.cpp:1394] Performed allocation for 1 agents in 150683ns
I0510 16:18:31.238674  1903 master.cpp:7028] Sending 1 offers to framework a7ca1d2e-799a-42f7-867c-a18d05f3c92b-0000
(default) at scheduler-43fa0b6a-7538-4d19-bc38-4e701a96eca8@172.17.0.2:46056
I0510 16:18:31.239269  1898 sched.cpp:933] Scheduler::resourceOffers took 118177ns
I0510 16:18:31.241436  1909 master.cpp:3776] Processing ACCEPT call for offers: [ a7ca1d2e-799a-42f7-867c-a18d05f3c92b-O0
] on agent a7ca1d2e-799a-42f7-867c-a18d05f3c92b-S0 at slave(177)@172.17.0.2:46056 (d9c6efc5244b)
for framework a7ca1d2e-799a-42f7-867c-a18d05f3c92b-0000 (default) at scheduler-43fa0b6a-7538-4d19-bc38-4e701a96eca8@172.17.0.2:46056
I0510 16:18:31.241535  1909 master.cpp:3352] Authorizing framework principal 'test-principal'
to launch task 1
I0510 16:18:31.241765  1909 master.cpp:3352] Authorizing framework principal 'test-principal'
to launch task 2
W0510 16:18:31.243513  1909 validation.cpp:1064] Executor 'executor-1' for task '1' uses less
CPUs (None) than the minimum required (0.01). Please update your executor, as this will be
mandatory in future releases.
W0510 16:18:31.243546  1909 validation.cpp:1076] Executor 'executor-1' for task '1' uses less
memory (None) than the minimum required (32MB). Please update your executor, as this will
be mandatory in future releases.
I0510 16:18:31.243868  1909 master.cpp:9089] Adding task 1 with resources cpus(*)(allocated:
*):1; mem(*)(allocated: *):512 on agent a7ca1d2e-799a-42f7-867c-a18d05f3c92b-S0 at slave(177)@172.17.0.2:46056
(d9c6efc5244b)
I0510 16:18:31.244026  1909 master.cpp:4426] Launching task 1 of framework a7ca1d2e-799a-42f7-867c-a18d05f3c92b-0000
(default) at scheduler-43fa0b6a-7538-4d19-bc38-4e701a96eca8@172.17.0.2:46056 with resources
cpus(*)(allocated: *):1; mem(*)(allocated: *):512 on agent a7ca1d2e-799a-42f7-867c-a18d05f3c92b-S0
at slave(177)@172.17.0.2:46056 (d9c6efc5244b)
I0510 16:18:31.244408  1895 slave.cpp:1625] Got assigned task '1' for framework a7ca1d2e-799a-42f7-867c-a18d05f3c92b-0000
I0510 16:18:31.244974  1895 slave.cpp:1785] Launching task '1' for framework a7ca1d2e-799a-42f7-867c-a18d05f3c92b-0000
W0510 16:18:31.245064  1909 validation.cpp:1064] Executor 'executor-2' for task '2' uses less
CPUs (None) than the minimum required (0.01). Please update your executor, as this will be
mandatory in future releases.
W0510 16:18:31.245093  1909 validation.cpp:1076] Executor 'executor-2' for task '2' uses less
memory (None) than the minimum required (32MB). Please update your executor, as this will
be mandatory in future releases.
I0510 16:18:31.245431  1909 master.cpp:9089] Adding task 2 with resources cpus(*)(allocated:
*):1; mem(*)(allocated: *):512 on agent a7ca1d2e-799a-42f7-867c-a18d05f3c92b-S0 at slave(177)@172.17.0.2:46056
(d9c6efc5244b)
I0510 16:18:31.245546  1895 paths.cpp:547] Trying to chown '/tmp/MasterTest_MultipleExecutors_v7Sv8y/slaves/a7ca1d2e-799a-42f7-867c-a18d05f3c92b-S0/frameworks/a7ca1d2e-799a-42f7-867c-a18d05f3c92b-0000/executors/executor-1/runs/de0b2732-b128-4fe5-9090-25dca366601a'
to user 'mesos'
I0510 16:18:31.245589  1909 master.cpp:4426] Launching task 2 of framework a7ca1d2e-799a-42f7-867c-a18d05f3c92b-0000
(default) at scheduler-43fa0b6a-7538-4d19-bc38-4e701a96eca8@172.17.0.2:46056 with resources
cpus(*)(allocated: *):1; mem(*)(allocated: *):512 on agent a7ca1d2e-799a-42f7-867c-a18d05f3c92b-S0
at slave(177)@172.17.0.2:46056 (d9c6efc5244b)
I0510 16:18:31.245761  1895 slave.cpp:6479] Launching executor 'executor-1' of framework a7ca1d2e-799a-42f7-867c-a18d05f3c92b-0000
with resources {} in work directory '/tmp/MasterTest_MultipleExecutors_v7Sv8y/slaves/a7ca1d2e-799a-42f7-867c-a18d05f3c92b-S0/frameworks/a7ca1d2e-799a-42f7-867c-a18d05f3c92b-0000/executors/executor-1/runs/de0b2732-b128-4fe5-9090-25dca366601a'
I0510 16:18:31.246305  1895 slave.cpp:2118] Queued task '1' for executor 'executor-1' of framework
a7ca1d2e-799a-42f7-867c-a18d05f3c92b-0000
I0510 16:18:31.246503  1895 slave.cpp:1625] Got assigned task '2' for framework a7ca1d2e-799a-42f7-867c-a18d05f3c92b-0000
I0510 16:18:31.246903  1895 slave.cpp:884] Successfully attached file '/tmp/MasterTest_MultipleExecutors_v7Sv8y/slaves/a7ca1d2e-799a-42f7-867c-a18d05f3c92b-S0/frameworks/a7ca1d2e-799a-42f7-867c-a18d05f3c92b-0000/executors/executor-1/runs/de0b2732-b128-4fe5-9090-25dca366601a'
I0510 16:18:31.246991  1895 slave.cpp:1785] Launching task '2' for framework a7ca1d2e-799a-42f7-867c-a18d05f3c92b-0000
I0510 16:18:31.247388  1895 paths.cpp:547] Trying to chown '/tmp/MasterTest_MultipleExecutors_v7Sv8y/slaves/a7ca1d2e-799a-42f7-867c-a18d05f3c92b-S0/frameworks/a7ca1d2e-799a-42f7-867c-a18d05f3c92b-0000/executors/executor-2/runs/f7a8e3a1-5287-4c97-bb91-f6fb95157b75'
to user 'mesos'
I0510 16:18:31.247572  1895 slave.cpp:6479] Launching executor 'executor-2' of framework a7ca1d2e-799a-42f7-867c-a18d05f3c92b-0000
with resources {} in work directory '/tmp/MasterTest_MultipleExecutors_v7Sv8y/slaves/a7ca1d2e-799a-42f7-867c-a18d05f3c92b-S0/frameworks/a7ca1d2e-799a-42f7-867c-a18d05f3c92b-0000/executors/executor-2/runs/f7a8e3a1-5287-4c97-bb91-f6fb95157b75'
*** Aborted at 1494433111 (unix time) try "date -d @1494433111" if you are using GNU date
***
I0510 16:18:31.248184  1894 hierarchical.cpp:807] Updated allocation of framework a7ca1d2e-799a-42f7-867c-a18d05f3c92b-0000
on agent a7ca1d2e-799a-42f7-867c-a18d05f3c92b-S0 from cpus(*)(allocated: *):2; mem(*)(allocated:
*):1024; disk(*)(allocated: *):1024; ports(*)(allocated: *):[31000-32000] to cpus(*)(allocated:
*):2; mem(*)(allocated: *):1024; disk(*)(allocated: *):1024; ports(*)(allocated: *):[31000-32000]
I0510 16:18:31.248229  1903 exec.cpp:162] Version: 1.2.1
I0510 16:18:31.248404  1905 exec.cpp:212] Executor started at: executor(75)@172.17.0.2:46056
with pid 1868
I0510 16:18:31.248873  1894 hierarchical.cpp:1064] Recovered ports(*)(allocated: *):[31000-32000];
disk(*)(allocated: *):1024 (total: cpus(*):2; mem(*):1024; disk(*):1024; ports(*):[31000-32000],
allocated: cpus(*)(allocated: *):2; mem(*)(allocated: *):1024) on agent a7ca1d2e-799a-42f7-867c-a18d05f3c92b-S0
from framework a7ca1d2e-799a-42f7-867c-a18d05f3c92b-0000
I0510 16:18:31.248934  1894 hierarchical.cpp:1101] Framework a7ca1d2e-799a-42f7-867c-a18d05f3c92b-0000
filtered agent a7ca1d2e-799a-42f7-867c-a18d05f3c92b-S0 for 5secs
PC: @     0x7fc67b76a0cd __GI_getenv
*** SIGSEGV (@0xc0) received by PID 1868 (TID 0x7fc6704bd700) from PID 192; stack trace: ***
    @     0x7fc6663e5fc5 (unknown)
    @     0x7fc6663eb2c1 (unknown)
    @     0x7fc6663df0a8 (unknown)
    @     0x7fc67c72f370 (unknown)
    @     0x7fc67b76a0cd __GI_getenv
    @     0x5618532e95c5 os::getenv()
    @     0x7fc681a7310b mesos::internal::slave::executorEnvironment()
    @     0x7fc681a6d6e8 mesos::internal::slave::Framework::launchExecutor()
    @     0x7fc681a46ad1 mesos::internal::slave::Slave::_run()
    @     0x7fc681aa41c0 _ZZN7process8dispatchIN5mesos8internal5slave5SlaveERKNS_6FutureIbEERKNS1_13FrameworkInfoERKNS1_12ExecutorInfoERK6OptionINS1_8TaskInfoEERKSF_INS1_13TaskGroupInfoEES6_S9_SC_SH_SL_EEvRKNS_3PIDIT_EEMSP_FvT0_T1_T2_T3_T4_ET5_T6_T7_T8_T9_ENKUlPNS_11ProcessBaseEE_clES16_
    @     0x7fc681adc13e _ZNSt17_Function_handlerIFvPN7process11ProcessBaseEEZNS0_8dispatchIN5mesos8internal5slave5SlaveERKNS0_6FutureIbEERKNS5_13FrameworkInfoERKNS5_12ExecutorInfoERK6OptionINS5_8TaskInfoEERKSJ_INS5_13TaskGroupInfoEESA_SD_SG_SL_SP_EEvRKNS0_3PIDIT_EEMST_FvT0_T1_T2_T3_T4_ET5_T6_T7_T8_T9_EUlS2_E_E9_M_invokeERKSt9_Any_dataS2_
    @     0x7fc6828eeb29 std::function<>::operator()()
    @     0x7fc6828d2d3d process::ProcessBase::visit()
    @     0x7fc6828de042 process::DispatchEvent::visit()
    @     0x5618532ba146 process::ProcessBase::serve()
    @     0x7fc6828ced39 process::ProcessManager::resume()
    @     0x7fc6828cb4e4 _ZZN7process14ProcessManager12init_threadsEvENKUt_clEv
    @     0x7fc6828dd6aa _ZNSt12_Bind_simpleIFZN7process14ProcessManager12init_threadsEvEUt_vEE9_M_invokeIIEEEvSt12_Index_tupleIIXspT_EEE
    @     0x7fc6828dd5ee _ZNSt12_Bind_simpleIFZN7process14ProcessManager12init_threadsEvEUt_vEEclEv
    @     0x7fc6828dd578 _ZNSt6thread5_ImplISt12_Bind_simpleIFZN7process14ProcessManager12init_threadsEvEUt_vEEE6_M_runEv
    @     0x7fc67c0c0230 (unknown)
    @     0x7fc67c727dc5 start_thread
    @     0x7fc67b82973d __clone
make[4]: *** [check-local] Segmentation fault (core dumped)
make[4]: Leaving directory `/mesos/mesos-1.2.1/_build/src'
make[3]: *** [check-am] Error 2
make[3]: Leaving directory `/mesos/mesos-1.2.1/_build/src'
make[2]: *** [check] Error 2
make[2]: Leaving directory `/mesos/mesos-1.2.1/_build/src'
make[1]: *** [check-recursive] Error 1
make[1]: Leaving directory `/mesos/mesos-1.2.1/_build'
make: *** [distcheck] Error 1
+ docker rmi mesos-1494430991-5447
Untagged: mesos-1494430991-5447:latest
Deleted: sha256:057809444a6179d45c84dff21d8e3e7488a2b17773c2bad3fb4ac52c1c26ddaa
Deleted: sha256:6e501d53412b1e114215f5eac197ad0232145a80297d71080bad7a08a47beb6f
Deleted: sha256:f5902cbf68dfa5f1e49a772b6407cdcca3ab8a4c56dfbab63a603c33d917b07a
Deleted: sha256:b41813b6f34d0cbec2d61fa675d5acb313062821875f6c5912e40bf66ecd0b13
Deleted: sha256:099b559962e9fcaf46d17a97574279737a0babf52ff9f93a200437b9d689845d
Deleted: sha256:adc714063ae2cb4697d48a12a071a0096dca8cbcb5eb8265ba271aa70371bf4c
Deleted: sha256:03c2bb868e346d38a703a2750f3da4a4e17e6180325af94681c088e53031182e
Deleted: sha256:e8b14e26053278a4fb0ee8a1a33e68517bebcf385d11263c487b9ff1bb90de3f
Deleted: sha256:69ce8c73cb65849d8889d2958651e1830aa6426ca3d561ed86d7821f2f79e8b7
Deleted: sha256:26e8abfff4b8b0167df002c94b4c8c7a82873e25b3815b786ddb7b5e448e67fd
Deleted: sha256:7ce6f9b4add78b893d3a319fdfc2298d3492ace32d547d45763eedbbb18a0e1e
Deleted: sha256:125ce3acc50849eebb189457282e07e1bbc1a7f405400992219e3dc91b79758a
Deleted: sha256:f20939e8996416f60e01d39fb6152fb832ff74af3b48a50a732a91178c9eed24
Deleted: sha256:b1ca1dc740d91da8672cb19f827b93aece4a640e28ef99e4608a1387ed42453e
Deleted: sha256:5d6580d0f5e7618f32bd9058df5f61dc23c310c3d67f0efe87683a0722a64b97
Deleted: sha256:21caf64b04d86050b2d8495fbc9e2f07cc13d73fc05283f32d83da348250b685
Deleted: sha256:6b18e9fdf33a8445b22dd197a93b2f9a5e69c37591189a256799edf6192a39e4
Deleted: sha256:10aff49ce12eea1c1264fdc62cb72205f85a83f9610a07a2cabf2a0bbbb994c6
Deleted: sha256:9c9115c7cdb817597a69af934eafe68d9495d3bc35f00db09fedff90d3782833
Deleted: sha256:28b17a94acee035d17b77c9109a4de15cd558c22893eaa585863984d2267ff81
Deleted: sha256:e1ff00def18f56eea6d2ba23d629b6295df97f72c1ba83163915eabc3439464a
Deleted: sha256:818e5161747023d077a306d2102c6a09c3fcd92f8d6f803a10e8a2040bdfafbf
Deleted: sha256:9fc8b5af0f413fb4915c1986fd4329ec2e9d9278d0966307daaa994d16198f75
Deleted: sha256:622235769d78c0f64e2d6bb611cef438942136ad56cd57ce6d003e3a86b6ff0e
Deleted: sha256:a6578e1b9ce0f94266d5d7f7f49a95a02f169b61c7e3faf54898d3f819c36e23
Build step 'Execute shell' marked build as failure

Mime
View raw message