mesos-builds mailing list archives

Site index · List index
Message view « Date » · « Thread »
Top « Date » · « Thread »
From Apache Jenkins Server <jenk...@builds.apache.org>
Subject Build failed in Jenkins: Mesos-Buildbot » autotools,gcc,--verbose,GLOG_v=1 MESOS_VERBOSE=1,centos:7,(docker||Hadoop)&&(!ubuntu-us1)&&(!ubuntu-eu2) #3609
Date Thu, 04 May 2017 22:09:55 GMT
See <https://builds.apache.org/job/Mesos-Buildbot/BUILDTOOL=autotools,COMPILER=gcc,CONFIGURATION=--verbose,ENVIRONMENT=GLOG_v=1%20MESOS_VERBOSE=1,OS=centos%3A7,label_exp=(docker%7C%7CHadoop)&&(!ubuntu-us1)&&(!ubuntu-eu2)/3609/display/redirect?page=changes>

Changes:

[mpark] Fixed a minor bug in setting the agent's `totalResources`.

------------------------------------------
[...truncated 26.94 MB...]
I0504 22:09:46.791398 31667 containerizer.cpp:221] Using isolation: posix/cpu,posix/mem,filesystem/posix,network/cni
W0504 22:09:46.792042 31667 backend.cpp:76] Failed to create 'aufs' backend: AufsBackend requires
root privileges
W0504 22:09:46.792160 31667 backend.cpp:76] Failed to create 'bind' backend: BindBackend requires
root privileges
I0504 22:09:46.792201 31667 provisioner.cpp:249] Using default backend 'copy'
I0504 22:09:46.795848 31687 slave.cpp:225] Mesos agent started on (744)@172.17.0.3:57871
I0504 22:09:46.795881 31687 slave.cpp:226] Flags at startup: --acls="" --appc_simple_discovery_uri_prefix="http://"
--appc_store_dir="/tmp/mesos/store/appc" --authenticate_http_readonly="true" --authenticate_http_readwrite="true"
--authenticatee="crammd5" --authentication_backoff_factor="1secs" --authorizer="local" --cgroups_cpu_enable_pids_and_tids_count="false"
--cgroups_enable_cfs="false" --cgroups_hierarchy="/sys/fs/cgroup" --cgroups_limit_swap="false"
--cgroups_root="mesos" --container_disk_watch_interval="15secs" --containerizers="mesos" --credential="/tmp/Endpoint_SlaveEndpointTest_AuthorizedRequest_2_IOrbzk/credential"
--default_role="*" --disk_watch_interval="1mins" --docker="docker" --docker_kill_orphans="true"
--docker_registry="https://registry-1.docker.io" --docker_remove_delay="6hrs" --docker_socket="/var/run/docker.sock"
--docker_stop_timeout="0ns" --docker_store_dir="/tmp/mesos/store/docker" --docker_volume_checkpoint_dir="/var/run/mesos/isolators/docker/volume"
--enforce_container_disk_quota="false" --executor_registration_timeout="1mins" --executor_shutdown_grace_period="5secs"
--fetcher_cache_dir="/tmp/Endpoint_SlaveEndpointTest_AuthorizedRequest_2_IOrbzk/fetch" --fetcher_cache_size="2GB"
--frameworks_home="" --gc_delay="1weeks" --gc_disk_headroom="0.1" --hadoop_home="" --help="false"
--hostname_lookup="true" --http_command_executor="false" --http_credentials="/tmp/Endpoint_SlaveEndpointTest_AuthorizedRequest_2_IOrbzk/http_credentials"
--http_heartbeat_interval="30secs" --initialize_driver_logging="true" --isolation="posix/cpu,posix/mem"
--launcher="posix" --launcher_dir="/mesos/mesos-1.4.0/_build/src" --logbufsecs="0" --logging_level="INFO"
--max_completed_executors_per_framework="150" --oversubscribed_resources_interval="15secs"
--perf_duration="10secs" --perf_interval="1mins" --port="5051" --qos_correction_interval_min="0ns"
--quiet="false" --recover="reconnect" --recovery_timeout="15mins" --registration_backoff_factor="10ms"
--resources="cpus:2;gpus:0;mem:1024;disk:1024;ports:[31000-32000]" --revocable_cpu_low_priority="true"
--runtime_dir="/tmp/Endpoint_SlaveEndpointTest_AuthorizedRequest_2_IOrbzk" --sandbox_directory="/mnt/mesos/sandbox"
--strict="true" --switch_user="true" --systemd_enable_support="true" --systemd_runtime_directory="/run/systemd/system"
--version="false" --work_dir="/tmp/Endpoint_SlaveEndpointTest_AuthorizedRequest_2_jAKEpz"
I0504 22:09:46.796360 31687 credentials.hpp:86] Loading credential for authentication from
'/tmp/Endpoint_SlaveEndpointTest_AuthorizedRequest_2_IOrbzk/credential'
I0504 22:09:46.796542 31687 slave.cpp:258] Agent using credential for: test-principal
I0504 22:09:46.796571 31687 credentials.hpp:37] Loading credentials for authentication from
'/tmp/Endpoint_SlaveEndpointTest_AuthorizedRequest_2_IOrbzk/http_credentials'
I0504 22:09:46.796851 31687 http.cpp:975] Creating default 'basic' HTTP authenticator for
realm 'mesos-agent-readonly'
I0504 22:09:46.797029 31687 http.cpp:975] Creating default 'basic' HTTP authenticator for
realm 'mesos-agent-readwrite'
I0504 22:09:46.798705 31687 slave.cpp:525] Agent resources: cpus(*):2; mem(*):1024; disk(*):1024;
ports(*):[31000-32000]
I0504 22:09:46.798804 31687 slave.cpp:533] Agent attributes: [  ]
I0504 22:09:46.798821 31687 slave.cpp:538] Agent hostname: 4cd6e6537ccb
I0504 22:09:46.798979 31691 status_update_manager.cpp:177] Pausing sending status updates
I0504 22:09:46.800510 31701 state.cpp:62] Recovering state from '/tmp/Endpoint_SlaveEndpointTest_AuthorizedRequest_2_jAKEpz/meta'
I0504 22:09:46.800834 31700 status_update_manager.cpp:203] Recovering status update manager
I0504 22:09:46.801095 31698 containerizer.cpp:608] Recovering containerizer
I0504 22:09:46.802757 31692 provisioner.cpp:410] Provisioner recovery complete
I0504 22:09:46.803267 31698 slave.cpp:5963] Finished recovery
I0504 22:09:46.803848 31698 slave.cpp:6145] Querying resource estimator for oversubscribable
resources
I0504 22:09:46.804146 31693 slave.cpp:6159] Received oversubscribable resources {} from the
resource estimator
I0504 22:09:46.807492 31693 process.cpp:3730] Handling HTTP event for process 'slave(744)'
with path: '/slave(744)/containers'
I0504 22:09:46.808898 31695 http.cpp:1115] HTTP GET for /slave(744)/containers from 172.17.0.3:38155
I0504 22:09:46.808990 31695 http.cpp:936] Authorizing principal 'test-principal' to GET the
'/containers' endpoint
I0504 22:09:46.813498 31686 slave.cpp:790] Agent terminating
[       OK ] Endpoint/SlaveEndpointTest.AuthorizedRequest/2 (33 ms)
[ RUN      ] Endpoint/SlaveEndpointTest.UnauthorizedRequest/0
I0504 22:09:46.822966 31667 containerizer.cpp:221] Using isolation: posix/cpu,posix/mem,filesystem/posix,network/cni
W0504 22:09:46.823462 31667 backend.cpp:76] Failed to create 'aufs' backend: AufsBackend requires
root privileges
W0504 22:09:46.823570 31667 backend.cpp:76] Failed to create 'bind' backend: BindBackend requires
root privileges
I0504 22:09:46.823604 31667 provisioner.cpp:249] Using default backend 'copy'
I0504 22:09:46.827548 31692 slave.cpp:225] Mesos agent started on (745)@172.17.0.3:57871
I0504 22:09:46.827581 31692 slave.cpp:226] Flags at startup: --acls="" --appc_simple_discovery_uri_prefix="http://"
--appc_store_dir="/tmp/mesos/store/appc" --authenticate_http_readonly="true" --authenticate_http_readwrite="true"
--authenticatee="crammd5" --authentication_backoff_factor="1secs" --authorizer="local" --cgroups_cpu_enable_pids_and_tids_count="false"
--cgroups_enable_cfs="false" --cgroups_hierarchy="/sys/fs/cgroup" --cgroups_limit_swap="false"
--cgroups_root="mesos" --container_disk_watch_interval="15secs" --containerizers="mesos" --credential="/tmp/Endpoint_SlaveEndpointTest_UnauthorizedRequest_0_mDcbtn/credential"
--default_role="*" --disk_watch_interval="1mins" --docker="docker" --docker_kill_orphans="true"
--docker_registry="https://registry-1.docker.io" --docker_remove_delay="6hrs" --docker_socket="/var/run/docker.sock"
--docker_stop_timeout="0ns" --docker_store_dir="/tmp/mesos/store/docker" --docker_volume_checkpoint_dir="/var/run/mesos/isolators/docker/volume"
--enforce_container_disk_quota="false" --executor_registration_timeout="1mins" --executor_shutdown_grace_period="5secs"
--fetcher_cache_dir="/tmp/Endpoint_SlaveEndpointTest_UnauthorizedRequest_0_mDcbtn/fetch" --fetcher_cache_size="2GB"
--frameworks_home="" --gc_delay="1weeks" --gc_disk_headroom="0.1" --hadoop_home="" --help="false"
--hostname_lookup="true" --http_command_executor="false" --http_credentials="/tmp/Endpoint_SlaveEndpointTest_UnauthorizedRequest_0_mDcbtn/http_credentials"
--http_heartbeat_interval="30secs" --initialize_driver_logging="true" --isolation="posix/cpu,posix/mem"
--launcher="posix" --launcher_dir="/mesos/mesos-1.4.0/_build/src" --logbufsecs="0" --logging_level="INFO"
--max_completed_executors_per_framework="150" --oversubscribed_resources_interval="15secs"
--perf_duration="10secs" --perf_interval="1mins" --port="5051" --qos_correction_interval_min="0ns"
--quiet="false" --recover="reconnect" --recovery_timeout="15mins" --registration_backoff_factor="10ms"
--resources="cpus:2;gpus:0;mem:1024;disk:1024;ports:[31000-32000]" --revocable_cpu_low_priority="true"
--runtime_dir="/tmp/Endpoint_SlaveEndpointTest_UnauthorizedRequest_0_mDcbtn" --sandbox_directory="/mnt/mesos/sandbox"
--strict="true" --switch_user="true" --systemd_enable_support="true" --systemd_runtime_directory="/run/systemd/system"
--version="false" --work_dir="/tmp/Endpoint_SlaveEndpointTest_UnauthorizedRequest_0_Bo3oeC"
I0504 22:09:46.828119 31692 credentials.hpp:86] Loading credential for authentication from
'/tmp/Endpoint_SlaveEndpointTest_UnauthorizedRequest_0_mDcbtn/credential'
I0504 22:09:46.828294 31692 slave.cpp:258] Agent using credential for: test-principal
I0504 22:09:46.828321 31692 credentials.hpp:37] Loading credentials for authentication from
'/tmp/Endpoint_SlaveEndpointTest_UnauthorizedRequest_0_mDcbtn/http_credentials'
I0504 22:09:46.828596 31692 http.cpp:975] Creating default 'basic' HTTP authenticator for
realm 'mesos-agent-readonly'
I0504 22:09:46.828749 31692 http.cpp:975] Creating default 'basic' HTTP authenticator for
realm 'mesos-agent-readwrite'
I0504 22:09:46.830406 31692 slave.cpp:525] Agent resources: cpus(*):2; mem(*):1024; disk(*):1024;
ports(*):[31000-32000]
I0504 22:09:46.830505 31692 slave.cpp:533] Agent attributes: [  ]
I0504 22:09:46.830523 31692 slave.cpp:538] Agent hostname: 4cd6e6537ccb
I0504 22:09:46.830696 31690 status_update_manager.cpp:177] Pausing sending status updates
I0504 22:09:46.832283 31694 state.cpp:62] Recovering state from '/tmp/Endpoint_SlaveEndpointTest_UnauthorizedRequest_0_Bo3oeC/meta'
I0504 22:09:46.832629 31696 status_update_manager.cpp:203] Recovering status update manager
I0504 22:09:46.832914 31699 containerizer.cpp:608] Recovering containerizer
I0504 22:09:46.834512 31698 provisioner.cpp:410] Provisioner recovery complete
I0504 22:09:46.835032 31691 slave.cpp:5963] Finished recovery
I0504 22:09:46.835635 31691 slave.cpp:6145] Querying resource estimator for oversubscribable
resources
I0504 22:09:46.835906 31696 slave.cpp:6159] Received oversubscribable resources {} from the
resource estimator
I0504 22:09:46.839414 31695 process.cpp:3730] Handling HTTP event for process 'slave(745)'
with path: '/slave(745)/monitor/statistics'
I0504 22:09:46.840908 31688 http.cpp:1115] HTTP GET for /slave(745)/monitor/statistics from
172.17.0.3:38156
I0504 22:09:46.840999 31688 http.cpp:936] Authorizing principal 'test-principal' to GET the
'/monitor/statistics' endpoint
I0504 22:09:46.844161 31693 slave.cpp:790] Agent terminating
[       OK ] Endpoint/SlaveEndpointTest.UnauthorizedRequest/0 (31 ms)
[ RUN      ] Endpoint/SlaveEndpointTest.UnauthorizedRequest/1
I0504 22:09:46.855826 31667 containerizer.cpp:221] Using isolation: posix/cpu,posix/mem,filesystem/posix,network/cni
W0504 22:09:46.856520 31667 backend.cpp:76] Failed to create 'aufs' backend: AufsBackend requires
root privileges
W0504 22:09:46.856637 31667 backend.cpp:76] Failed to create 'bind' backend: BindBackend requires
root privileges
I0504 22:09:46.856678 31667 provisioner.cpp:249] Using default backend 'copy'
I0504 22:09:46.859700 31686 slave.cpp:225] Mesos agent started on (746)@172.17.0.3:57871
I0504 22:09:46.859721 31686 slave.cpp:226] Flags at startup: --acls="" --appc_simple_discovery_uri_prefix="http://"
--appc_store_dir="/tmp/mesos/store/appc" --authenticate_http_readonly="true" --authenticate_http_readwrite="true"
--authenticatee="crammd5" --authentication_backoff_factor="1secs" --authorizer="local" --cgroups_cpu_enable_pids_and_tids_count="false"
--cgroups_enable_cfs="false" --cgroups_hierarchy="/sys/fs/cgroup" --cgroups_limit_swap="false"
--cgroups_root="mesos" --container_disk_watch_interval="15secs" --containerizers="mesos" --credential="/tmp/Endpoint_SlaveEndpointTest_UnauthorizedRequest_1_4zTVHq/credential"
--default_role="*" --disk_watch_interval="1mins" --docker="docker" --docker_kill_orphans="true"
--docker_registry="https://registry-1.docker.io" --docker_remove_delay="6hrs" --docker_socket="/var/run/docker.sock"
--docker_stop_timeout="0ns" --docker_store_dir="/tmp/mesos/store/docker" --docker_volume_checkpoint_dir="/var/run/mesos/isolators/docker/volume"
--enforce_container_disk_quota="false" --executor_registration_timeout="1mins" --executor_shutdown_grace_period="5secs"
--fetcher_cache_dir="/tmp/Endpoint_SlaveEndpointTest_UnauthorizedRequest_1_4zTVHq/fetch" --fetcher_cache_size="2GB"
--frameworks_home="" --gc_delay="1weeks" --gc_disk_headroom="0.1" --hadoop_home="" --help="false"
--hostname_lookup="true" --http_command_executor="false" --http_credentials="/tmp/Endpoint_SlaveEndpointTest_UnauthorizedRequest_1_4zTVHq/http_credentials"
--http_heartbeat_interval="30secs" --initialize_driver_logging="true" --isolation="posix/cpu,posix/mem"
--launcher="posix" --launcher_dir="/mesos/mesos-1.4.0/_build/src" --logbufsecs="0" --logging_level="INFO"
--max_completed_executors_per_framework="150" --oversubscribed_resources_interval="15secs"
--perf_duration="10secs" --perf_interval="1mins" --port="5051" --qos_correction_interval_min="0ns"
--quiet="false" --recover="reconnect" --recovery_timeout="15mins" --registration_backoff_factor="10ms"
--resources="cpus:2;gpus:0;mem:1024;disk:1024;ports:[31000-32000]" --revocable_cpu_low_priority="true"
--runtime_dir="/tmp/Endpoint_SlaveEndpointTest_UnauthorizedRequest_1_4zTVHq" --sandbox_directory="/mnt/mesos/sandbox"
--strict="true" --switch_user="true" --systemd_enable_support="true" --systemd_runtime_directory="/run/systemd/system"
--version="false" --work_dir="/tmp/Endpoint_SlaveEndpointTest_UnauthorizedRequest_1_LvJVnF"
I0504 22:09:46.860107 31686 credentials.hpp:86] Loading credential for authentication from
'/tmp/Endpoint_SlaveEndpointTest_UnauthorizedRequest_1_4zTVHq/credential'
I0504 22:09:46.860268 31686 slave.cpp:258] Agent using credential for: test-principal
I0504 22:09:46.860290 31686 credentials.hpp:37] Loading credentials for authentication from
'/tmp/Endpoint_SlaveEndpointTest_UnauthorizedRequest_1_4zTVHq/http_credentials'
I0504 22:09:46.860560 31686 http.cpp:975] Creating default 'basic' HTTP authenticator for
realm 'mesos-agent-readonly'
I0504 22:09:46.860680 31686 http.cpp:975] Creating default 'basic' HTTP authenticator for
realm 'mesos-agent-readwrite'
I0504 22:09:46.862032 31686 slave.cpp:525] Agent resources: cpus(*):2; mem(*):1024; disk(*):1024;
ports(*):[31000-32000]
I0504 22:09:46.862133 31686 slave.cpp:533] Agent attributes: [  ]
I0504 22:09:46.862148 31686 slave.cpp:538] Agent hostname: 4cd6e6537ccb
I0504 22:09:46.862320 31690 status_update_manager.cpp:177] Pausing sending status updates
I0504 22:09:46.863754 31694 state.cpp:62] Recovering state from '/tmp/Endpoint_SlaveEndpointTest_UnauthorizedRequest_1_LvJVnF/meta'
I0504 22:09:46.864354 31697 status_update_manager.cpp:203] Recovering status update manager
I0504 22:09:46.864691 31694 containerizer.cpp:608] Recovering containerizer
I0504 22:09:46.866313 31698 provisioner.cpp:410] Provisioner recovery complete
I0504 22:09:46.866928 31691 slave.cpp:5963] Finished recovery
I0504 22:09:46.867535 31691 slave.cpp:6145] Querying resource estimator for oversubscribable
resources
I0504 22:09:46.867852 31699 slave.cpp:6159] Received oversubscribable resources {} from the
resource estimator
I0504 22:09:46.871119 31692 process.cpp:3730] Handling HTTP event for process 'slave(746)'
with path: '/slave(746)/monitor/statistics.json'
I0504 22:09:46.872534 31689 http.cpp:1115] HTTP GET for /slave(746)/monitor/statistics.json
from 172.17.0.3:38157
I0504 22:09:46.872609 31689 http.cpp:936] Authorizing principal 'test-principal' to GET the
'/monitor/statistics.json' endpoint
I0504 22:09:46.875627 31686 slave.cpp:790] Agent terminating
[       OK ] Endpoint/SlaveEndpointTest.UnauthorizedRequest/1 (30 ms)
[ RUN      ] Endpoint/SlaveEndpointTest.UnauthorizedRequest/2
I0504 22:09:46.886796 31667 containerizer.cpp:221] Using isolation: posix/cpu,posix/mem,filesystem/posix,network/cni
W0504 22:09:46.887465 31667 backend.cpp:76] Failed to create 'aufs' backend: AufsBackend requires
root privileges
W0504 22:09:46.887578 31667 backend.cpp:76] Failed to create 'bind' backend: BindBackend requires
root privileges
I0504 22:09:46.887617 31667 provisioner.cpp:249] Using default backend 'copy'
I0504 22:09:46.891969 31697 slave.cpp:225] Mesos agent started on (747)@172.17.0.3:57871
I0504 22:09:46.892000 31697 slave.cpp:226] Flags at startup: --acls="" --appc_simple_discovery_uri_prefix="http://"
--appc_store_dir="/tmp/mesos/store/appc" --authenticate_http_readonly="true" --authenticate_http_readwrite="true"
--authenticatee="crammd5" --authentication_backoff_factor="1secs" --authorizer="local" --cgroups_cpu_enable_pids_and_tids_count="false"
--cgroups_enable_cfs="false" --cgroups_hierarchy="/sys/fs/cgroup" --cgroups_limit_swap="false"
--cgroups_root="mesos" --container_disk_watch_interval="15secs" --containerizers="mesos" --credential="/tmp/Endpoint_SlaveEndpointTest_UnauthorizedRequest_2_Kie1gu/credential"
--default_role="*" --disk_watch_interval="1mins" --docker="docker" --docker_kill_orphans="true"
--docker_registry="https://registry-1.docker.io" --docker_remove_delay="6hrs" --docker_socket="/var/run/docker.sock"
--docker_stop_timeout="0ns" --docker_store_dir="/tmp/mesos/store/docker" --docker_volume_checkpoint_dir="/var/run/mesos/isolators/docker/volume"
--enforce_container_disk_quota="false" --executor_registration_timeout="1mins" --executor_shutdown_grace_period="5secs"
--fetcher_cache_dir="/tmp/Endpoint_SlaveEndpointTest_UnauthorizedRequest_2_Kie1gu/fetch" --fetcher_cache_size="2GB"
--frameworks_home="" --gc_delay="1weeks" --gc_disk_headroom="0.1" --hadoop_home="" --help="false"
--hostname_lookup="true" --http_command_executor="false" --http_credentials="/tmp/Endpoint_SlaveEndpointTest_UnauthorizedRequest_2_Kie1gu/http_credentials"
--http_heartbeat_interval="30secs" --initialize_driver_logging="true" --isolation="posix/cpu,posix/mem"
--launcher="posix" --launcher_dir="/mesos/mesos-1.4.0/_build/src" --logbufsecs="0" --logging_level="INFO"
--max_completed_executors_per_framework="150" --oversubscribed_resources_interval="15secs"
--perf_duration="10secs" --perf_interval="1mins" --port="5051" --qos_correction_interval_min="0ns"
--quiet="false" --recover="reconnect" --recovery_timeout="15mins" --registration_backoff_factor="10ms"
--resources="cpus:2;gpus:0;mem:1024;disk:1024;ports:[31000-32000]" --revocable_cpu_low_priority="true"
--runtime_dir="/tmp/Endpoint_SlaveEndpointTest_UnauthorizedRequest_2_Kie1gu" --sandbox_directory="/mnt/mesos/sandbox"
--strict="true" --switch_user="true" --systemd_enable_support="true" --systemd_runtime_directory="/run/systemd/system"
--version="false" --work_dir="/tmp/Endpoint_SlaveEndpointTest_UnauthorizedRequest_2_lqhYRI"
I0504 22:09:46.892518 31697 credentials.hpp:86] Loading credential for authentication from
'/tmp/Endpoint_SlaveEndpointTest_UnauthorizedRequest_2_Kie1gu/credential'
I0504 22:09:46.892683 31697 slave.cpp:258] Agent using credential for: test-principal
I0504 22:09:46.892709 31697 credentials.hpp:37] Loading credentials for authentication from
'/tmp/Endpoint_SlaveEndpointTest_UnauthorizedRequest_2_Kie1gu/http_credentials'
I0504 22:09:46.893024 31697 http.cpp:975] Creating default 'basic' HTTP authenticator for
realm 'mesos-agent-readonly'
I0504 22:09:46.893182 31697 http.cpp:975] Creating default 'basic' HTTP authenticator for
realm 'mesos-agent-readwrite'
I0504 22:09:46.894932 31697 slave.cpp:525] Agent resources: cpus(*):2; mem(*):1024; disk(*):1024;
ports(*):[31000-32000]
I0504 22:09:46.895032 31697 slave.cpp:533] Agent attributes: [  ]
I0504 22:09:46.895048 31697 slave.cpp:538] Agent hostname: 4cd6e6537ccb
I0504 22:09:46.895227 31698 status_update_manager.cpp:177] Pausing sending status updates
I0504 22:09:46.896845 31696 state.cpp:62] Recovering state from '/tmp/Endpoint_SlaveEndpointTest_UnauthorizedRequest_2_lqhYRI/meta'
I0504 22:09:46.897435 31693 status_update_manager.cpp:203] Recovering status update manager
I0504 22:09:46.897796 31699 containerizer.cpp:608] Recovering containerizer
I0504 22:09:46.899344 31688 provisioner.cpp:410] Provisioner recovery complete
I0504 22:09:46.899919 31695 slave.cpp:5963] Finished recovery
I0504 22:09:46.900434 31695 slave.cpp:6145] Querying resource estimator for oversubscribable
resources
I0504 22:09:46.900784 31701 slave.cpp:6159] Received oversubscribable resources {} from the
resource estimator
I0504 22:09:46.903722 31699 process.cpp:3730] Handling HTTP event for process 'slave(747)'
with path: '/slave(747)/containers'
I0504 22:09:46.905593 31686 http.cpp:1115] HTTP GET for /slave(747)/containers from 172.17.0.3:38158
I0504 22:09:46.905684 31686 http.cpp:936] Authorizing principal 'test-principal' to GET the
'/containers' endpoint
I0504 22:09:46.908386 31698 slave.cpp:790] Agent terminating
[       OK ] Endpoint/SlaveEndpointTest.UnauthorizedRequest/2 (32 ms)
[ RUN      ] Endpoint/SlaveEndpointTest.NoAuthorizer/0
I0504 22:09:46.918608 31667 containerizer.cpp:221] Using isolation: posix/cpu,posix/mem,filesystem/posix,network/cni
W0504 22:09:46.919111 31667 backend.cpp:76] Failed to create 'aufs' backend: AufsBackend requires
root privileges
W0504 22:09:46.919216 31667 backend.cpp:76] Failed to create 'bind' backend: BindBackend requires
root privileges
I0504 22:09:46.919260 31667 provisioner.cpp:249] Using default backend 'copy'
I0504 22:09:46.920769 31667 cluster.cpp:448] Creating default 'local' authorizer
I0504 22:09:46.922339 31692 slave.cpp:225] Mesos agent started on (748)@172.17.0.3:57871
I0504 22:09:46.922363 31692 slave.cpp:226] Flags at startup: --acls="" --appc_simple_discovery_uri_prefix="http://"
--appc_store_dir="/tmp/mesos/store/appc" --authenticate_http_readonly="true" --authenticate_http_readwrite="true"
--authenticatee="crammd5" --authentication_backoff_factor="1secs" --authorizer="local" --cgroups_cpu_enable_pids_and_tids_count="false"
--cgroups_enable_cfs="false" --cgroups_hierarchy="/sys/fs/cgroup" --cgroups_limit_swap="false"
--cgroups_root="mesos" --container_disk_watch_interval="15secs" --containerizers="mesos" --credential="/tmp/Endpoint_SlaveEndpointTest_NoAuthorizer_0_Xy1cby/credential"
--default_role="*" --disk_watch_interval="1mins" --docker="docker" --docker_kill_orphans="true"
--docker_registry="https://registry-1.docker.io" --docker_remove_delay="6hrs" --docker_socket="/var/run/docker.sock"
--docker_stop_timeout="0ns" --docker_store_dir="/tmp/mesos/store/docker" --docker_volume_checkpoint_dir="/var/run/mesos/isolators/docker/volume"
--enforce_container_disk_quota="false" --executor_registration_timeout="1mins" --executor_shutdown_grace_period="5secs"
--fetcher_cache_dir="/tmp/Endpoint_SlaveEndpointTest_NoAuthorizer_0_Xy1cby/fetch" --fetcher_cache_size="2GB"
--frameworks_home="" --gc_delay="1weeks" --gc_disk_headroom="0.1" --hadoop_home="" --help="false"
--hostname_lookup="true" --http_command_executor="false" --http_credentials="/tmp/Endpoint_SlaveEndpointTest_NoAuthorizer_0_Xy1cby/http_credentials"
--http_heartbeat_interval="30secs" --initialize_driver_logging="true" --isolation="posix/cpu,posix/mem"
--launcher="posix" --launcher_dir="/mesos/mesos-1.4.0/_build/src" --logbufsecs="0" --logging_level="INFO"
--max_completed_executors_per_framework="150" --oversubscribed_resources_interval="15secs"
--perf_duration="10secs" --perf_interval="1mins" --port="5051" --qos_correction_interval_min="0ns"
--quiet="false" --recover="reconnect" --recovery_timeout="15mins" --registration_backoff_factor="10ms"
--resources="cpus:2;gpus:0;mem:1024;disk:1024;ports:[31000-32000]" --revocable_cpu_low_priority="true"
--runtime_dir="/tmp/Endpoint_SlaveEndpointTest_NoAuthorizer_0_Xy1cby" --sandbox_directory="/mnt/mesos/sandbox"
--strict="true" --switch_user="true" --systemd_enable_support="true" --systemd_runtime_directory="/run/systemd/system"
--version="false" --work_dir="/tmp/Endpoint_SlaveEndpointTest_NoAuthorizer_0_qI5VGM"
I0504 22:09:46.922688 31692 credentials.hpp:86] Loading credential for authentication from
'/tmp/Endpoint_SlaveEndpointTest_NoAuthorizer_0_Xy1cby/credential'
I0504 22:09:46.922859 31692 slave.cpp:258] Agent using credential for: test-principal
I0504 22:09:46.922881 31692 credentials.hpp:37] Loading credentials for authentication from
'/tmp/Endpoint_SlaveEndpointTest_NoAuthorizer_0_Xy1cby/http_credentials'
I0504 22:09:46.923146 31692 http.cpp:975] Creating default 'basic' HTTP authenticator for
realm 'mesos-agent-readonly'
I0504 22:09:46.923302 31692 http.cpp:975] Creating default 'basic' HTTP authenticator for
realm 'mesos-agent-readwrite'
I0504 22:09:46.924568 31692 slave.cpp:525] Agent resources: cpus(*):2; mem(*):1024; disk(*):1024;
ports(*):[31000-32000]
I0504 22:09:46.924643 31692 slave.cpp:533] Agent attributes: [  ]
I0504 22:09:46.924655 31692 slave.cpp:538] Agent hostname: 4cd6e6537ccb
I0504 22:09:46.924851 31699 status_update_manager.cpp:177] Pausing sending status updates
I0504 22:09:46.926388 31699 state.cpp:62] Recovering state from '/tmp/Endpoint_SlaveEndpointTest_NoAuthorizer_0_qI5VGM/meta'
I0504 22:09:46.926821 31693 status_update_manager.cpp:203] Recovering status update manager
I0504 22:09:46.927204 31700 containerizer.cpp:608] Recovering containerizer
I0504 22:09:46.928967 31691 provisioner.cpp:410] Provisioner recovery complete
I0504 22:09:46.929477 31694 slave.cpp:5963] Finished recovery
I0504 22:09:46.930090 31694 slave.cpp:6145] Querying resource estimator for oversubscribable
resources
I0504 22:09:46.930449 31692 slave.cpp:6159] Received oversubscribable resources {} from the
resource estimator
I0504 22:09:46.933379 31692 process.cpp:3730] Handling HTTP event for process 'slave(748)'
with path: '/slave(748)/monitor/statistics'
I0504 22:09:46.934736 31689 http.cpp:1115] HTTP GET for /slave(748)/monitor/statistics from
172.17.0.3:38159
I0504 22:09:46.934808 31689 http.cpp:936] Authorizing principal 'test-principal' to GET the
'/monitor/statistics' endpoint
I0504 22:09:46.938532 31686 slave.cpp:790] Agent terminating
[       OK ] Endpoint/SlaveEndpointTest.NoAuthorizer/0 (28 ms)
[ RUN      ] Endpoint/SlaveEndpointTest.NoAuthorizer/1
I0504 22:09:46.950299 31667 containerizer.cpp:221] Using isolation: posix/cpu,posix/mem,filesystem/posix,network/cni
W0504 22:09:46.950925 31667 backend.cpp:76] Failed to create 'aufs' backend: AufsBackend requires
root privileges
W0504 22:09:46.951098 31667 backend.cpp:76] Failed to create 'bind' backend: BindBackend requires
root privileges
I0504 22:09:46.951143 31667 provisioner.cpp:249] Using default backend 'copy'
I0504 22:09:46.953027 31667 cluster.cpp:448] Creating default 'local' authorizer
I0504 22:09:46.954704 31700 slave.cpp:225] Mesos agent started on (749)@172.17.0.3:57871
I0504 22:09:46.954751 31700 slave.cpp:226] Flags at startup: --acls="" --appc_simple_discovery_uri_prefix="http://"
--appc_store_dir="/tmp/mesos/store/appc" --authenticate_http_readonly="true" --authenticate_http_readwrite="true"
--authenticatee="crammd5" --authentication_backoff_factor="1secs" --authorizer="local" --cgroups_cpu_enable_pids_and_tids_count="false"
--cgroups_enable_cfs="false" --cgroups_hierarchy="/sys/fs/cgroup" --cgroups_limit_swap="false"
--cgroups_root="mesos" --container_disk_watch_interval="15secs" --containerizers="mesos" --credential="/tmp/Endpoint_SlaveEndpointTest_NoAuthorizer_1_JsChpC/credential"
--default_role="*" --disk_watch_interval="1mins" --docker="docker" --docker_kill_orphans="true"
--docker_registry="https://registry-1.docker.io" --docker_remove_delay="6hrs" --docker_socket="/var/run/docker.sock"
--docker_stop_timeout="0ns" --docker_store_dir="/tmp/mesos/store/docker" --docker_volume_checkpoint_dir="/var/run/mesos/isolators/docker/volume"
--enforce_container_disk_quota="false" --executor_registration_timeout="1mins" --executor_shutdown_grace_period="5secs"
--fetcher_cache_dir="/tmp/Endpoint_SlaveEndpointTest_NoAuthorizer_1_JsChpC/fetch" --fetcher_cache_size="2GB"
--frameworks_home="" --gc_delay="1weeks" --gc_disk_headroom="0.1" --hadoop_home="" --help="false"
--hostname_lookup="true" --http_command_executor="false" --http_credentials="/tmp/Endpoint_SlaveEndpointTest_NoAuthorizer_1_JsChpC/http_credentials"
--http_heartbeat_interval="30secs" --initialize_driver_logging="true" --isolation="posix/cpu,posix/mem"
--launcher="posix" --launcher_dir="/mesos/mesos-1.4.0/_build/src" --logbufsecs="0" --logging_level="INFO"
--max_completed_executors_per_framework="150" --oversubscribed_resources_interval="15secs"
--perf_duration="10secs" --perf_interval="1mins" --port="5051" --qos_correction_interval_min="0ns"
--quiet="false" --recover="reconnect" --recovery_timeout="15mins" --registration_backoff_factor="10ms"
--resources="cpus:2;gpus:0;mem:1024;disk:1024;ports:[31000-32000]" --revocable_cpu_low_priority="true"
--runtime_dir="/tmp/Endpoint_SlaveEndpointTest_NoAuthorizer_1_JsChpC" --sandbox_directory="/mnt/mesos/sandbox"
--strict="true" --switch_user="true" --systemd_enable_support="true" --systemd_runtime_directory="/run/systemd/system"
--version="false" --work_dir="/tmp/Endpoint_SlaveEndpointTest_NoAuthorizer_1_9k6XPQ"
I0504 22:09:46.955250 31700 credentials.hpp:86] Loading credential for authentication from
'/tmp/Endpoint_SlaveEndpointTest_NoAuthorizer_1_JsChpC/credential'
I0504 22:09:46.955417 31700 slave.cpp:258] Agent using credential for: test-principal
I0504 22:09:46.955437 31700 credentials.hpp:37] Loading credentials for authentication from
'/tmp/Endpoint_SlaveEndpointTest_NoAuthorizer_1_JsChpC/http_credentials'
I0504 22:09:46.955654 31700 http.cpp:975] Creating default 'basic' HTTP authenticator for
realm 'mesos-agent-readonly'
I0504 22:09:46.955799 31700 http.cpp:975] Creating default 'basic' HTTP authenticator for
realm 'mesos-agent-readwrite'
I0504 22:09:46.957427 31700 slave.cpp:525] Agent resources: cpus(*):2; mem(*):1024; disk(*):1024;
ports(*):[31000-32000]
I0504 22:09:46.957552 31700 slave.cpp:533] Agent attributes: [  ]
I0504 22:09:46.957572 31700 slave.cpp:538] Agent hostname: 4cd6e6537ccb
I0504 22:09:46.957756 31692 status_update_manager.cpp:177] Pausing sending status updates
I0504 22:09:46.959245 31691 state.cpp:62] Recovering state from '/tmp/Endpoint_SlaveEndpointTest_NoAuthorizer_1_9k6XPQ/meta'
I0504 22:09:46.959581 31688 status_update_manager.cpp:203] Recovering status update manager
I0504 22:09:46.959812 31691 containerizer.cpp:608] Recovering containerizer
I0504 22:09:46.960990 31689 provisioner.cpp:410] Provisioner recovery complete
I0504 22:09:46.961480 31699 slave.cpp:5963] Finished recovery
I0504 22:09:46.961979 31699 slave.cpp:6145] Querying resource estimator for oversubscribable
resources
I0504 22:09:46.962208 31695 slave.cpp:6159] Received oversubscribable resources {} from the
resource estimator
I0504 22:09:46.964622 31697 process.cpp:3730] Handling HTTP event for process 'slave(749)'
with path: '/slave(749)/monitor/statistics.json'
I0504 22:09:46.965888 31696 http.cpp:1115] HTTP GET for /slave(749)/monitor/statistics.json
from 172.17.0.3:38160
I0504 22:09:46.965989 31696 http.cpp:936] Authorizing principal 'test-principal' to GET the
'/monitor/statistics.json' endpoint
I0504 22:09:46.969580 31689 slave.cpp:790] Agent terminating
[       OK ] Endpoint/SlaveEndpointTest.NoAuthorizer/1 (30 ms)
[ RUN      ] Endpoint/SlaveEndpointTest.NoAuthorizer/2
I0504 22:09:46.981515 31667 containerizer.cpp:221] Using isolation: posix/cpu,posix/mem,filesystem/posix,network/cni
W0504 22:09:46.982151 31667 backend.cpp:76] Failed to create 'aufs' backend: AufsBackend requires
root privileges
W0504 22:09:46.982273 31667 backend.cpp:76] Failed to create 'bind' backend: BindBackend requires
root privileges
I0504 22:09:46.982319 31667 provisioner.cpp:249] Using default backend 'copy'
I0504 22:09:46.984099 31667 cluster.cpp:448] Creating default 'local' authorizer
I0504 22:09:46.986070 31691 slave.cpp:225] Mesos agent started on (750)@172.17.0.3:57871
I0504 22:09:46.986101 31691 slave.cpp:226] Flags at startup: --acls="" --appc_simple_discovery_uri_prefix="http://"
--appc_store_dir="/tmp/mesos/store/appc" --authenticate_http_readonly="true" --authenticate_http_readwrite="true"
--authenticatee="crammd5" --authentication_backoff_factor="1secs" --authorizer="local" --cgroups_cpu_enable_pids_and_tids_count="false"
--cgroups_enable_cfs="false" --cgroups_hierarchy="/sys/fs/cgroup" --cgroups_limit_swap="false"
--cgroups_root="mesos" --container_disk_watch_interval="15secs" --containerizers="mesos" --credential="/tmp/Endpoint_SlaveEndpointTest_NoAuthorizer_2_zvhdYG/credential"
--default_role="*" --disk_watch_interval="1mins" --docker="docker" --docker_kill_orphans="true"
--docker_registry="https://registry-1.docker.io" --docker_remove_delay="6hrs" --docker_socket="/var/run/docker.sock"
--docker_stop_timeout="0ns" --docker_store_dir="/tmp/mesos/store/docker" --docker_volume_checkpoint_dir="/var/run/mesos/isolators/docker/volume"
--enforce_container_disk_quota="false" --executor_registration_timeout="1mins" --executor_shutdown_grace_period="5secs"
--fetcher_cache_dir="/tmp/Endpoint_SlaveEndpointTest_NoAuthorizer_2_zvhdYG/fetch" --fetcher_cache_size="2GB"
--frameworks_home="" --gc_delay="1weeks" --gc_disk_headroom="0.1" --hadoop_home="" --help="false"
--hostname_lookup="true" --http_command_executor="false" --http_credentials="/tmp/Endpoint_SlaveEndpointTest_NoAuthorizer_2_zvhdYG/http_credentials"
--http_heartbeat_interval="30secs" --initialize_driver_logging="true" --isolation="posix/cpu,posix/mem"
--launcher="posix" --launcher_dir="/mesos/mesos-1.4.0/_build/src" --logbufsecs="0" --logging_level="INFO"
--max_completed_executors_per_framework="150" --oversubscribed_resources_interval="15secs"
--perf_duration="10secs" --perf_interval="1mins" --port="5051" --qos_correction_interval_min="0ns"
--quiet="false" --recover="reconnect" --recovery_timeout="15mins" --registration_backoff_factor="10ms"
--resources="cpus:2;gpus:0;mem:1024;disk:1024;ports:[31000-32000]" --revocable_cpu_low_priority="true"
--runtime_dir="/tmp/Endpoint_SlaveEndpointTest_NoAuthorizer_2_zvhdYG" --sandbox_directory="/mnt/mesos/sandbox"
--strict="true" --switch_user="true" --systemd_enable_support="true" --systemd_runtime_directory="/run/systemd/system"
--version="false" --work_dir="/tmp/Endpoint_SlaveEndpointTest_NoAuthorizer_2_WPbIjV"
I0504 22:09:46.986670 31691 credentials.hpp:86] Loading credential for authentication from
'/tmp/Endpoint_SlaveEndpointTest_NoAuthorizer_2_zvhdYG/credential'
I0504 22:09:46.986860 31691 slave.cpp:258] Agent using credential for: test-principal
I0504 22:09:46.986891 31691 credentials.hpp:37] Loading credentials for authentication from
'/tmp/Endpoint_SlaveEndpointTest_NoAuthorizer_2_zvhdYG/http_credentials'
I0504 22:09:46.987200 31691 http.cpp:975] Creating default 'basic' HTTP authenticator for
realm 'mesos-agent-readonly'
I0504 22:09:46.987337 31691 http.cpp:975] Creating default 'basic' HTTP authenticator for
realm 'mesos-agent-readwrite'
I0504 22:09:46.988468 31691 slave.cpp:525] Agent resources: cpus(*):2; mem(*):1024; disk(*):1024;
ports(*):[31000-32000]
I0504 22:09:46.988538 31691 slave.cpp:533] Agent attributes: [  ]
I0504 22:09:46.988549 31691 slave.cpp:538] Agent hostname: 4cd6e6537ccb
I0504 22:09:46.988651 31689 status_update_manager.cpp:177] Pausing sending status updates
I0504 22:09:46.989979 31694 state.cpp:62] Recovering state from '/tmp/Endpoint_SlaveEndpointTest_NoAuthorizer_2_WPbIjV/meta'
I0504 22:09:46.990391 31699 status_update_manager.cpp:203] Recovering status update manager
I0504 22:09:46.990624 31694 containerizer.cpp:608] Recovering containerizer
I0504 22:09:46.991896 31689 provisioner.cpp:410] Provisioner recovery complete
I0504 22:09:46.992300 31693 slave.cpp:5963] Finished recovery
I0504 22:09:46.992770 31693 slave.cpp:6145] Querying resource estimator for oversubscribable
resources
I0504 22:09:46.992990 31698 slave.cpp:6159] Received oversubscribable resources {} from the
resource estimator
I0504 22:09:46.995908 31691 process.cpp:3730] Handling HTTP event for process 'slave(750)'
with path: '/slave(750)/containers'
I0504 22:09:46.997428 31688 http.cpp:1115] HTTP GET for /slave(750)/containers from 172.17.0.3:38161
I0504 22:09:46.997558 31688 http.cpp:936] Authorizing principal 'test-principal' to GET the
'/containers' endpoint
I0504 22:09:47.001791 31689 slave.cpp:790] Agent terminating
[       OK ] Endpoint/SlaveEndpointTest.NoAuthorizer/2 (29 ms)
[----------] 9 tests from Endpoint/SlaveEndpointTest (293 ms total)

[----------] Global test environment tear-down
[==========] 1566 tests from 174 test cases ran. (576932 ms total)
[  PASSED  ] 1565 tests.
[  FAILED  ] 1 test, listed below:
[  FAILED  ] RegisterSlaveValidationTest.DropInvalidRegistration

 1 FAILED TEST
  YOU HAVE 19 DISABLED TESTS

E0504 22:09:47.064891 31702 process.cpp:950] Failed to accept socket: future discarded
make[4]: *** [check-local] Error 1
make[4]: Leaving directory `/mesos/mesos-1.4.0/_build/src'
make[3]: *** [check-am] Error 2
make[3]: Leaving directory `/mesos/mesos-1.4.0/_build/src'
make[2]: *** [check] Error 2
make[2]: Leaving directory `/mesos/mesos-1.4.0/_build/src'
make[1]: *** [check-recursive] Error 1
make[1]: Leaving directory `/mesos/mesos-1.4.0/_build'
make: *** [distcheck] Error 1
+ docker rmi mesos-1493933050-19216
Untagged: mesos-1493933050-19216:latest
Deleted: sha256:1cd32ce9cd19d09403110985ef8d67ff5642cc7ceac05e374b68ef73b4d026aa
Deleted: sha256:5273c568b179ca1fb7376f41d7682da1f8419dbcd4f655c81253fdaf81db85e0
Deleted: sha256:d25ee3f50137c6bcf311eb95fe359a1d5e078518b3dfd23676217899ea01dbfb
Deleted: sha256:d1541605f25bd03b056349e33cbe4a9967985d30a156002f77f4d41393371dd8
Deleted: sha256:61d510220b2f40d5e9bfe1c672b2d39f68fba082365ac83697aa90e2ec07f657
Deleted: sha256:0b652f408306c4e7236c2ded103a55ded1ab71ccbd8ba5b995e679260a3c1d8f
Deleted: sha256:97970426c9b1b4c410edda7217a3dea33ed7e547927ccb10e7dd5a2c5d0bd868
Deleted: sha256:2db294c44448dadd534f614c9a761779fd4cd51f07c0f2000b40d4113d62711c
Deleted: sha256:b429ed0bd9a2949947889f0fea28a3f512d68fdc9a69e512da3ea844e4a63f92
Deleted: sha256:0946c80e11bcedcef50e1e5211b4b5149ca5303daa51309ec8ab30f58908864c
Deleted: sha256:bcf72c3017223005dbbc68ace6ade9a29e645a6861bd724fa1de46efcf7db192
Deleted: sha256:a5cc4dde2d3c2efd5237d7999f03f598282f26e2f7bcd9b08af654383500dba8
Deleted: sha256:d95138216c41f188c21843b0de858deff1f22b59702ef74ccb864f80903fc452
Deleted: sha256:a537864eca0bcfbd0897709c206c0e51b285a7d7be0dc8fc650bd2ac08056110
Deleted: sha256:2368b795769abca0cbc7186f64feec7781407603a85a35796f46b6d00f04ae37
Deleted: sha256:c24d39bff823e39f1e3e3e6c87e3cae9eb378af11f0a2fa09b9bfbeb2e6817bf
Deleted: sha256:686e31d862267200158f5ce471c5bff54f2d3eeb5ab5330b462302807d5acbc1
Deleted: sha256:43cfca50cbdca9cc499687264204e03ecb8f683de472f9bfbe83d44095bbaeed
Deleted: sha256:a433813ed9dc906d5e02cc10d13b229f27d77144d6f3e3c9839e8d4376921529
Deleted: sha256:9ab365297f3747b428582dd8fc9e7a2b973f691ce44c70ab349d7d7d1fdbde4e
Deleted: sha256:246a27fea2d902033f46adf0608d7a2e44bbb1e33db037800abb039029ca832e
Deleted: sha256:1da5284d4b47dd7111bfe3f2877d1e95397fdafd586f094d930f27de051f070c
Deleted: sha256:eceea32e536f3de6d6307ec7e6b3832fc633ac26d3bb3f12ce1dd023a5df0097
Deleted: sha256:f03b00a4b6d0c43d0202c9569b0139a30c236af8339e5dc416a68416a11c2a65
Deleted: sha256:be8f503a96c8daf58910a803197fbee67aa55e57db3aa47b743c9f39131f9c75
Deleted: sha256:a8493f5f50ffda70c2eeb2d09090debf7d39c8ffcd63b43ff81b111ece6f28bf
Deleted: sha256:36018b5e978717a047892794aebab513ba6856dbe1bdfeb478ca1219df2c7e9c
Build step 'Execute shell' marked build as failure

Mime
View raw message