mesos-builds mailing list archives

Site index · List index
Message view « Date » · « Thread »
Top « Date » · « Thread »
From Apache Jenkins Server <jenk...@builds.apache.org>
Subject Build failed in Jenkins: Mesos-Buildbot » cmake,clang,--verbose --enable-libevent --enable-ssl,GLOG_v=1 MESOS_VERBOSE=1,ubuntu:14.04,(docker||Hadoop)&&(!ubuntu-us1)&&(!ubuntu-eu2) #3713
Date Tue, 23 May 2017 21:31:49 GMT
See <https://builds.apache.org/job/Mesos-Buildbot/BUILDTOOL=cmake,COMPILER=clang,CONFIGURATION=--verbose%20--enable-libevent%20--enable-ssl,ENVIRONMENT=GLOG_v=1%20MESOS_VERBOSE=1,OS=ubuntu%3A14.04,label_exp=(docker%7C%7CHadoop)&&(!ubuntu-us1)&&(!ubuntu-eu2)/3713/display/redirect?page=changes>

Changes:

[neil.conway] Avoid validation of agent re-registration message if possible.

[neil.conway] Added MESOS-7538 to 1.3.0 CHANGELOG.

------------------------------------------
[...truncated 26.66 MB...]
I0523 21:31:42.444083 31688 slave.cpp:6152] Querying resource estimator for oversubscribable
resources
I0523 21:31:42.444305 31695 slave.cpp:6166] Received oversubscribable resources {} from the
resource estimator
I0523 21:31:42.445132 31690 process.cpp:3731] Handling HTTP event for process 'slave(743)'
with path: '/slave(743)/containers'
I0523 21:31:42.445796 31687 http.cpp:1115] HTTP GET for /slave(743)/containers from 172.17.0.2:48072
I0523 21:31:42.445852 31687 http.cpp:936] Authorizing principal 'test-principal' to GET the
'/containers' endpoint
I0523 21:31:42.447679 31689 slave.cpp:790] Agent terminating
[       OK ] Endpoint/SlaveEndpointTest.AuthorizedRequest/2 (16 ms)
[ RUN      ] Endpoint/SlaveEndpointTest.UnauthorizedRequest/0
I0523 21:31:42.454762 25995 containerizer.cpp:221] Using isolation: posix/cpu,posix/mem,filesystem/posix,network/cni
W0523 21:31:42.455098 25995 backend.cpp:76] Failed to create 'aufs' backend: AufsBackend requires
root privileges
W0523 21:31:42.455147 25995 backend.cpp:76] Failed to create 'bind' backend: BindBackend requires
root privileges
I0523 21:31:42.455164 25995 provisioner.cpp:249] Using default backend 'copy'
I0523 21:31:42.456248 31692 slave.cpp:225] Mesos agent started on (744)@172.17.0.2:38260
I0523 21:31:42.456310 31692 slave.cpp:226] Flags at startup: --acls="" --appc_simple_discovery_uri_prefix="http://"
--appc_store_dir="/tmp/mesos/store/appc" --authenticate_http_executors="true" --authenticate_http_readonly="true"
--authenticate_http_readwrite="true" --authenticatee="crammd5" --authentication_backoff_factor="1secs"
--authorizer="local" --cgroups_cpu_enable_pids_and_tids_count="false" --cgroups_enable_cfs="false"
--cgroups_hierarchy="/sys/fs/cgroup" --cgroups_limit_swap="false" --cgroups_root="mesos" --container_disk_watch_interval="15secs"
--containerizers="mesos" --credential="/tmp/Endpoint_SlaveEndpointTest_UnauthorizedRequest_0_Nv6A5S/credential"
--default_role="*" --disk_watch_interval="1mins" --docker="docker" --docker_kill_orphans="true"
--docker_registry="https://registry-1.docker.io" --docker_remove_delay="6hrs" --docker_socket="/var/run/docker.sock"
--docker_stop_timeout="0ns" --docker_store_dir="/tmp/mesos/store/docker" --docker_volume_checkpoint_dir="/var/run/mesos/isolators/docker/volume"
--enforce_container_disk_quota="false" --executor_registration_timeout="1mins" --executor_secret_key="/tmp/Endpoint_SlaveEndpointTest_UnauthorizedRequest_0_Nv6A5S/executor_secret_key"
--executor_shutdown_grace_period="5secs" --fetcher_cache_dir="/tmp/Endpoint_SlaveEndpointTest_UnauthorizedRequest_0_Nv6A5S/fetch"
--fetcher_cache_size="2GB" --frameworks_home="" --gc_delay="1weeks" --gc_disk_headroom="0.1"
--hadoop_home="" --help="false" --hostname_lookup="true" --http_command_executor="false" --http_credentials="/tmp/Endpoint_SlaveEndpointTest_UnauthorizedRequest_0_Nv6A5S/http_credentials"
--http_heartbeat_interval="30secs" --initialize_driver_logging="true" --isolation="posix/cpu,posix/mem"
--launcher="posix" --launcher_dir="/mesos/build/src" --logbufsecs="0" --logging_level="INFO"
--max_completed_executors_per_framework="150" --oversubscribed_resources_interval="15secs"
--perf_duration="10secs" --perf_interval="1mins" --port="5051" --qos_correction_interval_min="0ns"
--quiet="false" --recover="reconnect" --recovery_timeout="15mins" --registration_backoff_factor="10ms"
--resources="cpus:2;gpus:0;mem:1024;disk:1024;ports:[31000-32000]" --revocable_cpu_low_priority="true"
--runtime_dir="/tmp/Endpoint_SlaveEndpointTest_UnauthorizedRequest_0_Nv6A5S" --sandbox_directory="/mnt/mesos/sandbox"
--strict="true" --switch_user="true" --systemd_enable_support="true" --systemd_runtime_directory="/run/systemd/system"
--version="false" --work_dir="/tmp/Endpoint_SlaveEndpointTest_UnauthorizedRequest_0_M8wkX9"
I0523 21:31:42.456569 31692 credentials.hpp:86] Loading credential for authentication from
'/tmp/Endpoint_SlaveEndpointTest_UnauthorizedRequest_0_Nv6A5S/credential'
I0523 21:31:42.456671 31692 slave.cpp:258] Agent using credential for: test-principal
I0523 21:31:42.456686 31692 credentials.hpp:37] Loading credentials for authentication from
'/tmp/Endpoint_SlaveEndpointTest_UnauthorizedRequest_0_Nv6A5S/http_credentials'
I0523 21:31:42.456884 31692 http.cpp:975] Creating default 'basic' HTTP authenticator for
realm 'mesos-agent-executor'
I0523 21:31:42.456943 31692 http.cpp:996] Creating default 'jwt' HTTP authenticator for realm
'mesos-agent-executor'
I0523 21:31:42.457101 31692 http.cpp:975] Creating default 'basic' HTTP authenticator for
realm 'mesos-agent-readonly'
I0523 21:31:42.457180 31692 http.cpp:996] Creating default 'jwt' HTTP authenticator for realm
'mesos-agent-readonly'
I0523 21:31:42.457315 31692 http.cpp:975] Creating default 'basic' HTTP authenticator for
realm 'mesos-agent-readwrite'
I0523 21:31:42.457401 31692 http.cpp:996] Creating default 'jwt' HTTP authenticator for realm
'mesos-agent-readwrite'
I0523 21:31:42.458127 31692 slave.cpp:525] Agent resources: cpus(*):2; mem(*):1024; disk(*):1024;
ports(*):[31000-32000]
I0523 21:31:42.458194 31692 slave.cpp:533] Agent attributes: [  ]
I0523 21:31:42.458204 31692 slave.cpp:538] Agent hostname: 4339a6690394
I0523 21:31:42.458271 31691 status_update_manager.cpp:177] Pausing sending status updates
I0523 21:31:42.458647 31688 state.cpp:62] Recovering state from '/tmp/Endpoint_SlaveEndpointTest_UnauthorizedRequest_0_M8wkX9/meta'
I0523 21:31:42.458850 31686 status_update_manager.cpp:203] Recovering status update manager
I0523 21:31:42.458952 31689 containerizer.cpp:608] Recovering containerizer
I0523 21:31:42.459671 31697 provisioner.cpp:410] Provisioner recovery complete
I0523 21:31:42.459919 31693 slave.cpp:5970] Finished recovery
I0523 21:31:42.460373 31693 slave.cpp:6152] Querying resource estimator for oversubscribable
resources
I0523 21:31:42.460546 31698 slave.cpp:6166] Received oversubscribable resources {} from the
resource estimator
I0523 21:31:42.461366 31693 process.cpp:3731] Handling HTTP event for process 'slave(744)'
with path: '/slave(744)/monitor/statistics'
I0523 21:31:42.461990 31698 http.cpp:1115] HTTP GET for /slave(744)/monitor/statistics from
172.17.0.2:48074
I0523 21:31:42.462035 31698 http.cpp:936] Authorizing principal 'test-principal' to GET the
'/monitor/statistics' endpoint
I0523 21:31:42.463217 31685 slave.cpp:790] Agent terminating
[       OK ] Endpoint/SlaveEndpointTest.UnauthorizedRequest/0 (15 ms)
[ RUN      ] Endpoint/SlaveEndpointTest.UnauthorizedRequest/1
I0523 21:31:42.469377 25995 containerizer.cpp:221] Using isolation: posix/cpu,posix/mem,filesystem/posix,network/cni
W0523 21:31:42.469692 25995 backend.cpp:76] Failed to create 'aufs' backend: AufsBackend requires
root privileges
W0523 21:31:42.469735 25995 backend.cpp:76] Failed to create 'bind' backend: BindBackend requires
root privileges
I0523 21:31:42.469760 25995 provisioner.cpp:249] Using default backend 'copy'
I0523 21:31:42.471174 31699 slave.cpp:225] Mesos agent started on (745)@172.17.0.2:38260
I0523 21:31:42.471204 31699 slave.cpp:226] Flags at startup: --acls="" --appc_simple_discovery_uri_prefix="http://"
--appc_store_dir="/tmp/mesos/store/appc" --authenticate_http_executors="true" --authenticate_http_readonly="true"
--authenticate_http_readwrite="true" --authenticatee="crammd5" --authentication_backoff_factor="1secs"
--authorizer="local" --cgroups_cpu_enable_pids_and_tids_count="false" --cgroups_enable_cfs="false"
--cgroups_hierarchy="/sys/fs/cgroup" --cgroups_limit_swap="false" --cgroups_root="mesos" --container_disk_watch_interval="15secs"
--containerizers="mesos" --credential="/tmp/Endpoint_SlaveEndpointTest_UnauthorizedRequest_1_rOW0KN/credential"
--default_role="*" --disk_watch_interval="1mins" --docker="docker" --docker_kill_orphans="true"
--docker_registry="https://registry-1.docker.io" --docker_remove_delay="6hrs" --docker_socket="/var/run/docker.sock"
--docker_stop_timeout="0ns" --docker_store_dir="/tmp/mesos/store/docker" --docker_volume_checkpoint_dir="/var/run/mesos/isolators/docker/volume"
--enforce_container_disk_quota="false" --executor_registration_timeout="1mins" --executor_secret_key="/tmp/Endpoint_SlaveEndpointTest_UnauthorizedRequest_1_rOW0KN/executor_secret_key"
--executor_shutdown_grace_period="5secs" --fetcher_cache_dir="/tmp/Endpoint_SlaveEndpointTest_UnauthorizedRequest_1_rOW0KN/fetch"
--fetcher_cache_size="2GB" --frameworks_home="" --gc_delay="1weeks" --gc_disk_headroom="0.1"
--hadoop_home="" --help="false" --hostname_lookup="true" --http_command_executor="false" --http_credentials="/tmp/Endpoint_SlaveEndpointTest_UnauthorizedRequest_1_rOW0KN/http_credentials"
--http_heartbeat_interval="30secs" --initialize_driver_logging="true" --isolation="posix/cpu,posix/mem"
--launcher="posix" --launcher_dir="/mesos/build/src" --logbufsecs="0" --logging_level="INFO"
--max_completed_executors_per_framework="150" --oversubscribed_resources_interval="15secs"
--perf_duration="10secs" --perf_interval="1mins" --port="5051" --qos_correction_interval_min="0ns"
--quiet="false" --recover="reconnect" --recovery_timeout="15mins" --registration_backoff_factor="10ms"
--resources="cpus:2;gpus:0;mem:1024;disk:1024;ports:[31000-32000]" --revocable_cpu_low_priority="true"
--runtime_dir="/tmp/Endpoint_SlaveEndpointTest_UnauthorizedRequest_1_rOW0KN" --sandbox_directory="/mnt/mesos/sandbox"
--strict="true" --switch_user="true" --systemd_enable_support="true" --systemd_runtime_directory="/run/systemd/system"
--version="false" --work_dir="/tmp/Endpoint_SlaveEndpointTest_UnauthorizedRequest_1_IIuiA4"
I0523 21:31:42.471457 31699 credentials.hpp:86] Loading credential for authentication from
'/tmp/Endpoint_SlaveEndpointTest_UnauthorizedRequest_1_rOW0KN/credential'
I0523 21:31:42.471555 31699 slave.cpp:258] Agent using credential for: test-principal
I0523 21:31:42.471570 31699 credentials.hpp:37] Loading credentials for authentication from
'/tmp/Endpoint_SlaveEndpointTest_UnauthorizedRequest_1_rOW0KN/http_credentials'
I0523 21:31:42.471729 31699 http.cpp:975] Creating default 'basic' HTTP authenticator for
realm 'mesos-agent-executor'
I0523 21:31:42.471771 31699 http.cpp:996] Creating default 'jwt' HTTP authenticator for realm
'mesos-agent-executor'
I0523 21:31:42.471860 31699 http.cpp:975] Creating default 'basic' HTTP authenticator for
realm 'mesos-agent-readonly'
I0523 21:31:42.471933 31699 http.cpp:996] Creating default 'jwt' HTTP authenticator for realm
'mesos-agent-readonly'
I0523 21:31:42.472091 31699 http.cpp:975] Creating default 'basic' HTTP authenticator for
realm 'mesos-agent-readwrite'
I0523 21:31:42.472157 31699 http.cpp:996] Creating default 'jwt' HTTP authenticator for realm
'mesos-agent-readwrite'
I0523 21:31:42.472751 31699 slave.cpp:525] Agent resources: cpus(*):2; mem(*):1024; disk(*):1024;
ports(*):[31000-32000]
I0523 21:31:42.472793 31699 slave.cpp:533] Agent attributes: [  ]
I0523 21:31:42.472800 31699 slave.cpp:538] Agent hostname: 4339a6690394
I0523 21:31:42.472877 31688 status_update_manager.cpp:177] Pausing sending status updates
I0523 21:31:42.473201 31690 state.cpp:62] Recovering state from '/tmp/Endpoint_SlaveEndpointTest_UnauthorizedRequest_1_IIuiA4/meta'
I0523 21:31:42.473384 31689 status_update_manager.cpp:203] Recovering status update manager
I0523 21:31:42.473484 31689 containerizer.cpp:608] Recovering containerizer
I0523 21:31:42.474196 31700 provisioner.cpp:410] Provisioner recovery complete
I0523 21:31:42.474439 31691 slave.cpp:5970] Finished recovery
I0523 21:31:42.474869 31691 slave.cpp:6152] Querying resource estimator for oversubscribable
resources
I0523 21:31:42.475080 31686 slave.cpp:6166] Received oversubscribable resources {} from the
resource estimator
I0523 21:31:42.475805 31696 process.cpp:3731] Handling HTTP event for process 'slave(745)'
with path: '/slave(745)/monitor/statistics.json'
I0523 21:31:42.476557 31692 http.cpp:1115] HTTP GET for /slave(745)/monitor/statistics.json
from 172.17.0.2:48075
I0523 21:31:42.476613 31692 http.cpp:936] Authorizing principal 'test-principal' to GET the
'/monitor/statistics.json' endpoint
I0523 21:31:42.477758 31688 slave.cpp:790] Agent terminating
[       OK ] Endpoint/SlaveEndpointTest.UnauthorizedRequest/1 (14 ms)
[ RUN      ] Endpoint/SlaveEndpointTest.UnauthorizedRequest/2
I0523 21:31:42.484241 25995 containerizer.cpp:221] Using isolation: posix/cpu,posix/mem,filesystem/posix,network/cni
W0523 21:31:42.484561 25995 backend.cpp:76] Failed to create 'aufs' backend: AufsBackend requires
root privileges
W0523 21:31:42.484606 25995 backend.cpp:76] Failed to create 'bind' backend: BindBackend requires
root privileges
I0523 21:31:42.484622 25995 provisioner.cpp:249] Using default backend 'copy'
I0523 21:31:42.486143 31692 slave.cpp:225] Mesos agent started on (746)@172.17.0.2:38260
I0523 21:31:42.486203 31692 slave.cpp:226] Flags at startup: --acls="" --appc_simple_discovery_uri_prefix="http://"
--appc_store_dir="/tmp/mesos/store/appc" --authenticate_http_executors="true" --authenticate_http_readonly="true"
--authenticate_http_readwrite="true" --authenticatee="crammd5" --authentication_backoff_factor="1secs"
--authorizer="local" --cgroups_cpu_enable_pids_and_tids_count="false" --cgroups_enable_cfs="false"
--cgroups_hierarchy="/sys/fs/cgroup" --cgroups_limit_swap="false" --cgroups_root="mesos" --container_disk_watch_interval="15secs"
--containerizers="mesos" --credential="/tmp/Endpoint_SlaveEndpointTest_UnauthorizedRequest_2_pVO0zI/credential"
--default_role="*" --disk_watch_interval="1mins" --docker="docker" --docker_kill_orphans="true"
--docker_registry="https://registry-1.docker.io" --docker_remove_delay="6hrs" --docker_socket="/var/run/docker.sock"
--docker_stop_timeout="0ns" --docker_store_dir="/tmp/mesos/store/docker" --docker_volume_checkpoint_dir="/var/run/mesos/isolators/docker/volume"
--enforce_container_disk_quota="false" --executor_registration_timeout="1mins" --executor_secret_key="/tmp/Endpoint_SlaveEndpointTest_UnauthorizedRequest_2_pVO0zI/executor_secret_key"
--executor_shutdown_grace_period="5secs" --fetcher_cache_dir="/tmp/Endpoint_SlaveEndpointTest_UnauthorizedRequest_2_pVO0zI/fetch"
--fetcher_cache_size="2GB" --frameworks_home="" --gc_delay="1weeks" --gc_disk_headroom="0.1"
--hadoop_home="" --help="false" --hostname_lookup="true" --http_command_executor="false" --http_credentials="/tmp/Endpoint_SlaveEndpointTest_UnauthorizedRequest_2_pVO0zI/http_credentials"
--http_heartbeat_interval="30secs" --initialize_driver_logging="true" --isolation="posix/cpu,posix/mem"
--launcher="posix" --launcher_dir="/mesos/build/src" --logbufsecs="0" --logging_level="INFO"
--max_completed_executors_per_framework="150" --oversubscribed_resources_interval="15secs"
--perf_duration="10secs" --perf_interval="1mins" --port="5051" --qos_correction_interval_min="0ns"
--quiet="false" --recover="reconnect" --recovery_timeout="15mins" --registration_backoff_factor="10ms"
--resources="cpus:2;gpus:0;mem:1024;disk:1024;ports:[31000-32000]" --revocable_cpu_low_priority="true"
--runtime_dir="/tmp/Endpoint_SlaveEndpointTest_UnauthorizedRequest_2_pVO0zI" --sandbox_directory="/mnt/mesos/sandbox"
--strict="true" --switch_user="true" --systemd_enable_support="true" --systemd_runtime_directory="/run/systemd/system"
--version="false" --work_dir="/tmp/Endpoint_SlaveEndpointTest_UnauthorizedRequest_2_aB9SmZ"
I0523 21:31:42.486562 31692 credentials.hpp:86] Loading credential for authentication from
'/tmp/Endpoint_SlaveEndpointTest_UnauthorizedRequest_2_pVO0zI/credential'
I0523 21:31:42.486690 31692 slave.cpp:258] Agent using credential for: test-principal
I0523 21:31:42.486712 31692 credentials.hpp:37] Loading credentials for authentication from
'/tmp/Endpoint_SlaveEndpointTest_UnauthorizedRequest_2_pVO0zI/http_credentials'
I0523 21:31:42.486908 31692 http.cpp:975] Creating default 'basic' HTTP authenticator for
realm 'mesos-agent-executor'
I0523 21:31:42.486953 31692 http.cpp:996] Creating default 'jwt' HTTP authenticator for realm
'mesos-agent-executor'
I0523 21:31:42.487000 31692 http.cpp:975] Creating default 'basic' HTTP authenticator for
realm 'mesos-agent-readonly'
I0523 21:31:42.487031 31692 http.cpp:996] Creating default 'jwt' HTTP authenticator for realm
'mesos-agent-readonly'
I0523 21:31:42.487083 31692 http.cpp:975] Creating default 'basic' HTTP authenticator for
realm 'mesos-agent-readwrite'
I0523 21:31:42.487112 31692 http.cpp:996] Creating default 'jwt' HTTP authenticator for realm
'mesos-agent-readwrite'
I0523 21:31:42.487643 31692 slave.cpp:525] Agent resources: cpus(*):2; mem(*):1024; disk(*):1024;
ports(*):[31000-32000]
I0523 21:31:42.487684 31692 slave.cpp:533] Agent attributes: [  ]
I0523 21:31:42.487692 31692 slave.cpp:538] Agent hostname: 4339a6690394
I0523 21:31:42.487779 31690 status_update_manager.cpp:177] Pausing sending status updates
I0523 21:31:42.488215 31686 state.cpp:62] Recovering state from '/tmp/Endpoint_SlaveEndpointTest_UnauthorizedRequest_2_aB9SmZ/meta'
I0523 21:31:42.488318 31699 status_update_manager.cpp:203] Recovering status update manager
I0523 21:31:42.488471 31695 containerizer.cpp:608] Recovering containerizer
I0523 21:31:42.489076 31698 provisioner.cpp:410] Provisioner recovery complete
I0523 21:31:42.489312 31686 slave.cpp:5970] Finished recovery
I0523 21:31:42.489706 31686 slave.cpp:6152] Querying resource estimator for oversubscribable
resources
I0523 21:31:42.489857 31693 slave.cpp:6166] Received oversubscribable resources {} from the
resource estimator
I0523 21:31:42.490617 31694 process.cpp:3731] Handling HTTP event for process 'slave(746)'
with path: '/slave(746)/containers'
I0523 21:31:42.491246 31687 http.cpp:1115] HTTP GET for /slave(746)/containers from 172.17.0.2:48076
I0523 21:31:42.491291 31687 http.cpp:936] Authorizing principal 'test-principal' to GET the
'/containers' endpoint
I0523 21:31:42.493083 31700 slave.cpp:790] Agent terminating
[       OK ] Endpoint/SlaveEndpointTest.UnauthorizedRequest/2 (14 ms)
[ RUN      ] Endpoint/SlaveEndpointTest.NoAuthorizer/0
I0523 21:31:42.499167 25995 containerizer.cpp:221] Using isolation: posix/cpu,posix/mem,filesystem/posix,network/cni
W0523 21:31:42.499505 25995 backend.cpp:76] Failed to create 'aufs' backend: AufsBackend requires
root privileges
W0523 21:31:42.499550 25995 backend.cpp:76] Failed to create 'bind' backend: BindBackend requires
root privileges
I0523 21:31:42.499565 25995 provisioner.cpp:249] Using default backend 'copy'
I0523 21:31:42.500381 25995 cluster.cpp:448] Creating default 'local' authorizer
I0523 21:31:42.501021 31687 slave.cpp:225] Mesos agent started on (747)@172.17.0.2:38260
I0523 21:31:42.501051 31687 slave.cpp:226] Flags at startup: --acls="" --appc_simple_discovery_uri_prefix="http://"
--appc_store_dir="/tmp/mesos/store/appc" --authenticate_http_executors="true" --authenticate_http_readonly="true"
--authenticate_http_readwrite="true" --authenticatee="crammd5" --authentication_backoff_factor="1secs"
--authorizer="local" --cgroups_cpu_enable_pids_and_tids_count="false" --cgroups_enable_cfs="false"
--cgroups_hierarchy="/sys/fs/cgroup" --cgroups_limit_swap="false" --cgroups_root="mesos" --container_disk_watch_interval="15secs"
--containerizers="mesos" --credential="/tmp/Endpoint_SlaveEndpointTest_NoAuthorizer_0_FofxyD/credential"
--default_role="*" --disk_watch_interval="1mins" --docker="docker" --docker_kill_orphans="true"
--docker_registry="https://registry-1.docker.io" --docker_remove_delay="6hrs" --docker_socket="/var/run/docker.sock"
--docker_stop_timeout="0ns" --docker_store_dir="/tmp/mesos/store/docker" --docker_volume_checkpoint_dir="/var/run/mesos/isolators/docker/volume"
--enforce_container_disk_quota="false" --executor_registration_timeout="1mins" --executor_secret_key="/tmp/Endpoint_SlaveEndpointTest_NoAuthorizer_0_FofxyD/executor_secret_key"
--executor_shutdown_grace_period="5secs" --fetcher_cache_dir="/tmp/Endpoint_SlaveEndpointTest_NoAuthorizer_0_FofxyD/fetch"
--fetcher_cache_size="2GB" --frameworks_home="" --gc_delay="1weeks" --gc_disk_headroom="0.1"
--hadoop_home="" --help="false" --hostname_lookup="true" --http_command_executor="false" --http_credentials="/tmp/Endpoint_SlaveEndpointTest_NoAuthorizer_0_FofxyD/http_credentials"
--http_heartbeat_interval="30secs" --initialize_driver_logging="true" --isolation="posix/cpu,posix/mem"
--launcher="posix" --launcher_dir="/mesos/build/src" --logbufsecs="0" --logging_level="INFO"
--max_completed_executors_per_framework="150" --oversubscribed_resources_interval="15secs"
--perf_duration="10secs" --perf_interval="1mins" --port="5051" --qos_correction_interval_min="0ns"
--quiet="false" --recover="reconnect" --recovery_timeout="15mins" --registration_backoff_factor="10ms"
--resources="cpus:2;gpus:0;mem:1024;disk:1024;ports:[31000-32000]" --revocable_cpu_low_priority="true"
--runtime_dir="/tmp/Endpoint_SlaveEndpointTest_NoAuthorizer_0_FofxyD" --sandbox_directory="/mnt/mesos/sandbox"
--strict="true" --switch_user="true" --systemd_enable_support="true" --systemd_runtime_directory="/run/systemd/system"
--version="false" --work_dir="/tmp/Endpoint_SlaveEndpointTest_NoAuthorizer_0_WdP2iU"
I0523 21:31:42.501344 31687 credentials.hpp:86] Loading credential for authentication from
'/tmp/Endpoint_SlaveEndpointTest_NoAuthorizer_0_FofxyD/credential'
I0523 21:31:42.501446 31687 slave.cpp:258] Agent using credential for: test-principal
I0523 21:31:42.501463 31687 credentials.hpp:37] Loading credentials for authentication from
'/tmp/Endpoint_SlaveEndpointTest_NoAuthorizer_0_FofxyD/http_credentials'
I0523 21:31:42.501652 31687 http.cpp:975] Creating default 'basic' HTTP authenticator for
realm 'mesos-agent-executor'
I0523 21:31:42.501700 31687 http.cpp:996] Creating default 'jwt' HTTP authenticator for realm
'mesos-agent-executor'
I0523 21:31:42.501751 31687 http.cpp:975] Creating default 'basic' HTTP authenticator for
realm 'mesos-agent-readonly'
I0523 21:31:42.501801 31687 http.cpp:996] Creating default 'jwt' HTTP authenticator for realm
'mesos-agent-readonly'
I0523 21:31:42.502010 31687 http.cpp:975] Creating default 'basic' HTTP authenticator for
realm 'mesos-agent-readwrite'
I0523 21:31:42.502075 31687 http.cpp:996] Creating default 'jwt' HTTP authenticator for realm
'mesos-agent-readwrite'
I0523 21:31:42.502895 31687 slave.cpp:525] Agent resources: cpus(*):2; mem(*):1024; disk(*):1024;
ports(*):[31000-32000]
I0523 21:31:42.502939 31687 slave.cpp:533] Agent attributes: [  ]
I0523 21:31:42.502951 31687 slave.cpp:538] Agent hostname: 4339a6690394
I0523 21:31:42.503039 31696 status_update_manager.cpp:177] Pausing sending status updates
I0523 21:31:42.503438 31699 state.cpp:62] Recovering state from '/tmp/Endpoint_SlaveEndpointTest_NoAuthorizer_0_WdP2iU/meta'
I0523 21:31:42.503657 31699 status_update_manager.cpp:203] Recovering status update manager
I0523 21:31:42.503756 31699 containerizer.cpp:608] Recovering containerizer
I0523 21:31:42.504420 31699 provisioner.cpp:410] Provisioner recovery complete
I0523 21:31:42.504643 31685 slave.cpp:5970] Finished recovery
I0523 21:31:42.505106 31685 slave.cpp:6152] Querying resource estimator for oversubscribable
resources
I0523 21:31:42.505247 31687 slave.cpp:6166] Received oversubscribable resources {} from the
resource estimator
I0523 21:31:42.505970 31694 process.cpp:3731] Handling HTTP event for process 'slave(747)'
with path: '/slave(747)/monitor/statistics'
I0523 21:31:42.506670 31686 http.cpp:1115] HTTP GET for /slave(747)/monitor/statistics from
172.17.0.2:48077
I0523 21:31:42.506721 31686 http.cpp:936] Authorizing principal 'test-principal' to GET the
'/monitor/statistics' endpoint
I0523 21:31:42.508090 31698 slave.cpp:790] Agent terminating
[       OK ] Endpoint/SlaveEndpointTest.NoAuthorizer/0 (15 ms)
[ RUN      ] Endpoint/SlaveEndpointTest.NoAuthorizer/1
I0523 21:31:42.514377 25995 containerizer.cpp:221] Using isolation: posix/cpu,posix/mem,filesystem/posix,network/cni
W0523 21:31:42.514698 25995 backend.cpp:76] Failed to create 'aufs' backend: AufsBackend requires
root privileges
W0523 21:31:42.514744 25995 backend.cpp:76] Failed to create 'bind' backend: BindBackend requires
root privileges
I0523 21:31:42.514760 25995 provisioner.cpp:249] Using default backend 'copy'
I0523 21:31:42.515427 25995 cluster.cpp:448] Creating default 'local' authorizer
I0523 21:31:42.516024 31700 slave.cpp:225] Mesos agent started on (748)@172.17.0.2:38260
I0523 21:31:42.516050 31700 slave.cpp:226] Flags at startup: --acls="" --appc_simple_discovery_uri_prefix="http://"
--appc_store_dir="/tmp/mesos/store/appc" --authenticate_http_executors="true" --authenticate_http_readonly="true"
--authenticate_http_readwrite="true" --authenticatee="crammd5" --authentication_backoff_factor="1secs"
--authorizer="local" --cgroups_cpu_enable_pids_and_tids_count="false" --cgroups_enable_cfs="false"
--cgroups_hierarchy="/sys/fs/cgroup" --cgroups_limit_swap="false" --cgroups_root="mesos" --container_disk_watch_interval="15secs"
--containerizers="mesos" --credential="/tmp/Endpoint_SlaveEndpointTest_NoAuthorizer_1_rNi4Gy/credential"
--default_role="*" --disk_watch_interval="1mins" --docker="docker" --docker_kill_orphans="true"
--docker_registry="https://registry-1.docker.io" --docker_remove_delay="6hrs" --docker_socket="/var/run/docker.sock"
--docker_stop_timeout="0ns" --docker_store_dir="/tmp/mesos/store/docker" --docker_volume_checkpoint_dir="/var/run/mesos/isolators/docker/volume"
--enforce_container_disk_quota="false" --executor_registration_timeout="1mins" --executor_secret_key="/tmp/Endpoint_SlaveEndpointTest_NoAuthorizer_1_rNi4Gy/executor_secret_key"
--executor_shutdown_grace_period="5secs" --fetcher_cache_dir="/tmp/Endpoint_SlaveEndpointTest_NoAuthorizer_1_rNi4Gy/fetch"
--fetcher_cache_size="2GB" --frameworks_home="" --gc_delay="1weeks" --gc_disk_headroom="0.1"
--hadoop_home="" --help="false" --hostname_lookup="true" --http_command_executor="false" --http_credentials="/tmp/Endpoint_SlaveEndpointTest_NoAuthorizer_1_rNi4Gy/http_credentials"
--http_heartbeat_interval="30secs" --initialize_driver_logging="true" --isolation="posix/cpu,posix/mem"
--launcher="posix" --launcher_dir="/mesos/build/src" --logbufsecs="0" --logging_level="INFO"
--max_completed_executors_per_framework="150" --oversubscribed_resources_interval="15secs"
--perf_duration="10secs" --perf_interval="1mins" --port="5051" --qos_correction_interval_min="0ns"
--quiet="false" --recover="reconnect" --recovery_timeout="15mins" --registration_backoff_factor="10ms"
--resources="cpus:2;gpus:0;mem:1024;disk:1024;ports:[31000-32000]" --revocable_cpu_low_priority="true"
--runtime_dir="/tmp/Endpoint_SlaveEndpointTest_NoAuthorizer_1_rNi4Gy" --sandbox_directory="/mnt/mesos/sandbox"
--strict="true" --switch_user="true" --systemd_enable_support="true" --systemd_runtime_directory="/run/systemd/system"
--version="false" --work_dir="/tmp/Endpoint_SlaveEndpointTest_NoAuthorizer_1_KLj4oP"
I0523 21:31:42.516345 31700 credentials.hpp:86] Loading credential for authentication from
'/tmp/Endpoint_SlaveEndpointTest_NoAuthorizer_1_rNi4Gy/credential'
I0523 21:31:42.516458 31700 slave.cpp:258] Agent using credential for: test-principal
I0523 21:31:42.516475 31700 credentials.hpp:37] Loading credentials for authentication from
'/tmp/Endpoint_SlaveEndpointTest_NoAuthorizer_1_rNi4Gy/http_credentials'
I0523 21:31:42.516695 31700 http.cpp:975] Creating default 'basic' HTTP authenticator for
realm 'mesos-agent-executor'
I0523 21:31:42.516753 31700 http.cpp:996] Creating default 'jwt' HTTP authenticator for realm
'mesos-agent-executor'
I0523 21:31:42.516845 31700 http.cpp:975] Creating default 'basic' HTTP authenticator for
realm 'mesos-agent-readonly'
I0523 21:31:42.516911 31700 http.cpp:996] Creating default 'jwt' HTTP authenticator for realm
'mesos-agent-readonly'
I0523 21:31:42.517078 31700 http.cpp:975] Creating default 'basic' HTTP authenticator for
realm 'mesos-agent-readwrite'
I0523 21:31:42.517150 31700 http.cpp:996] Creating default 'jwt' HTTP authenticator for realm
'mesos-agent-readwrite'
I0523 21:31:42.517817 31700 slave.cpp:525] Agent resources: cpus(*):2; mem(*):1024; disk(*):1024;
ports(*):[31000-32000]
I0523 21:31:42.517860 31700 slave.cpp:533] Agent attributes: [  ]
I0523 21:31:42.517870 31700 slave.cpp:538] Agent hostname: 4339a6690394
I0523 21:31:42.517941 31696 status_update_manager.cpp:177] Pausing sending status updates
I0523 21:31:42.518534 31686 state.cpp:62] Recovering state from '/tmp/Endpoint_SlaveEndpointTest_NoAuthorizer_1_KLj4oP/meta'
I0523 21:31:42.518679 31691 status_update_manager.cpp:203] Recovering status update manager
I0523 21:31:42.518966 31687 containerizer.cpp:608] Recovering containerizer
I0523 21:31:42.519701 31686 provisioner.cpp:410] Provisioner recovery complete
I0523 21:31:42.519920 31695 slave.cpp:5970] Finished recovery
I0523 21:31:42.520315 31695 slave.cpp:6152] Querying resource estimator for oversubscribable
resources
I0523 21:31:42.520475 31692 slave.cpp:6166] Received oversubscribable resources {} from the
resource estimator
I0523 21:31:42.521190 31686 process.cpp:3731] Handling HTTP event for process 'slave(748)'
with path: '/slave(748)/monitor/statistics.json'
I0523 21:31:42.521879 31693 http.cpp:1115] HTTP GET for /slave(748)/monitor/statistics.json
from 172.17.0.2:48078
I0523 21:31:42.521932 31693 http.cpp:936] Authorizing principal 'test-principal' to GET the
'/monitor/statistics.json' endpoint
I0523 21:31:42.523649 31700 slave.cpp:790] Agent terminating
[       OK ] Endpoint/SlaveEndpointTest.NoAuthorizer/1 (15 ms)
[ RUN      ] Endpoint/SlaveEndpointTest.NoAuthorizer/2
I0523 21:31:42.529876 25995 containerizer.cpp:221] Using isolation: posix/cpu,posix/mem,filesystem/posix,network/cni
W0523 21:31:42.530220 25995 backend.cpp:76] Failed to create 'aufs' backend: AufsBackend requires
root privileges
W0523 21:31:42.530266 25995 backend.cpp:76] Failed to create 'bind' backend: BindBackend requires
root privileges
I0523 21:31:42.530280 25995 provisioner.cpp:249] Using default backend 'copy'
I0523 21:31:42.530905 25995 cluster.cpp:448] Creating default 'local' authorizer
I0523 21:31:42.531417 31698 slave.cpp:225] Mesos agent started on (749)@172.17.0.2:38260
I0523 21:31:42.531450 31698 slave.cpp:226] Flags at startup: --acls="" --appc_simple_discovery_uri_prefix="http://"
--appc_store_dir="/tmp/mesos/store/appc" --authenticate_http_executors="true" --authenticate_http_readonly="true"
--authenticate_http_readwrite="true" --authenticatee="crammd5" --authentication_backoff_factor="1secs"
--authorizer="local" --cgroups_cpu_enable_pids_and_tids_count="false" --cgroups_enable_cfs="false"
--cgroups_hierarchy="/sys/fs/cgroup" --cgroups_limit_swap="false" --cgroups_root="mesos" --container_disk_watch_interval="15secs"
--containerizers="mesos" --credential="/tmp/Endpoint_SlaveEndpointTest_NoAuthorizer_2_pMlEZt/credential"
--default_role="*" --disk_watch_interval="1mins" --docker="docker" --docker_kill_orphans="true"
--docker_registry="https://registry-1.docker.io" --docker_remove_delay="6hrs" --docker_socket="/var/run/docker.sock"
--docker_stop_timeout="0ns" --docker_store_dir="/tmp/mesos/store/docker" --docker_volume_checkpoint_dir="/var/run/mesos/isolators/docker/volume"
--enforce_container_disk_quota="false" --executor_registration_timeout="1mins" --executor_secret_key="/tmp/Endpoint_SlaveEndpointTest_NoAuthorizer_2_pMlEZt/executor_secret_key"
--executor_shutdown_grace_period="5secs" --fetcher_cache_dir="/tmp/Endpoint_SlaveEndpointTest_NoAuthorizer_2_pMlEZt/fetch"
--fetcher_cache_size="2GB" --frameworks_home="" --gc_delay="1weeks" --gc_disk_headroom="0.1"
--hadoop_home="" --help="false" --hostname_lookup="true" --http_command_executor="false" --http_credentials="/tmp/Endpoint_SlaveEndpointTest_NoAuthorizer_2_pMlEZt/http_credentials"
--http_heartbeat_interval="30secs" --initialize_driver_logging="true" --isolation="posix/cpu,posix/mem"
--launcher="posix" --launcher_dir="/mesos/build/src" --logbufsecs="0" --logging_level="INFO"
--max_completed_executors_per_framework="150" --oversubscribed_resources_interval="15secs"
--perf_duration="10secs" --perf_interval="1mins" --port="5051" --qos_correction_interval_min="0ns"
--quiet="false" --recover="reconnect" --recovery_timeout="15mins" --registration_backoff_factor="10ms"
--resources="cpus:2;gpus:0;mem:1024;disk:1024;ports:[31000-32000]" --revocable_cpu_low_priority="true"
--runtime_dir="/tmp/Endpoint_SlaveEndpointTest_NoAuthorizer_2_pMlEZt" --sandbox_directory="/mnt/mesos/sandbox"
--strict="true" --switch_user="true" --systemd_enable_support="true" --systemd_runtime_directory="/run/systemd/system"
--version="false" --work_dir="/tmp/Endpoint_SlaveEndpointTest_NoAuthorizer_2_4ff8EK"
I0523 21:31:42.531762 31698 credentials.hpp:86] Loading credential for authentication from
'/tmp/Endpoint_SlaveEndpointTest_NoAuthorizer_2_pMlEZt/credential'
I0523 21:31:42.531886 31698 slave.cpp:258] Agent using credential for: test-principal
I0523 21:31:42.531910 31698 credentials.hpp:37] Loading credentials for authentication from
'/tmp/Endpoint_SlaveEndpointTest_NoAuthorizer_2_pMlEZt/http_credentials'
I0523 21:31:42.532110 31698 http.cpp:975] Creating default 'basic' HTTP authenticator for
realm 'mesos-agent-executor'
I0523 21:31:42.532160 31698 http.cpp:996] Creating default 'jwt' HTTP authenticator for realm
'mesos-agent-executor'
I0523 21:31:42.532347 31698 http.cpp:975] Creating default 'basic' HTTP authenticator for
realm 'mesos-agent-readonly'
I0523 21:31:42.532505 31698 http.cpp:996] Creating default 'jwt' HTTP authenticator for realm
'mesos-agent-readonly'
I0523 21:31:42.532559 31698 http.cpp:975] Creating default 'basic' HTTP authenticator for
realm 'mesos-agent-readwrite'
I0523 21:31:42.532608 31698 http.cpp:996] Creating default 'jwt' HTTP authenticator for realm
'mesos-agent-readwrite'
I0523 21:31:42.533305 31698 slave.cpp:525] Agent resources: cpus(*):2; mem(*):1024; disk(*):1024;
ports(*):[31000-32000]
I0523 21:31:42.533349 31698 slave.cpp:533] Agent attributes: [  ]
I0523 21:31:42.533354 31698 slave.cpp:538] Agent hostname: 4339a6690394
I0523 21:31:42.533437 31687 status_update_manager.cpp:177] Pausing sending status updates
I0523 21:31:42.533777 31687 state.cpp:62] Recovering state from '/tmp/Endpoint_SlaveEndpointTest_NoAuthorizer_2_4ff8EK/meta'
I0523 21:31:42.533957 31689 status_update_manager.cpp:203] Recovering status update manager
I0523 21:31:42.534103 31686 containerizer.cpp:608] Recovering containerizer
I0523 21:31:42.534821 31689 provisioner.cpp:410] Provisioner recovery complete
I0523 21:31:42.535074 31700 slave.cpp:5970] Finished recovery
I0523 21:31:42.535470 31700 slave.cpp:6152] Querying resource estimator for oversubscribable
resources
I0523 21:31:42.535557 31700 slave.cpp:6166] Received oversubscribable resources {} from the
resource estimator
I0523 21:31:42.536278 31693 process.cpp:3731] Handling HTTP event for process 'slave(749)'
with path: '/slave(749)/containers'
I0523 21:31:42.537060 31687 http.cpp:1115] HTTP GET for /slave(749)/containers from 172.17.0.2:48079
I0523 21:31:42.537111 31687 http.cpp:936] Authorizing principal 'test-principal' to GET the
'/containers' endpoint
I0523 21:31:42.538698 31694 slave.cpp:790] Agent terminating
[       OK ] Endpoint/SlaveEndpointTest.NoAuthorizer/2 (15 ms)
[----------] 9 tests from Endpoint/SlaveEndpointTest (138 ms total)

[----------] Global test environment tear-down
[==========] 1526 tests from 169 test cases ran. (215746 ms total)
[  PASSED  ] 1525 tests.
[  FAILED  ] 1 test, listed below:
[  FAILED  ] ContainerLoggerTest.LOGROTATE_RotateInSandbox

 1 FAILED TEST
  YOU HAVE 22 DISABLED TESTS

E0523 21:31:42.596448 31701 process.cpp:951] Failed to accept socket: future discarded
make[3]: Leaving directory `/mesos/build'
make[3]: *** [CMakeFiles/check] Error 1
make[2]: Leaving directory `/mesos/build'
make[2]: *** [CMakeFiles/check.dir/all] Error 2
make[1]: *** [CMakeFiles/check.dir/rule] Error 2
make[1]: Leaving directory `/mesos/build'
make: *** [check] Error 2
+ docker rmi mesos-1495572873-2151
Untagged: mesos-1495572873-2151:latest
Deleted: sha256:a15e027e990a9705d534e8a3cd21c04cff34d15a085e6baaf3f77b839f087426
Deleted: sha256:6c1604e5aefcbb48e0058527b12ec9f29359181a429de7da326dff055b520b9f
Deleted: sha256:629768358b4c3086398ed9d0cf8ea18ed5d7899a187039d0e182edab24b6392b
Deleted: sha256:612bb78ab763498b11ae7a09848d155a51721dd09b4d2c6ffcd498bd34bdb172
Deleted: sha256:789a3add512666811c8a3f31e430cc22ba2acf03a4bb99435270a36e414b5377
Deleted: sha256:af351c71a601df9411024426e4ead81992dc05b7e8ab1a84dad83ba8c50163da
Deleted: sha256:6341f8380f61307f7b81bbe2cc164531d0796df9f54e1b39394263ace7979a99
Deleted: sha256:619ed6e6f972a653eb486b7c90eeba8bcd46e6a486763066bd1539afdaf53c79
Deleted: sha256:1e732e31c8150615f92e045a81639e96aad10b006fa0a093a11c8d1784a78c4c
Deleted: sha256:05759b3f80e5b7b63ac526bde0da3f7def7c39eca93b45f03a9b823a081d70fa
Deleted: sha256:61361f00eafdc54f02e479e154dbf3ec6dc606cd9d537ab8e23ef8965e7ea5fb
Deleted: sha256:73ffe378e3821c36fee9de61a756aa4125a763f049025ed6abd9b9800b9486ae
Deleted: sha256:04f203f1237b5650a141b4ab36105c696e8c3c10adb5bf3b333c221d2ffc861f
Deleted: sha256:4a3576666502e501a81ab131529814c01586db5b9c90ae7d42791d5211a0aabf
Deleted: sha256:8eb62b4253f53d16d3b4581616976acf4b4e7397763d44141d49bceeabfe0d9a
Deleted: sha256:0b0c15faa728b19a16d2bbfe4f57d3693ca76f7b3254794837e5df10967ffe94
Deleted: sha256:3fc812d5d8d04ba7a1cdfa860d554c608bfdf7861679b6d630c651a845dad0dc
Deleted: sha256:61873cbe3bb89cfe2a2c072649356f442ad6a082fbf4ab85344dfd46cfae6473
Deleted: sha256:ee85dc6cd7c8f4d6a2ed5327a617d59e27622c45a380ae2553971e9297b33db3
Deleted: sha256:2b860006e58e9ea111f10e6f8e0345b755c7a437958b6098818b2f46120b1ca6
Deleted: sha256:636b9bab1d0b7d540f2788ba8dbb182e4779af8c26ac5c46b8e01d4b054927ad
Deleted: sha256:6ca4cc988da1a47283a4cdc72fbbc19b25c011f73d4758ace942f36b154642d2
Deleted: sha256:519d7641d6d760aec3bc14ce61ae055ea0d8f87907cd6d7849e87278376e67f7
Deleted: sha256:eb00d6614d20652f43902a6cdeabe2447fcac111bffa439cf3e9cfbab7511182
Build step 'Execute shell' marked build as failure
Not sending mail to unregistered user neil.conway@gmail.com

Mime
View raw message