mesos-builds mailing list archives

Site index · List index
Message view « Date » · « Thread »
Top « Date » · « Thread »
From Apache Jenkins Server <jenk...@builds.apache.org>
Subject Build failed in Jenkins: Mesos-Buildbot » cmake,clang,--verbose,GLOG_v=1 MESOS_VERBOSE=1,ubuntu:14.04,(docker||Hadoop)&&(!ubuntu-us1)&&(!ubuntu-eu2) #3616
Date Sat, 06 May 2017 03:45:02 GMT
See <https://builds.apache.org/job/Mesos-Buildbot/BUILDTOOL=cmake,COMPILER=clang,CONFIGURATION=--verbose,ENVIRONMENT=GLOG_v=1%20MESOS_VERBOSE=1,OS=ubuntu%3A14.04,label_exp=(docker%7C%7CHadoop)&&(!ubuntu-us1)&&(!ubuntu-eu2)/3616/display/redirect>

------------------------------------------
[...truncated 23.52 MB...]
I0506 03:44:57.878551 24855 status_update_manager.cpp:177] Pausing sending status updates
I0506 03:44:57.879153 24861 state.cpp:62] Recovering state from '/tmp/Endpoint_SlaveEndpointTest_AuthorizedRequest_1_hPP4oC/meta'
I0506 03:44:57.879443 24864 status_update_manager.cpp:203] Recovering status update manager
I0506 03:44:57.879629 24857 containerizer.cpp:600] Recovering containerizer
I0506 03:44:57.880339 24863 provisioner.cpp:410] Provisioner recovery complete
I0506 03:44:57.880555 24857 slave.cpp:5550] Finished recovery
I0506 03:44:57.881124 24857 slave.cpp:5724] Querying resource estimator for oversubscribable
resources
I0506 03:44:57.881228 24855 slave.cpp:5738] Received oversubscribable resources {} from the
resource estimator
I0506 03:44:57.882045 24857 process.cpp:3704] Handling HTTP event for process 'slave(696)'
with path: '/slave(696)/monitor/statistics.json'
I0506 03:44:57.882583 24861 http.cpp:871] Authorizing principal 'test-principal' to GET the
'/monitor/statistics.json' endpoint
I0506 03:44:57.884057 24854 slave.cpp:803] Agent terminating
[       OK ] Endpoint/SlaveEndpointTest.AuthorizedRequest/1 (14 ms)
[ RUN      ] Endpoint/SlaveEndpointTest.AuthorizedRequest/2
I0506 03:44:57.889114 24852 containerizer.cpp:221] Using isolation: posix/cpu,posix/mem,filesystem/posix,network/cni
W0506 03:44:57.889392 24852 backend.cpp:76] Failed to create 'aufs' backend: AufsBackend requires
root privileges
W0506 03:44:57.889442 24852 backend.cpp:76] Failed to create 'bind' backend: BindBackend requires
root privileges
I0506 03:44:57.889462 24852 provisioner.cpp:249] Using default backend 'copy'
I0506 03:44:57.895092 24863 slave.cpp:211] Mesos agent started on (697)@172.17.0.2:39436
I0506 03:44:57.895124 24863 slave.cpp:212] Flags at startup: --acls="" --appc_simple_discovery_uri_prefix="http://"
--appc_store_dir="/tmp/mesos/store/appc" --authenticate_http_readonly="true" --authenticate_http_readwrite="true"
--authenticatee="crammd5" --authentication_backoff_factor="1secs" --authorizer="local" --cgroups_cpu_enable_pids_and_tids_count="false"
--cgroups_enable_cfs="false" --cgroups_hierarchy="/sys/fs/cgroup" --cgroups_limit_swap="false"
--cgroups_root="mesos" --container_disk_watch_interval="15secs" --containerizers="mesos" --credential="/tmp/Endpoint_SlaveEndpointTest_AuthorizedRequest_2_FvWKhu/credential"
--default_role="*" --disk_watch_interval="1mins" --docker="docker" --docker_kill_orphans="true"
--docker_registry="https://registry-1.docker.io" --docker_remove_delay="6hrs" --docker_socket="/var/run/docker.sock"
--docker_stop_timeout="0ns" --docker_store_dir="/tmp/mesos/store/docker" --docker_volume_checkpoint_dir="/var/run/mesos/isolators/docker/volume"
--enforce_container_disk_quota="false" --executor_registration_timeout="1mins" --executor_shutdown_grace_period="5secs"
--fetcher_cache_dir="/tmp/Endpoint_SlaveEndpointTest_AuthorizedRequest_2_FvWKhu/fetch" --fetcher_cache_size="2GB"
--frameworks_home="" --gc_delay="1weeks" --gc_disk_headroom="0.1" --hadoop_home="" --help="false"
--hostname_lookup="true" --http_authenticators="basic" --http_command_executor="false" --http_credentials="/tmp/Endpoint_SlaveEndpointTest_AuthorizedRequest_2_FvWKhu/http_credentials"
--http_heartbeat_interval="30secs" --initialize_driver_logging="true" --isolation="posix/cpu,posix/mem"
--launcher="posix" --launcher_dir="/mesos/build/src" --logbufsecs="0" --logging_level="INFO"
--max_completed_executors_per_framework="150" --oversubscribed_resources_interval="15secs"
--perf_duration="10secs" --perf_interval="1mins" --port="5051" --qos_correction_interval_min="0ns"
--quiet="false" --recover="reconnect" --recovery_timeout="15mins" --registration_backoff_factor="10ms"
--resources="cpus:2;gpus:0;mem:1024;disk:1024;ports:[31000-32000]" --revocable_cpu_low_priority="true"
--runtime_dir="/tmp/Endpoint_SlaveEndpointTest_AuthorizedRequest_2_FvWKhu" --sandbox_directory="/mnt/mesos/sandbox"
--strict="true" --switch_user="true" --systemd_enable_support="true" --systemd_runtime_directory="/run/systemd/system"
--version="false" --work_dir="/tmp/Endpoint_SlaveEndpointTest_AuthorizedRequest_2_88qHTv"
I0506 03:44:57.895486 24863 credentials.hpp:86] Loading credential for authentication from
'/tmp/Endpoint_SlaveEndpointTest_AuthorizedRequest_2_FvWKhu/credential'
I0506 03:44:57.895676 24863 slave.cpp:354] Agent using credential for: test-principal
I0506 03:44:57.895694 24863 credentials.hpp:37] Loading credentials for authentication from
'/tmp/Endpoint_SlaveEndpointTest_AuthorizedRequest_2_FvWKhu/http_credentials'
I0506 03:44:57.895817 24863 http.cpp:919] Using default 'basic' HTTP authenticator for realm
'mesos-agent-readonly'
I0506 03:44:57.895941 24863 http.cpp:919] Using default 'basic' HTTP authenticator for realm
'mesos-agent-readwrite'
I0506 03:44:57.896448 24863 slave.cpp:541] Agent resources: cpus(*):2; mem(*):1024; disk(*):1024;
ports(*):[31000-32000]
I0506 03:44:57.896482 24863 slave.cpp:549] Agent attributes: [  ]
I0506 03:44:57.896491 24863 slave.cpp:554] Agent hostname: 948913b9caef
I0506 03:44:57.896836 24863 status_update_manager.cpp:177] Pausing sending status updates
I0506 03:44:57.896992 24860 state.cpp:62] Recovering state from '/tmp/Endpoint_SlaveEndpointTest_AuthorizedRequest_2_88qHTv/meta'
I0506 03:44:57.897131 24860 status_update_manager.cpp:203] Recovering status update manager
I0506 03:44:57.897198 24860 containerizer.cpp:600] Recovering containerizer
I0506 03:44:57.897783 24860 provisioner.cpp:410] Provisioner recovery complete
I0506 03:44:57.897914 24860 slave.cpp:5550] Finished recovery
I0506 03:44:57.898320 24860 slave.cpp:5724] Querying resource estimator for oversubscribable
resources
I0506 03:44:57.898461 24860 slave.cpp:5738] Received oversubscribable resources {} from the
resource estimator
I0506 03:44:57.899509 24860 process.cpp:3704] Handling HTTP event for process 'slave(697)'
with path: '/slave(697)/containers'
I0506 03:44:57.900025 24862 http.cpp:871] Authorizing principal 'test-principal' to GET the
'/containers' endpoint
I0506 03:44:57.901688 24856 slave.cpp:803] Agent terminating
[       OK ] Endpoint/SlaveEndpointTest.AuthorizedRequest/2 (17 ms)
[ RUN      ] Endpoint/SlaveEndpointTest.UnauthorizedRequest/0
I0506 03:44:57.906951 24852 containerizer.cpp:221] Using isolation: posix/cpu,posix/mem,filesystem/posix,network/cni
W0506 03:44:57.907234 24852 backend.cpp:76] Failed to create 'aufs' backend: AufsBackend requires
root privileges
W0506 03:44:57.907287 24852 backend.cpp:76] Failed to create 'bind' backend: BindBackend requires
root privileges
I0506 03:44:57.907326 24852 provisioner.cpp:249] Using default backend 'copy'
I0506 03:44:57.908433 24866 slave.cpp:211] Mesos agent started on (698)@172.17.0.2:39436
I0506 03:44:57.908479 24866 slave.cpp:212] Flags at startup: --acls="" --appc_simple_discovery_uri_prefix="http://"
--appc_store_dir="/tmp/mesos/store/appc" --authenticate_http_readonly="true" --authenticate_http_readwrite="true"
--authenticatee="crammd5" --authentication_backoff_factor="1secs" --authorizer="local" --cgroups_cpu_enable_pids_and_tids_count="false"
--cgroups_enable_cfs="false" --cgroups_hierarchy="/sys/fs/cgroup" --cgroups_limit_swap="false"
--cgroups_root="mesos" --container_disk_watch_interval="15secs" --containerizers="mesos" --credential="/tmp/Endpoint_SlaveEndpointTest_UnauthorizedRequest_0_txi8Zn/credential"
--default_role="*" --disk_watch_interval="1mins" --docker="docker" --docker_kill_orphans="true"
--docker_registry="https://registry-1.docker.io" --docker_remove_delay="6hrs" --docker_socket="/var/run/docker.sock"
--docker_stop_timeout="0ns" --docker_store_dir="/tmp/mesos/store/docker" --docker_volume_checkpoint_dir="/var/run/mesos/isolators/docker/volume"
--enforce_container_disk_quota="false" --executor_registration_timeout="1mins" --executor_shutdown_grace_period="5secs"
--fetcher_cache_dir="/tmp/Endpoint_SlaveEndpointTest_UnauthorizedRequest_0_txi8Zn/fetch" --fetcher_cache_size="2GB"
--frameworks_home="" --gc_delay="1weeks" --gc_disk_headroom="0.1" --hadoop_home="" --help="false"
--hostname_lookup="true" --http_authenticators="basic" --http_command_executor="false" --http_credentials="/tmp/Endpoint_SlaveEndpointTest_UnauthorizedRequest_0_txi8Zn/http_credentials"
--http_heartbeat_interval="30secs" --initialize_driver_logging="true" --isolation="posix/cpu,posix/mem"
--launcher="posix" --launcher_dir="/mesos/build/src" --logbufsecs="0" --logging_level="INFO"
--max_completed_executors_per_framework="150" --oversubscribed_resources_interval="15secs"
--perf_duration="10secs" --perf_interval="1mins" --port="5051" --qos_correction_interval_min="0ns"
--quiet="false" --recover="reconnect" --recovery_timeout="15mins" --registration_backoff_factor="10ms"
--resources="cpus:2;gpus:0;mem:1024;disk:1024;ports:[31000-32000]" --revocable_cpu_low_priority="true"
--runtime_dir="/tmp/Endpoint_SlaveEndpointTest_UnauthorizedRequest_0_txi8Zn" --sandbox_directory="/mnt/mesos/sandbox"
--strict="true" --switch_user="true" --systemd_enable_support="true" --systemd_runtime_directory="/run/systemd/system"
--version="false" --work_dir="/tmp/Endpoint_SlaveEndpointTest_UnauthorizedRequest_0_hFObzp"
I0506 03:44:57.908731 24866 credentials.hpp:86] Loading credential for authentication from
'/tmp/Endpoint_SlaveEndpointTest_UnauthorizedRequest_0_txi8Zn/credential'
I0506 03:44:57.908831 24866 slave.cpp:354] Agent using credential for: test-principal
I0506 03:44:57.908843 24866 credentials.hpp:37] Loading credentials for authentication from
'/tmp/Endpoint_SlaveEndpointTest_UnauthorizedRequest_0_txi8Zn/http_credentials'
I0506 03:44:57.908960 24866 http.cpp:919] Using default 'basic' HTTP authenticator for realm
'mesos-agent-readonly'
I0506 03:44:57.909019 24866 http.cpp:919] Using default 'basic' HTTP authenticator for realm
'mesos-agent-readwrite'
I0506 03:44:57.909392 24866 slave.cpp:541] Agent resources: cpus(*):2; mem(*):1024; disk(*):1024;
ports(*):[31000-32000]
I0506 03:44:57.909425 24866 slave.cpp:549] Agent attributes: [  ]
I0506 03:44:57.909432 24866 slave.cpp:554] Agent hostname: 948913b9caef
I0506 03:44:57.909519 24853 status_update_manager.cpp:177] Pausing sending status updates
I0506 03:44:57.909818 24866 state.cpp:62] Recovering state from '/tmp/Endpoint_SlaveEndpointTest_UnauthorizedRequest_0_hFObzp/meta'
I0506 03:44:57.910042 24866 status_update_manager.cpp:203] Recovering status update manager
I0506 03:44:57.910233 24862 containerizer.cpp:600] Recovering containerizer
I0506 03:44:57.910779 24862 provisioner.cpp:410] Provisioner recovery complete
I0506 03:44:57.911149 24862 slave.cpp:5550] Finished recovery
I0506 03:44:57.912119 24862 slave.cpp:5724] Querying resource estimator for oversubscribable
resources
I0506 03:44:57.912478 24862 slave.cpp:5738] Received oversubscribable resources {} from the
resource estimator
I0506 03:44:57.913616 24861 process.cpp:3704] Handling HTTP event for process 'slave(698)'
with path: '/slave(698)/monitor/statistics'
I0506 03:44:57.914312 24855 http.cpp:871] Authorizing principal 'test-principal' to GET the
'/monitor/statistics' endpoint
I0506 03:44:57.915783 24864 slave.cpp:803] Agent terminating
[       OK ] Endpoint/SlaveEndpointTest.UnauthorizedRequest/0 (20 ms)
[ RUN      ] Endpoint/SlaveEndpointTest.UnauthorizedRequest/1
I0506 03:44:57.927502 24852 containerizer.cpp:221] Using isolation: posix/cpu,posix/mem,filesystem/posix,network/cni
W0506 03:44:57.927742 24852 backend.cpp:76] Failed to create 'aufs' backend: AufsBackend requires
root privileges
W0506 03:44:57.927778 24852 backend.cpp:76] Failed to create 'bind' backend: BindBackend requires
root privileges
I0506 03:44:57.927793 24852 provisioner.cpp:249] Using default backend 'copy'
I0506 03:44:57.930968 24864 slave.cpp:211] Mesos agent started on (699)@172.17.0.2:39436
I0506 03:44:57.931005 24864 slave.cpp:212] Flags at startup: --acls="" --appc_simple_discovery_uri_prefix="http://"
--appc_store_dir="/tmp/mesos/store/appc" --authenticate_http_readonly="true" --authenticate_http_readwrite="true"
--authenticatee="crammd5" --authentication_backoff_factor="1secs" --authorizer="local" --cgroups_cpu_enable_pids_and_tids_count="false"
--cgroups_enable_cfs="false" --cgroups_hierarchy="/sys/fs/cgroup" --cgroups_limit_swap="false"
--cgroups_root="mesos" --container_disk_watch_interval="15secs" --containerizers="mesos" --credential="/tmp/Endpoint_SlaveEndpointTest_UnauthorizedRequest_1_ARQGUh/credential"
--default_role="*" --disk_watch_interval="1mins" --docker="docker" --docker_kill_orphans="true"
--docker_registry="https://registry-1.docker.io" --docker_remove_delay="6hrs" --docker_socket="/var/run/docker.sock"
--docker_stop_timeout="0ns" --docker_store_dir="/tmp/mesos/store/docker" --docker_volume_checkpoint_dir="/var/run/mesos/isolators/docker/volume"
--enforce_container_disk_quota="false" --executor_registration_timeout="1mins" --executor_shutdown_grace_period="5secs"
--fetcher_cache_dir="/tmp/Endpoint_SlaveEndpointTest_UnauthorizedRequest_1_ARQGUh/fetch" --fetcher_cache_size="2GB"
--frameworks_home="" --gc_delay="1weeks" --gc_disk_headroom="0.1" --hadoop_home="" --help="false"
--hostname_lookup="true" --http_authenticators="basic" --http_command_executor="false" --http_credentials="/tmp/Endpoint_SlaveEndpointTest_UnauthorizedRequest_1_ARQGUh/http_credentials"
--http_heartbeat_interval="30secs" --initialize_driver_logging="true" --isolation="posix/cpu,posix/mem"
--launcher="posix" --launcher_dir="/mesos/build/src" --logbufsecs="0" --logging_level="INFO"
--max_completed_executors_per_framework="150" --oversubscribed_resources_interval="15secs"
--perf_duration="10secs" --perf_interval="1mins" --port="5051" --qos_correction_interval_min="0ns"
--quiet="false" --recover="reconnect" --recovery_timeout="15mins" --registration_backoff_factor="10ms"
--resources="cpus:2;gpus:0;mem:1024;disk:1024;ports:[31000-32000]" --revocable_cpu_low_priority="true"
--runtime_dir="/tmp/Endpoint_SlaveEndpointTest_UnauthorizedRequest_1_ARQGUh" --sandbox_directory="/mnt/mesos/sandbox"
--strict="true" --switch_user="true" --systemd_enable_support="true" --systemd_runtime_directory="/run/systemd/system"
--version="false" --work_dir="/tmp/Endpoint_SlaveEndpointTest_UnauthorizedRequest_1_E8Xpqj"
I0506 03:44:57.931952 24864 credentials.hpp:86] Loading credential for authentication from
'/tmp/Endpoint_SlaveEndpointTest_UnauthorizedRequest_1_ARQGUh/credential'
I0506 03:44:57.932340 24864 slave.cpp:354] Agent using credential for: test-principal
I0506 03:44:57.932590 24864 credentials.hpp:37] Loading credentials for authentication from
'/tmp/Endpoint_SlaveEndpointTest_UnauthorizedRequest_1_ARQGUh/http_credentials'
I0506 03:44:57.932977 24864 http.cpp:919] Using default 'basic' HTTP authenticator for realm
'mesos-agent-readonly'
I0506 03:44:57.933300 24864 http.cpp:919] Using default 'basic' HTTP authenticator for realm
'mesos-agent-readwrite'
I0506 03:44:57.934140 24864 slave.cpp:541] Agent resources: cpus(*):2; mem(*):1024; disk(*):1024;
ports(*):[31000-32000]
I0506 03:44:57.934517 24864 slave.cpp:549] Agent attributes: [  ]
I0506 03:44:57.934784 24864 slave.cpp:554] Agent hostname: 948913b9caef
I0506 03:44:57.935428 24866 status_update_manager.cpp:177] Pausing sending status updates
I0506 03:44:57.936724 24868 state.cpp:62] Recovering state from '/tmp/Endpoint_SlaveEndpointTest_UnauthorizedRequest_1_E8Xpqj/meta'
I0506 03:44:57.939134 24868 status_update_manager.cpp:203] Recovering status update manager
I0506 03:44:57.939246 24866 containerizer.cpp:600] Recovering containerizer
I0506 03:44:57.940255 24857 provisioner.cpp:410] Provisioner recovery complete
I0506 03:44:57.940481 24857 slave.cpp:5550] Finished recovery
I0506 03:44:57.941069 24857 slave.cpp:5724] Querying resource estimator for oversubscribable
resources
I0506 03:44:57.941287 24855 slave.cpp:5738] Received oversubscribable resources {} from the
resource estimator
I0506 03:44:57.942487 24859 process.cpp:3704] Handling HTTP event for process 'slave(699)'
with path: '/slave(699)/monitor/statistics.json'
I0506 03:44:57.942961 24859 http.cpp:871] Authorizing principal 'test-principal' to GET the
'/monitor/statistics.json' endpoint
I0506 03:44:57.944115 24861 slave.cpp:803] Agent terminating
[       OK ] Endpoint/SlaveEndpointTest.UnauthorizedRequest/1 (21 ms)
[ RUN      ] Endpoint/SlaveEndpointTest.UnauthorizedRequest/2
I0506 03:44:57.950259 24852 containerizer.cpp:221] Using isolation: posix/cpu,posix/mem,filesystem/posix,network/cni
W0506 03:44:57.950611 24852 backend.cpp:76] Failed to create 'aufs' backend: AufsBackend requires
root privileges
W0506 03:44:57.950660 24852 backend.cpp:76] Failed to create 'bind' backend: BindBackend requires
root privileges
I0506 03:44:57.950698 24852 provisioner.cpp:249] Using default backend 'copy'
I0506 03:44:57.952041 24860 slave.cpp:211] Mesos agent started on (700)@172.17.0.2:39436
I0506 03:44:57.952123 24860 slave.cpp:212] Flags at startup: --acls="" --appc_simple_discovery_uri_prefix="http://"
--appc_store_dir="/tmp/mesos/store/appc" --authenticate_http_readonly="true" --authenticate_http_readwrite="true"
--authenticatee="crammd5" --authentication_backoff_factor="1secs" --authorizer="local" --cgroups_cpu_enable_pids_and_tids_count="false"
--cgroups_enable_cfs="false" --cgroups_hierarchy="/sys/fs/cgroup" --cgroups_limit_swap="false"
--cgroups_root="mesos" --container_disk_watch_interval="15secs" --containerizers="mesos" --credential="/tmp/Endpoint_SlaveEndpointTest_UnauthorizedRequest_2_KbKN4b/credential"
--default_role="*" --disk_watch_interval="1mins" --docker="docker" --docker_kill_orphans="true"
--docker_registry="https://registry-1.docker.io" --docker_remove_delay="6hrs" --docker_socket="/var/run/docker.sock"
--docker_stop_timeout="0ns" --docker_store_dir="/tmp/mesos/store/docker" --docker_volume_checkpoint_dir="/var/run/mesos/isolators/docker/volume"
--enforce_container_disk_quota="false" --executor_registration_timeout="1mins" --executor_shutdown_grace_period="5secs"
--fetcher_cache_dir="/tmp/Endpoint_SlaveEndpointTest_UnauthorizedRequest_2_KbKN4b/fetch" --fetcher_cache_size="2GB"
--frameworks_home="" --gc_delay="1weeks" --gc_disk_headroom="0.1" --hadoop_home="" --help="false"
--hostname_lookup="true" --http_authenticators="basic" --http_command_executor="false" --http_credentials="/tmp/Endpoint_SlaveEndpointTest_UnauthorizedRequest_2_KbKN4b/http_credentials"
--http_heartbeat_interval="30secs" --initialize_driver_logging="true" --isolation="posix/cpu,posix/mem"
--launcher="posix" --launcher_dir="/mesos/build/src" --logbufsecs="0" --logging_level="INFO"
--max_completed_executors_per_framework="150" --oversubscribed_resources_interval="15secs"
--perf_duration="10secs" --perf_interval="1mins" --port="5051" --qos_correction_interval_min="0ns"
--quiet="false" --recover="reconnect" --recovery_timeout="15mins" --registration_backoff_factor="10ms"
--resources="cpus:2;gpus:0;mem:1024;disk:1024;ports:[31000-32000]" --revocable_cpu_low_priority="true"
--runtime_dir="/tmp/Endpoint_SlaveEndpointTest_UnauthorizedRequest_2_KbKN4b" --sandbox_directory="/mnt/mesos/sandbox"
--strict="true" --switch_user="true" --systemd_enable_support="true" --systemd_runtime_directory="/run/systemd/system"
--version="false" --work_dir="/tmp/Endpoint_SlaveEndpointTest_UnauthorizedRequest_2_qgRTwd"
I0506 03:44:57.952385 24860 credentials.hpp:86] Loading credential for authentication from
'/tmp/Endpoint_SlaveEndpointTest_UnauthorizedRequest_2_KbKN4b/credential'
I0506 03:44:57.952481 24860 slave.cpp:354] Agent using credential for: test-principal
I0506 03:44:57.952494 24860 credentials.hpp:37] Loading credentials for authentication from
'/tmp/Endpoint_SlaveEndpointTest_UnauthorizedRequest_2_KbKN4b/http_credentials'
I0506 03:44:57.952615 24860 http.cpp:919] Using default 'basic' HTTP authenticator for realm
'mesos-agent-readonly'
I0506 03:44:57.952666 24860 http.cpp:919] Using default 'basic' HTTP authenticator for realm
'mesos-agent-readwrite'
I0506 03:44:57.953052 24860 slave.cpp:541] Agent resources: cpus(*):2; mem(*):1024; disk(*):1024;
ports(*):[31000-32000]
I0506 03:44:57.953084 24860 slave.cpp:549] Agent attributes: [  ]
I0506 03:44:57.953092 24860 slave.cpp:554] Agent hostname: 948913b9caef
I0506 03:44:57.953166 24856 status_update_manager.cpp:177] Pausing sending status updates
I0506 03:44:57.953465 24853 state.cpp:62] Recovering state from '/tmp/Endpoint_SlaveEndpointTest_UnauthorizedRequest_2_qgRTwd/meta'
I0506 03:44:57.953585 24861 status_update_manager.cpp:203] Recovering status update manager
I0506 03:44:57.953765 24858 containerizer.cpp:600] Recovering containerizer
I0506 03:44:57.954277 24862 provisioner.cpp:410] Provisioner recovery complete
I0506 03:44:57.954453 24865 slave.cpp:5550] Finished recovery
I0506 03:44:57.954926 24865 slave.cpp:5724] Querying resource estimator for oversubscribable
resources
I0506 03:44:57.955076 24856 slave.cpp:5738] Received oversubscribable resources {} from the
resource estimator
I0506 03:44:57.955765 24862 process.cpp:3704] Handling HTTP event for process 'slave(700)'
with path: '/slave(700)/containers'
I0506 03:44:57.956207 24853 http.cpp:871] Authorizing principal 'test-principal' to GET the
'/containers' endpoint
I0506 03:44:57.957142 24868 slave.cpp:803] Agent terminating
[       OK ] Endpoint/SlaveEndpointTest.UnauthorizedRequest/2 (13 ms)
[ RUN      ] Endpoint/SlaveEndpointTest.NoAuthorizer/0
I0506 03:44:57.962636 24852 containerizer.cpp:221] Using isolation: posix/cpu,posix/mem,filesystem/posix,network/cni
W0506 03:44:57.962885 24852 backend.cpp:76] Failed to create 'aufs' backend: AufsBackend requires
root privileges
W0506 03:44:57.962952 24852 backend.cpp:76] Failed to create 'bind' backend: BindBackend requires
root privileges
I0506 03:44:57.962972 24852 provisioner.cpp:249] Using default backend 'copy'
I0506 03:44:57.963515 24852 cluster.cpp:446] Creating default 'local' authorizer
I0506 03:44:57.963976 24862 slave.cpp:211] Mesos agent started on (701)@172.17.0.2:39436
I0506 03:44:57.964004 24862 slave.cpp:212] Flags at startup: --acls="" --appc_simple_discovery_uri_prefix="http://"
--appc_store_dir="/tmp/mesos/store/appc" --authenticate_http_readonly="true" --authenticate_http_readwrite="true"
--authenticatee="crammd5" --authentication_backoff_factor="1secs" --authorizer="local" --cgroups_cpu_enable_pids_and_tids_count="false"
--cgroups_enable_cfs="false" --cgroups_hierarchy="/sys/fs/cgroup" --cgroups_limit_swap="false"
--cgroups_root="mesos" --container_disk_watch_interval="15secs" --containerizers="mesos" --credential="/tmp/Endpoint_SlaveEndpointTest_NoAuthorizer_0_CuAwn6/credential"
--default_role="*" --disk_watch_interval="1mins" --docker="docker" --docker_kill_orphans="true"
--docker_registry="https://registry-1.docker.io" --docker_remove_delay="6hrs" --docker_socket="/var/run/docker.sock"
--docker_stop_timeout="0ns" --docker_store_dir="/tmp/mesos/store/docker" --docker_volume_checkpoint_dir="/var/run/mesos/isolators/docker/volume"
--enforce_container_disk_quota="false" --executor_registration_timeout="1mins" --executor_shutdown_grace_period="5secs"
--fetcher_cache_dir="/tmp/Endpoint_SlaveEndpointTest_NoAuthorizer_0_CuAwn6/fetch" --fetcher_cache_size="2GB"
--frameworks_home="" --gc_delay="1weeks" --gc_disk_headroom="0.1" --hadoop_home="" --help="false"
--hostname_lookup="true" --http_authenticators="basic" --http_command_executor="false" --http_credentials="/tmp/Endpoint_SlaveEndpointTest_NoAuthorizer_0_CuAwn6/http_credentials"
--http_heartbeat_interval="30secs" --initialize_driver_logging="true" --isolation="posix/cpu,posix/mem"
--launcher="posix" --launcher_dir="/mesos/build/src" --logbufsecs="0" --logging_level="INFO"
--max_completed_executors_per_framework="150" --oversubscribed_resources_interval="15secs"
--perf_duration="10secs" --perf_interval="1mins" --port="5051" --qos_correction_interval_min="0ns"
--quiet="false" --recover="reconnect" --recovery_timeout="15mins" --registration_backoff_factor="10ms"
--resources="cpus:2;gpus:0;mem:1024;disk:1024;ports:[31000-32000]" --revocable_cpu_low_priority="true"
--runtime_dir="/tmp/Endpoint_SlaveEndpointTest_NoAuthorizer_0_CuAwn6" --sandbox_directory="/mnt/mesos/sandbox"
--strict="true" --switch_user="true" --systemd_enable_support="true" --systemd_runtime_directory="/run/systemd/system"
--version="false" --work_dir="/tmp/Endpoint_SlaveEndpointTest_NoAuthorizer_0_RqcxN7"
I0506 03:44:57.964380 24862 credentials.hpp:86] Loading credential for authentication from
'/tmp/Endpoint_SlaveEndpointTest_NoAuthorizer_0_CuAwn6/credential'
I0506 03:44:57.964484 24862 slave.cpp:354] Agent using credential for: test-principal
I0506 03:44:57.964500 24862 credentials.hpp:37] Loading credentials for authentication from
'/tmp/Endpoint_SlaveEndpointTest_NoAuthorizer_0_CuAwn6/http_credentials'
I0506 03:44:57.964615 24862 http.cpp:919] Using default 'basic' HTTP authenticator for realm
'mesos-agent-readonly'
I0506 03:44:57.964668 24862 http.cpp:919] Using default 'basic' HTTP authenticator for realm
'mesos-agent-readwrite'
I0506 03:44:57.965139 24862 slave.cpp:541] Agent resources: cpus(*):2; mem(*):1024; disk(*):1024;
ports(*):[31000-32000]
I0506 03:44:57.965183 24862 slave.cpp:549] Agent attributes: [  ]
I0506 03:44:57.965193 24862 slave.cpp:554] Agent hostname: 948913b9caef
I0506 03:44:57.965569 24862 status_update_manager.cpp:177] Pausing sending status updates
I0506 03:44:57.965843 24862 state.cpp:62] Recovering state from '/tmp/Endpoint_SlaveEndpointTest_NoAuthorizer_0_RqcxN7/meta'
I0506 03:44:57.965977 24862 status_update_manager.cpp:203] Recovering status update manager
I0506 03:44:57.966033 24862 containerizer.cpp:600] Recovering containerizer
I0506 03:44:57.966531 24862 provisioner.cpp:410] Provisioner recovery complete
I0506 03:44:57.966670 24862 slave.cpp:5550] Finished recovery
I0506 03:44:57.967097 24862 slave.cpp:5724] Querying resource estimator for oversubscribable
resources
I0506 03:44:57.967205 24856 slave.cpp:5738] Received oversubscribable resources {} from the
resource estimator
I0506 03:44:57.967917 24862 process.cpp:3704] Handling HTTP event for process 'slave(701)'
with path: '/slave(701)/monitor/statistics'
I0506 03:44:57.968354 24859 http.cpp:871] Authorizing principal 'test-principal' to GET the
'/monitor/statistics' endpoint
I0506 03:44:57.969768 24862 slave.cpp:803] Agent terminating
[       OK ] Endpoint/SlaveEndpointTest.NoAuthorizer/0 (11 ms)
[ RUN      ] Endpoint/SlaveEndpointTest.NoAuthorizer/1
I0506 03:44:57.974023 24852 containerizer.cpp:221] Using isolation: posix/cpu,posix/mem,filesystem/posix,network/cni
W0506 03:44:57.974334 24852 backend.cpp:76] Failed to create 'aufs' backend: AufsBackend requires
root privileges
W0506 03:44:57.974401 24852 backend.cpp:76] Failed to create 'bind' backend: BindBackend requires
root privileges
I0506 03:44:57.974416 24852 provisioner.cpp:249] Using default backend 'copy'
I0506 03:44:57.974980 24852 cluster.cpp:446] Creating default 'local' authorizer
I0506 03:44:57.975479 24853 slave.cpp:211] Mesos agent started on (702)@172.17.0.2:39436
I0506 03:44:57.975507 24853 slave.cpp:212] Flags at startup: --acls="" --appc_simple_discovery_uri_prefix="http://"
--appc_store_dir="/tmp/mesos/store/appc" --authenticate_http_readonly="true" --authenticate_http_readwrite="true"
--authenticatee="crammd5" --authentication_backoff_factor="1secs" --authorizer="local" --cgroups_cpu_enable_pids_and_tids_count="false"
--cgroups_enable_cfs="false" --cgroups_hierarchy="/sys/fs/cgroup" --cgroups_limit_swap="false"
--cgroups_root="mesos" --container_disk_watch_interval="15secs" --containerizers="mesos" --credential="/tmp/Endpoint_SlaveEndpointTest_NoAuthorizer_1_Ox3MN0/credential"
--default_role="*" --disk_watch_interval="1mins" --docker="docker" --docker_kill_orphans="true"
--docker_registry="https://registry-1.docker.io" --docker_remove_delay="6hrs" --docker_socket="/var/run/docker.sock"
--docker_stop_timeout="0ns" --docker_store_dir="/tmp/mesos/store/docker" --docker_volume_checkpoint_dir="/var/run/mesos/isolators/docker/volume"
--enforce_container_disk_quota="false" --executor_registration_timeout="1mins" --executor_shutdown_grace_period="5secs"
--fetcher_cache_dir="/tmp/Endpoint_SlaveEndpointTest_NoAuthorizer_1_Ox3MN0/fetch" --fetcher_cache_size="2GB"
--frameworks_home="" --gc_delay="1weeks" --gc_disk_headroom="0.1" --hadoop_home="" --help="false"
--hostname_lookup="true" --http_authenticators="basic" --http_command_executor="false" --http_credentials="/tmp/Endpoint_SlaveEndpointTest_NoAuthorizer_1_Ox3MN0/http_credentials"
--http_heartbeat_interval="30secs" --initialize_driver_logging="true" --isolation="posix/cpu,posix/mem"
--launcher="posix" --launcher_dir="/mesos/build/src" --logbufsecs="0" --logging_level="INFO"
--max_completed_executors_per_framework="150" --oversubscribed_resources_interval="15secs"
--perf_duration="10secs" --perf_interval="1mins" --port="5051" --qos_correction_interval_min="0ns"
--quiet="false" --recover="reconnect" --recovery_timeout="15mins" --registration_backoff_factor="10ms"
--resources="cpus:2;gpus:0;mem:1024;disk:1024;ports:[31000-32000]" --revocable_cpu_low_priority="true"
--runtime_dir="/tmp/Endpoint_SlaveEndpointTest_NoAuthorizer_1_Ox3MN0" --sandbox_directory="/mnt/mesos/sandbox"
--strict="true" --switch_user="true" --systemd_enable_support="true" --systemd_runtime_directory="/run/systemd/system"
--version="false" --work_dir="/tmp/Endpoint_SlaveEndpointTest_NoAuthorizer_1_dVrWb2"
I0506 03:44:57.975903 24853 credentials.hpp:86] Loading credential for authentication from
'/tmp/Endpoint_SlaveEndpointTest_NoAuthorizer_1_Ox3MN0/credential'
I0506 03:44:57.976003 24853 slave.cpp:354] Agent using credential for: test-principal
I0506 03:44:57.976018 24853 credentials.hpp:37] Loading credentials for authentication from
'/tmp/Endpoint_SlaveEndpointTest_NoAuthorizer_1_Ox3MN0/http_credentials'
I0506 03:44:57.976136 24853 http.cpp:919] Using default 'basic' HTTP authenticator for realm
'mesos-agent-readonly'
I0506 03:44:57.976204 24853 http.cpp:919] Using default 'basic' HTTP authenticator for realm
'mesos-agent-readwrite'
I0506 03:44:57.976683 24853 slave.cpp:541] Agent resources: cpus(*):2; mem(*):1024; disk(*):1024;
ports(*):[31000-32000]
I0506 03:44:57.976730 24853 slave.cpp:549] Agent attributes: [  ]
I0506 03:44:57.976740 24853 slave.cpp:554] Agent hostname: 948913b9caef
I0506 03:44:57.976809 24861 status_update_manager.cpp:177] Pausing sending status updates
I0506 03:44:57.977169 24865 state.cpp:62] Recovering state from '/tmp/Endpoint_SlaveEndpointTest_NoAuthorizer_1_dVrWb2/meta'
I0506 03:44:57.977313 24853 status_update_manager.cpp:203] Recovering status update manager
I0506 03:44:57.977540 24854 containerizer.cpp:600] Recovering containerizer
I0506 03:44:57.978075 24867 provisioner.cpp:410] Provisioner recovery complete
I0506 03:44:57.978260 24864 slave.cpp:5550] Finished recovery
I0506 03:44:57.978669 24864 slave.cpp:5724] Querying resource estimator for oversubscribable
resources
I0506 03:44:57.978958 24856 slave.cpp:5738] Received oversubscribable resources {} from the
resource estimator
I0506 03:44:57.979866 24856 process.cpp:3704] Handling HTTP event for process 'slave(702)'
with path: '/slave(702)/monitor/statistics.json'
I0506 03:44:57.980290 24865 http.cpp:871] Authorizing principal 'test-principal' to GET the
'/monitor/statistics.json' endpoint
I0506 03:44:57.981539 24855 slave.cpp:803] Agent terminating
[       OK ] Endpoint/SlaveEndpointTest.NoAuthorizer/1 (11 ms)
[ RUN      ] Endpoint/SlaveEndpointTest.NoAuthorizer/2
I0506 03:44:57.986126 24852 containerizer.cpp:221] Using isolation: posix/cpu,posix/mem,filesystem/posix,network/cni
W0506 03:44:57.986402 24852 backend.cpp:76] Failed to create 'aufs' backend: AufsBackend requires
root privileges
W0506 03:44:57.986441 24852 backend.cpp:76] Failed to create 'bind' backend: BindBackend requires
root privileges
I0506 03:44:57.986456 24852 provisioner.cpp:249] Using default backend 'copy'
I0506 03:44:57.987036 24852 cluster.cpp:446] Creating default 'local' authorizer
I0506 03:44:57.988829 24866 slave.cpp:211] Mesos agent started on (703)@172.17.0.2:39436
I0506 03:44:57.988865 24866 slave.cpp:212] Flags at startup: --acls="" --appc_simple_discovery_uri_prefix="http://"
--appc_store_dir="/tmp/mesos/store/appc" --authenticate_http_readonly="true" --authenticate_http_readwrite="true"
--authenticatee="crammd5" --authentication_backoff_factor="1secs" --authorizer="local" --cgroups_cpu_enable_pids_and_tids_count="false"
--cgroups_enable_cfs="false" --cgroups_hierarchy="/sys/fs/cgroup" --cgroups_limit_swap="false"
--cgroups_root="mesos" --container_disk_watch_interval="15secs" --containerizers="mesos" --credential="/tmp/Endpoint_SlaveEndpointTest_NoAuthorizer_2_UX7NlV/credential"
--default_role="*" --disk_watch_interval="1mins" --docker="docker" --docker_kill_orphans="true"
--docker_registry="https://registry-1.docker.io" --docker_remove_delay="6hrs" --docker_socket="/var/run/docker.sock"
--docker_stop_timeout="0ns" --docker_store_dir="/tmp/mesos/store/docker" --docker_volume_checkpoint_dir="/var/run/mesos/isolators/docker/volume"
--enforce_container_disk_quota="false" --executor_registration_timeout="1mins" --executor_shutdown_grace_period="5secs"
--fetcher_cache_dir="/tmp/Endpoint_SlaveEndpointTest_NoAuthorizer_2_UX7NlV/fetch" --fetcher_cache_size="2GB"
--frameworks_home="" --gc_delay="1weeks" --gc_disk_headroom="0.1" --hadoop_home="" --help="false"
--hostname_lookup="true" --http_authenticators="basic" --http_command_executor="false" --http_credentials="/tmp/Endpoint_SlaveEndpointTest_NoAuthorizer_2_UX7NlV/http_credentials"
--http_heartbeat_interval="30secs" --initialize_driver_logging="true" --isolation="posix/cpu,posix/mem"
--launcher="posix" --launcher_dir="/mesos/build/src" --logbufsecs="0" --logging_level="INFO"
--max_completed_executors_per_framework="150" --oversubscribed_resources_interval="15secs"
--perf_duration="10secs" --perf_interval="1mins" --port="5051" --qos_correction_interval_min="0ns"
--quiet="false" --recover="reconnect" --recovery_timeout="15mins" --registration_backoff_factor="10ms"
--resources="cpus:2;gpus:0;mem:1024;disk:1024;ports:[31000-32000]" --revocable_cpu_low_priority="true"
--runtime_dir="/tmp/Endpoint_SlaveEndpointTest_NoAuthorizer_2_UX7NlV" --sandbox_directory="/mnt/mesos/sandbox"
--strict="true" --switch_user="true" --systemd_enable_support="true" --systemd_runtime_directory="/run/systemd/system"
--version="false" --work_dir="/tmp/Endpoint_SlaveEndpointTest_NoAuthorizer_2_OYl0HW"
I0506 03:44:57.989297 24866 credentials.hpp:86] Loading credential for authentication from
'/tmp/Endpoint_SlaveEndpointTest_NoAuthorizer_2_UX7NlV/credential'
I0506 03:44:57.989518 24866 slave.cpp:354] Agent using credential for: test-principal
I0506 03:44:57.989532 24866 credentials.hpp:37] Loading credentials for authentication from
'/tmp/Endpoint_SlaveEndpointTest_NoAuthorizer_2_UX7NlV/http_credentials'
I0506 03:44:57.989656 24866 http.cpp:919] Using default 'basic' HTTP authenticator for realm
'mesos-agent-readonly'
I0506 03:44:57.989709 24866 http.cpp:919] Using default 'basic' HTTP authenticator for realm
'mesos-agent-readwrite'
I0506 03:44:57.990172 24866 slave.cpp:541] Agent resources: cpus(*):2; mem(*):1024; disk(*):1024;
ports(*):[31000-32000]
I0506 03:44:57.990213 24866 slave.cpp:549] Agent attributes: [  ]
I0506 03:44:57.990221 24866 slave.cpp:554] Agent hostname: 948913b9caef
I0506 03:44:57.990533 24856 status_update_manager.cpp:177] Pausing sending status updates
I0506 03:44:57.991174 24866 state.cpp:62] Recovering state from '/tmp/Endpoint_SlaveEndpointTest_NoAuthorizer_2_OYl0HW/meta'
I0506 03:44:57.991336 24866 status_update_manager.cpp:203] Recovering status update manager
I0506 03:44:57.991400 24866 containerizer.cpp:600] Recovering containerizer
I0506 03:44:57.992103 24866 provisioner.cpp:410] Provisioner recovery complete
I0506 03:44:57.992240 24866 slave.cpp:5550] Finished recovery
I0506 03:44:57.992890 24866 slave.cpp:5724] Querying resource estimator for oversubscribable
resources
I0506 03:44:57.993037 24860 slave.cpp:5738] Received oversubscribable resources {} from the
resource estimator
I0506 03:44:57.993803 24863 process.cpp:3704] Handling HTTP event for process 'slave(703)'
with path: '/slave(703)/containers'
I0506 03:44:57.994228 24855 http.cpp:871] Authorizing principal 'test-principal' to GET the
'/containers' endpoint
I0506 03:44:57.995776 24868 slave.cpp:803] Agent terminating
[       OK ] Endpoint/SlaveEndpointTest.NoAuthorizer/2 (14 ms)
[----------] 9 tests from Endpoint/SlaveEndpointTest (140 ms total)

[----------] Global test environment tear-down
[==========] 1448 tests from 160 test cases ran. (189871 ms total)
[  PASSED  ] 1447 tests.
[  FAILED  ] 1 test, listed below:
[  FAILED  ] FaultToleranceTest.FrameworkReregister

 1 FAILED TEST
  YOU HAVE 11 DISABLED TESTS

make[3]: *** [CMakeFiles/check] Error 1
make[3]: Leaving directory `/mesos/build'
make[2]: *** [CMakeFiles/check.dir/all] Error 2
make[2]: Leaving directory `/mesos/build'
make[1]: *** [CMakeFiles/check.dir/rule] Error 2
make[1]: Leaving directory `/mesos/build'
make: *** [check] Error 2
+ docker rmi mesos-1494039958-30714
Untagged: mesos-1494039958-30714:latest
Deleted: sha256:aedd771a3817eeca4a060834d9b9001f7d8f7f7dd3d638eaa28986d1b08a653f
Deleted: sha256:f95d2a219a35450a7755306f02f116159b741908e5cbe32d3349953b7d0a5129
Deleted: sha256:4f1b10d00d18af859fae35d956e744bb9be3f605143833884a3e3e3639b8cfb9
Deleted: sha256:0ea5abbbc961302e22e5f2e93268858997e1b547bd69b9fb1dc30d55d8313f1b
Deleted: sha256:a78d5b67803f61c17949eae4966fcc676c0b048f0b5094cf8a691c8687c5fc96
Deleted: sha256:b5bc2afef444c3de32e7515fd408c81e22e7e64405a914ed10bd71b9f30788ff
Deleted: sha256:51c1c65209798a853a745ed6616dae8391682d5a9d349302b41bd2a92334f4a8
Deleted: sha256:43f73bbdd631eb1997c4eba1e57f609a98c976141a5c8091b0ce8fa1d075ccc3
Deleted: sha256:714089009b09822ea25bc1f3116c696d1e0053103055c22eb65110e4d2a3055b
Deleted: sha256:8512fcdc5696fee9ed5d8e0542d81ae0406d4f3fa63c6e2120d08d3279858f18
Deleted: sha256:1f536aa0d09a3a502ca761ceea1b8b5da7d6e270aef9ad486dfae400b49c3e1c
Deleted: sha256:995603da81c96717cf3e47ee67bb8d0e5989f12a8f4aeb34fef29f858e915db5
Deleted: sha256:5f4a6c74d4e989379311d18745eca2d9aea8d05a4b6a5e43ea8637b7f40a37fd
Deleted: sha256:5b0b216a38ed4e98aa72d65937d83ab740ba6cf08ae0a4c35da5e38ff5f78789
Deleted: sha256:90a12ada462060fd53062d12a26341e36ac98899511a611d92af78b591e49dcd
Deleted: sha256:84445fdbdead1b48d6c0bd860c6275662d0727bf13fe549d35d0ed12de716ecc
Deleted: sha256:478995fe1af6956771db8a73717a5906d05ff343979971cfda09c8fda95c349c
Deleted: sha256:77b54a07ea5274f4c2e3c25494ff6296099ed022e7dd19b9a33e178dfcb5b46e
Deleted: sha256:2eab143ba7dd8e88e52add2ffeb6a33e050f2437acabd251fb36ed6ccba75e54
Deleted: sha256:9e9a22748d48a2933fecf237d79514f778a39d745d2be8f5ffadf3fb52b9b9f0
Deleted: sha256:4be6752425aa4b069706b0b8856c9a08da866299456ce77eabbb746204e0b16e
Deleted: sha256:b62a67cb895af44ad42dbe262f26108a67e0b2c07457142a1eddbf48b0c7fe1a
Deleted: sha256:8edbe76b2f7900a1291e960c7fc3d980e924c8369bdcaa9e832cfe1e6f48fc5d
Deleted: sha256:203afe911583a6becdffc8fef82416ba0383856d573838e0a5d40cebf16aa59f
Build step 'Execute shell' marked build as failure

Mime
View raw message